{"text_format":"1","workbook":"xlsx","n_sheets":13,"sheets":["General data ESEF","ESEF hypertags","General data DKGAAP","DKGAAP hypertags","General data DKIFRS","DKIFRS hypertags","Income Statement","Comprehensive income","Balance Sheet","Changes In Equity","Cash Flow","Notes DKGAAP","General Data_REPORT"],"not_rendered":{"charts":0,"images":0,"macros":1,"external_links":0,"defined_names":544,"comments":2,"pivot_tables":0},"unopened":[],"bounds":{"document_bytes":16777216,"sheet_cells":100000,"rows_first":2000,"rows_last":500,"rows_between":2000,"halvings":0,"cell_chars":16384,"cell_head_chars":4096},"cells_cut":0,"cells_raw":0,"read":"whole","date_system":"1900"}

{"sheet":"General data ESEF","index":0,"n_rows":116,"n_cols":80,"rows_kept":116,"cut":false,"hidden":false,"merged":[[67,1,67,4],[56,1,56,4],[10,1,10,4],[54,1,54,4],[53,1,53,4],[35,1,35,4],[66,1,66,4],[57,1,57,4],[61,1,61,4],[64,1,64,4],[65,1,65,4],[58,1,58,4],[59,1,59,4],[60,1,60,4],[27,1,27,4],[62,1,62,4],[63,1,63,4],[49,1,49,4],[51,1,51,4],[50,1,50,4],[52,1,52,4],[55,1,55,4],[16,1,16,4],[17,1,17,4],[18,1,18,4],[19,1,19,4],[38,1,38,4],[25,1,25,4],[26,1,26,4],[36,1,36,4],[37,1,37,4],[30,1,30,2],[31,1,31,4],[28,1,28,4],[30,3,30,4],[20,1,20,4],[21,1,21,4],[22,1,22,4],[15,1,15,4],[13,1,13,4],[2,1,2,4],[3,1,3,4],[4,1,4,4],[8,1,8,4],[11,1,11,4],[12,1,12,4],[9,1,9,4],[23,1,23,4],[24,1,24,4],[46,1,46,4],[40,1,40,4],[41,1,41,4],[42,1,42,4],[43,1,43,4],[44,1,44,4],[45,1,45,4],[39,1,39,4],[32,1,32,4],[33,1,33,4],[34,1,34,4]]}
[null,null,null,null,null,"Range name","Defaults x4 columns",null,null,null,"Adjusted values x4 columns",null,{"$f":"IFERROR(MATCH(PP_LabelLanguage,PP_Languages,0),1)","v":1},{"$f":"IF(ISBLANK(INDEX(PP_Locale,2,M1)),1,M1)","v":1},"Current","EN","BG","CS","DA","DE","EL","ES","ET","FI","FR","HR","HU","IT","LT","LV","MT","NL","NO","PL","PT","RO","SK","SL","SV",{"$f":"IFERROR(MATCH(PP_CountryCode,PP_Countries,0),1)","v":1},"EU","AT","BE","BG","CH","CY","CZ","DE","DK","EE","EL","ES","FI","FR","GR","HR","HU","IE","IS","IT","LI","LT","LU","LV","MT","NL","NO","PL","PT","RO","SE","SI","SK","UK","Validation lists"]
[{"$f":"\"\"&INDEX(PP_Locale,ROW(),PP_LanguageIndex)&\" 1.3.6\"","v":"ParsePort ESEF general data, version 1.3.6"},null,null,null,null,null,null,null,null,null,null,null,null,null,{"$f":"\"\"&IF(ISBLANK(INDEX(PP_Locale,ROW(),PP_LanguageIndex)),INDEX(PP_Locale,ROW(),1),INDEX(PP_Locale,ROW(),PP_LanguageIndex))","v":"ParsePort ESEF general data, version"},"ParsePort ESEF general data, version",null,null,"ParsePort ESEF stamdata, version","ParsePort ESEF allgemeine daten, ausführung",null,"ParsePort ESEF informacion general, versión",null,null,"Informations générales ESEF ParsePort, version",null,null,"ParsePort ESEF dati generali, versione",null,null,null,null,null,"ParsePort ESEF ogólne dane, wersja",null,null,null,null,null,null,null,null,null,null,null,null,null,null,null,null,null,null,null,null,null,null,null,null,null,null,null,null,null,null,null,null,null,null,null,null,null,null,null,null,null,null,null,null,"Hypertag properties","Hypertag:"]
[null,{"$f":"\"\"&INDEX(PP_Locale,ROW(),PP_LanguageIndex)","v":"MANDATORY FIELD"},null,null,null,null,null,null,null,null,null,null,null,null,{"$f":"\"\"&IF(ISBLANK(INDEX(PP_Locale,ROW(),PP_LanguageIndex)),INDEX(PP_Locale,ROW(),1),INDEX(PP_Locale,ROW(),PP_LanguageIndex))","v":"MANDATORY FIELD"},"MANDATORY FIELD",null,null,"OBLIGATORISK FELT","PFLICHTFELD",null,"CAMPO OBLIGATORIO",null,null,"CHAMP OBLIGATOIRE",null,null,"CAMPO OBBLIGATORIO",null,null,null,null,null,"POLE OBOWIĄZKOWE"]
[null,{"$f":"\"\"&INDEX(PP_Locale,ROW(),PP_LanguageIndex)","v":"AUTOMATIC FIELD (can be overruled)"},null,null,null,null,null,null,null,null,null,null,null,null,{"$f":"\"\"&IF(ISBLANK(INDEX(PP_Locale,ROW(),PP_LanguageIndex)),INDEX(PP_Locale,ROW(),1),INDEX(PP_Locale,ROW(),PP_LanguageIndex))","v":"AUTOMATIC FIELD (can be overruled)"},"AUTOMATIC FIELD (can be overruled)",null,null,"AUTOMATISK FELT (kan overstyres)","AUTOMATISCHES FELD (kann gesetzt werden)",null,"CAMPO AUTOMÁTICO (se puede cancelar)",null,null,"CHAMP AUTOMATIQUE (peut être annulé)",null,null,"CAMPO AUTOMATICO (può essere annullato)",null,null,null,null,null,"POLE AUTOMATYCZNE (można zmienić)"]
[null,{"$f":"\"\"&INDEX(PP_Locale,ROW(),PP_LanguageIndex)","v":"FILL OUT IF INFORMATION IS PRESENT IN REPORT"},null,null,null,null,null,null,null,null,null,null,null,null,{"$f":"\"\"&IF(ISBLANK(INDEX(PP_Locale,ROW(),PP_LanguageIndex)),INDEX(PP_Locale,ROW(),1),INDEX(PP_Locale,ROW(),PP_LanguageIndex))","v":"FILL OUT IF INFORMATION IS PRESENT IN REPORT"},"FILL OUT IF INFORMATION IS PRESENT IN REPORT",null,null,"UDFYLDES HVIS INFORMATIONEN FINDES I RAPPORTEN","AUSFÜLLEN, WENN INFORMATIONEN IM BERICHT SIND",null,"LLENE SI HAY INFORMACIÓN EN EL INFORME",null,null,"REMPLIR SI L'INFORMATION EST DANS LE RAPPORT",null,null,"COMPILA SE LE INFORMAZIONI SONO NEL REPORT",null,null,null,null,null,"WYPEŁNIJ, JEŚLI INFORMACJE ZNAJDUJĄ SIĘ W RAPORTIE"]
[null,null,null,null,null,null,null,null,null,null,null,null,null,null,{"$f":"\"\"&IF(ISBLANK(INDEX(PP_Locale,ROW(),PP_LanguageIndex)),INDEX(PP_Locale,ROW(),1),INDEX(PP_Locale,ROW(),PP_LanguageIndex))","v":""}]
[null,{"$f":"IFERROR(VLOOKUP(\"Period\",PP_Locale,PP_LanguageIndex,FALSE),\"Period\")&\" 1\"&IF(PP_Consolidated,\" \"&IFERROR(VLOOKUP(\"Group\",PP_Locale,PP_LanguageIndex,FALSE),\"Group\"),\"\")","v":"Period 1 Group"},{"$f":"IFERROR(VLOOKUP(\"Period\",PP_Locale,PP_LanguageIndex,FALSE),\"Period\")&\" 2\"&IF(PP_Consolidated,\" \"&IFERROR(VLOOKUP(\"Group\",PP_Locale,PP_LanguageIndex,FALSE),\"Group\"),\"\")","v":"Period 2 Group"},{"$f":"IF(PP_Consolidated,IFERROR(VLOOKUP(\"Period\",PP_Locale,PP_LanguageIndex,FALSE),\"Period\")&\" 1 \"&IFERROR(VLOOKUP(\"Parent\",PP_Locale,PP_LanguageIndex,FALSE),\"Parent\"),\"\")","v":"Period 1 Parent"},{"$f":"IF(PP_Consolidated,IFERROR(VLOOKUP(\"Period\",PP_Locale,PP_LanguageIndex,FALSE),\"Period\")&\" 2 \"&IFERROR(VLOOKUP(\"Parent\",PP_Locale,PP_LanguageIndex,FALSE),\"Parent\"),\"\")","v":"Period 2 Parent"},null,{"$f":"IFERROR(VLOOKUP(\"Period\",PP_Locale,PP_LanguageIndex,FALSE),\"Period\")&\" 1\"&IF(PP_Consolidated,\" \"&IFERROR(VLOOKUP(\"Group\",PP_Locale,PP_LanguageIndex,FALSE),\"Group\"),\"\")","v":"Period 1 Group"},{"$f":"IFERROR(VLOOKUP(\"Period\",PP_Locale,PP_LanguageIndex,FALSE),\"Period\")&\" 2\"&IF(PP_Consolidated,\" \"&IFERROR(VLOOKUP(\"Group\",PP_Locale,PP_LanguageIndex,FALSE),\"Group\"),\"\")","v":"Period 2 Group"},{"$f":"IF(PP_Consolidated,IFERROR(VLOOKUP(\"Period\",PP_Locale,PP_LanguageIndex,FALSE),\"Period\")&\" 1 \"&IFERROR(VLOOKUP(\"Parent\",PP_Locale,PP_LanguageIndex,FALSE),\"Parent\"),\"\")","v":"Period 1 Parent"},{"$f":"IF(PP_Consolidated,IFERROR(VLOOKUP(\"Period\",PP_Locale,PP_LanguageIndex,FALSE),\"Period\")&\" 2 \"&IFERROR(VLOOKUP(\"Parent\",PP_Locale,PP_LanguageIndex,FALSE),\"Parent\"),\"\")","v":"Period 2 Parent"},{"$f":"B7","v":"Period 1 Group"},{"$f":"C7","v":"Period 2 Group"},"Period 1 Parent","Period 2 Parent",{"$f":"\"\"&IF(ISBLANK(INDEX(PP_Locale,ROW(),PP_LanguageIndex)),INDEX(PP_Locale,ROW(),1),INDEX(PP_Locale,ROW(),PP_LanguageIndex))","v":""}]
[{"$f":"\"\"&INDEX(PP_Locale,ROW(),PP_LanguageIndex)","v":"General:"},null,null,null,null,null,null,null,null,null,null,null,null,null,{"$f":"\"\"&IF(ISBLANK(INDEX(PP_Locale,ROW(),PP_LanguageIndex)),INDEX(PP_Locale,ROW(),1),INDEX(PP_Locale,ROW(),PP_LanguageIndex))","v":"General:"},"General:",null,null,"Generelt:","Allgemeines:",null,"General:",null,null,"Générales:",null,null,"Generali:",null,null,null,null,null,"Ogólne:",null,null,null,null,null,null,null,null,null,null,null,null,null,null,null,null,null,null,null,null,null,null,null,null,null,null,null,null,null,null,null,null,null,null,null,null,null,null,null,null,{"$f":"SUBSTITUTE(\"/General data(headers=\"&CELL(\"address\",$K$7)&\":\"&CELL(\"address\",$N$7)&\"[language=\"&LOWER(INDEX(PP_Languages,0,PP_LanguageIndex))&\"],labels=\"&CELL(\"address\",A8)&\":\"&CELL(\"address\",A69)&\"[language=\"&LOWER(INDEX(PP_Languages,0,PP_LanguageIndex))&\"],values=\"&CELL(\"address\",K8)&\":\"&CELL(\"address\",N69)&\"[language=\"&LOWER(PP_Language)&\"])\",\"$\",\"\")","v":"/General data(headers=K7:N7[language=en],labels=A8:A69[language=en],values=K8:N69[language=en])"}]
[{"$f":"\"\"&INDEX(PP_Locale,ROW(),PP_LanguageIndex)","v":"Report language code"},"EN",null,null,null,"PP_Language","EN",null,null,null,null,null,null,null,{"$f":"\"\"&IF(ISBLANK(INDEX(PP_Locale,ROW(),PP_LanguageIndex)),INDEX(PP_Locale,ROW(),1),INDEX(PP_Locale,ROW(),PP_LanguageIndex))","v":"Report language code"},"Report language code",null,null,"Rapport sprogkode","Bericht Sprachcode",null,"Código de lenguaje",null,null,"Code de langue",null,null,"Codice lingua",null,null,null,null,null,"Kod języka"]
[{"$f":"\"\"&INDEX(PP_Locale,ROW(),PP_LanguageIndex)","v":"Label language code"},{"$f":"PP_Language","v":"EN"},null,null,null,"PP_LabelLanguage",{"$f":"PP_Language","v":"EN"},null,null,null,null,null,null,null,{"$f":"\"\"&IF(ISBLANK(INDEX(PP_Locale,ROW(),PP_LanguageIndex)),INDEX(PP_Locale,ROW(),1),INDEX(PP_Locale,ROW(),PP_LanguageIndex))","v":"Label language code"},"Label language code",null,null,"Label sprogkode","Tag-Sprachcode",null,"Código de lenguaje de la etiqueta",null,null,"Code de langue de l'étiquette",null,null,"Codice lingua etichetta",null,null,null,null,null,"Kod języka etykiety"]
[{"$f":"\"\"&INDEX(PP_Locale,ROW(),PP_LanguageIndex)","v":"Country code"},"EU",null,null,null,"PP_CountryCode","EU",null,null,null,null,null,null,null,{"$f":"\"\"&IF(ISBLANK(INDEX(PP_Locale,ROW(),PP_LanguageIndex)),INDEX(PP_Locale,ROW(),1),INDEX(PP_Locale,ROW(),PP_LanguageIndex))","v":"Country code"},"Country code",null,null,"Landekode","Landesvorwahl",null,"Código de país",null,null,"Code postal",null,null,"Prefisso internazionale",null,null,null,null,null,"Kod pocztowy"]
[{"$f":"\"\"&INDEX(PP_Locale,ROW(),PP_LanguageIndex)","v":"Currency code"},{"$f":"IFERROR(VLOOKUP(\"EUR\",PP_Locale,PP_LanguageIndex,FALSE),\"EUR\")","v":"EUR"},null,null,null,"PP_Currency",{"$f":"IFERROR(VLOOKUP(\"EUR\",PP_Locale,PP_LanguageIndex,FALSE),\"EUR\")","v":"EUR"},null,null,null,{"$f":"\"\"&UPPER(B12)","v":"EUR"},null,null,null,{"$f":"\"\"&IF(ISBLANK(INDEX(PP_Locale,ROW(),PP_LanguageIndex)),INDEX(PP_Locale,ROW(),1),INDEX(PP_Locale,ROW(),PP_LanguageIndex))","v":"Currency code"},"Currency code",null,null,"Valutakode","Währungscode",null,"Código de moneda",null,null,"Code devise",null,null,"Codice valuta",null,null,null,null,null,"Kod waluty"]
[{"$f":"\"\"&INDEX(PP_Locale,ROW(),PP_LanguageIndex)","v":"Scale"},6,null,null,null,"PP_MonetaryScaling",6,null,null,null,null,null,null,null,{"$f":"\"\"&IF(ISBLANK(INDEX(PP_Locale,ROW(),PP_LanguageIndex)),INDEX(PP_Locale,ROW(),1),INDEX(PP_Locale,ROW(),PP_LanguageIndex))","v":"Scale"},"Scale",null,null,"Skalering","Skalierung",null,"Redondeo",null,null,"Mise à l'échelle",null,null,"Ridimensionamento",null,null,null,null,null,"Skalowanie",null,null,null,null,null,null,null,null,null,null,null,null,null,null,null,null,null,null,null,null,null,null,null,null,null,null,null,null,null,null,null,null,null,null,null,null,null,null,null,null,0,3,6,9]
[{"$f":"\"\"&INDEX(PP_Locale,ROW(),PP_LanguageIndex)","v":"Consolidated"},true,null,null,null,"PP_Consolidated",true,null,null,null,null,null,null,null,{"$f":"\"\"&IF(ISBLANK(INDEX(PP_Locale,ROW(),PP_LanguageIndex)),INDEX(PP_Locale,ROW(),1),INDEX(PP_Locale,ROW(),PP_LanguageIndex))","v":"Consolidated"},"Consolidated",null,null,"Koncern","Konsolidiert",null,"Consolidada",null,null,"Consolidée",null,null,"Consolidata",null,null,null,null,null,"Skonsolidowany",null,null,null,null,null,null,null,null,null,null,null,null,null,null,null,null,null,null,null,null,null,null,null,null,null,null,null,null,null,null,null,null,null,null,null,null,null,null,null,null,true,false]
[null,null,null,null,null,null,null,null,null,null,null,null,null,null,{"$f":"\"\"&IF(ISBLANK(INDEX(PP_Locale,ROW(),PP_LanguageIndex)),INDEX(PP_Locale,ROW(),1),INDEX(PP_Locale,ROW(),PP_LanguageIndex))","v":""}]
[{"$f":"\"\"&INDEX(PP_Locale,ROW(),PP_LanguageIndex)","v":"Homepage of reporting entity"},"www.customerdomain.com",null,null,null,"PP_HomepageOfReportingEntity","www.customerdomain.com",null,null,null,null,null,null,null,{"$f":"\"\"&IF(ISBLANK(INDEX(PP_Locale,ROW(),PP_LanguageIndex)),INDEX(PP_Locale,ROW(),1),INDEX(PP_Locale,ROW(),PP_LanguageIndex))","v":"Homepage of reporting entity"},"Homepage of reporting entity",null,null,"Hjemmeside for regnskabsaflæggende virksomhed","Homepage des berichtenden Unternehmens",null,"Página de inicio de la entidad que informa",null,null,"Page d'accueil de l’entité présentant les états financiers",null,null,"Homepage dell'entità che redige il bilancio",null,null,null,null,null,"Strona domowa podmiotu zgłaszającego"]
[{"$f":"\"\"&INDEX(PP_Locale,ROW(),PP_LanguageIndex)","v":"LEI code of reporting entity"},"12345NOTVALID1234503",null,null,null,"PP_IdentificationOfReportingEntity","12345NOTVALID1234503",null,null,null,{"$f":"\"\"&SUBSTITUTE(B17,\" \",\"\")","v":"12345NOTVALID1234503"},null,null,null,{"$f":"\"\"&IF(ISBLANK(INDEX(PP_Locale,ROW(),PP_LanguageIndex)),INDEX(PP_Locale,ROW(),1),INDEX(PP_Locale,ROW(),PP_LanguageIndex))","v":"LEI code of reporting entity"},"LEI code of reporting entity",null,null,"LEI-kode for regnskabsaflæggende virksomhed","LEI-Code des Unternehmens",null,"Código LEI de la entidad",null,null,"Code LEI de l’entité",null,null,"Codice LEI dell'entità",null,null,null,null,null,"Kod LEI podmiotu zgłaszającego"]
[{"$f":"\"\"&INDEX(PP_Locale,ROW(),PP_LanguageIndex)","v":"Name of reporting entity or other means of identification"},{"$f":"IFERROR(VLOOKUP(\"Test customer\",PP_Locale,PP_LanguageIndex,FALSE),\"Test customer\")","v":"Test customer"},null,null,null,"PP_NameOfReportingEntity",{"$f":"IFERROR(VLOOKUP(\"Test customer\",PP_Locale,PP_LanguageIndex,FALSE),\"Test customer\")","v":"Test customer"},null,null,null,{"$f":"\"\"&B18","v":"Test customer"},null,null,null,{"$f":"\"\"&IF(ISBLANK(INDEX(PP_Locale,ROW(),PP_LanguageIndex)),INDEX(PP_Locale,ROW(),1),INDEX(PP_Locale,ROW(),PP_LanguageIndex))","v":"Name of reporting entity or other means of identification"},"Name of reporting entity or other means of identification",null,null,"Navn på regnskabsaflæggende virksomhed eller anden form for identifikation","Name des berichtenden Unternehmens oder andere Mittel der Identifizierung",null,"Nombre de la entidad que informa u otras formas de identificación",null,null,"Nom ou tout autre mode d’identification de l’entité présentant les états financiers",null,null,"Denominazione dell'entità che redige il bilancio o altro mezzo di identificazione",null,null,null,null,null,"Nazwa jednostki sprawozdawczej lub inne dane identyfikacyjne",null,null,null,null,null,null,null,null,null,null,null,null,null,null,null,null,null,null,null,null,null,null,null,null,null,null,null,null,null,null,null,null,null,null,null,null,null,null,null,null,null,null,null,null,"&allowhtml=false&allowunicode=false&merge=true",{"$f":"\"pp://General Data/\"&INDEX(PP_Locale,ROW(),1)&\"?taxonomy=\"&PP_TaxonomyId&\"&labellanguage=en&period=1\"&CA18","v":"pp://General Data/Name of reporting entity or other means of identification?taxonomy=ESEF&labellanguage=en&period=1&allowhtml=false&allowunicode=false&merge=true"}]
[{"$f":"\"\"&INDEX(PP_Locale,ROW(),PP_LanguageIndex)","v":"Domicile of entity"},null,null,null,null,"PP_DomicileOfEntity",null,null,null,null,"",null,null,null,{"$f":"\"\"&IF(ISBLANK(INDEX(PP_Locale,ROW(),PP_LanguageIndex)),INDEX(PP_Locale,ROW(),1),INDEX(PP_Locale,ROW(),PP_LanguageIndex))","v":"Domicile of entity"},"Domicile of entity",null,null,"Virksomhedens domicil","Sitz des Unternehmens",null,"Domicilio de la entidad",null,null,"Adresse de l’entité",null,null,"Sede dell'entità",null,null,null,null,null,"Siedziba jednostki",null,null,null,null,null,null,null,null,null,null,null,null,null,null,null,null,null,null,null,null,null,null,null,null,null,null,null,null,null,null,null,null,null,null,null,null,null,null,null,null,null,null,null,null,"&allowhtml=false&allowunicode=false&merge=true",{"$f":"\"pp://General Data/\"&INDEX(PP_Locale,ROW(),1)&\"?taxonomy=\"&PP_TaxonomyId&\"&labellanguage=en&period=1\"&CA19","v":"pp://General Data/Domicile of entity?taxonomy=ESEF&labellanguage=en&period=1&allowhtml=false&allowunicode=false&merge=true"}]
[{"$f":"\"\"&INDEX(PP_Locale,ROW(),PP_LanguageIndex)","v":"Legal form of entity"},null,null,null,null,"PP_LegalFormOfEntity",null,null,null,null,"",null,null,null,{"$f":"\"\"&IF(ISBLANK(INDEX(PP_Locale,ROW(),PP_LanguageIndex)),INDEX(PP_Locale,ROW(),1),INDEX(PP_Locale,ROW(),PP_LanguageIndex))","v":"Legal form of entity"},"Legal form of entity",null,null,"Virksomhedens juridiske form","Rechtsform des Unternehmens",null,"Forma jurídica de la entidad",null,null,"Forme juridique de l’entité",null,null,"Forma giuridica dell'entità",null,null,null,null,null,"Forma prawna jednostki",null,null,null,null,null,null,null,null,null,null,null,null,null,null,null,null,null,null,null,null,null,null,null,null,null,null,null,null,null,null,null,null,null,null,null,null,null,null,null,null,null,null,null,null,"&allowhtml=false&allowunicode=false&merge=true",{"$f":"\"pp://General Data/\"&INDEX(PP_Locale,ROW(),1)&\"?taxonomy=\"&PP_TaxonomyId&\"&labellanguage=en&period=1\"&CA20","v":"pp://General Data/Legal form of entity?taxonomy=ESEF&labellanguage=en&period=1&allowhtml=false&allowunicode=false&merge=true"}]
[{"$f":"\"\"&INDEX(PP_Locale,ROW(),PP_LanguageIndex)","v":"Country of incorporation"},null,null,null,null,"PP_CountryOfIncorporation",null,null,null,null,"",null,null,null,{"$f":"\"\"&IF(ISBLANK(INDEX(PP_Locale,ROW(),PP_LanguageIndex)),INDEX(PP_Locale,ROW(),1),INDEX(PP_Locale,ROW(),PP_LanguageIndex))","v":"Country of incorporation"},"Country of incorporation",null,null,"Indregistreringsland","Land, in dem das Unternehmen als juristische Person registriert ist",null,"País de constitución",null,null,"Pays de constitution",null,null,"Paese di registrazione",null,null,null,null,null,"Państwo rejestracji",null,null,null,null,null,null,null,null,null,null,null,null,null,null,null,null,null,null,null,null,null,null,null,null,null,null,null,null,null,null,null,null,null,null,null,null,null,null,null,null,null,null,null,null,"&allowhtml=false&allowunicode=false&merge=true",{"$f":"\"pp://General Data/\"&INDEX(PP_Locale,ROW(),1)&\"?taxonomy=\"&PP_TaxonomyId&\"&labellanguage=en&period=1\"&CA21","v":"pp://General Data/Country of incorporation?taxonomy=ESEF&labellanguage=en&period=1&allowhtml=false&allowunicode=false&merge=true"}]
[{"$f":"\"\"&INDEX(PP_Locale,ROW(),PP_LanguageIndex)","v":"Address of entity's registered office"},null,null,null,null,"PP_AddressOfEntitysRegisteredOffice",null,null,null,null,"",null,null,null,{"$f":"\"\"&IF(ISBLANK(INDEX(PP_Locale,ROW(),PP_LanguageIndex)),INDEX(PP_Locale,ROW(),1),INDEX(PP_Locale,ROW(),PP_LanguageIndex))","v":"Address of entity's registered office"},"Address of entity's registered office",null,null,"Virksomhedens hjemsted","Anschrift des eingetragenen Geschäftssitzes",null,"Dirección de la sede social de la entidad",null,null,"Adresse du siège social de l’entité",null,null,"Indirizzo della sede legale dell'entità",null,null,null,null,null,"Adres zarejestrowanego biura jednostki",null,null,null,null,null,null,null,null,null,null,null,null,null,null,null,null,null,null,null,null,null,null,null,null,null,null,null,null,null,null,null,null,null,null,null,null,null,null,null,null,null,null,null,null,"&allowhtml=false&allowunicode=false&merge=true",{"$f":"\"pp://General Data/\"&INDEX(PP_Locale,ROW(),1)&\"?taxonomy=\"&PP_TaxonomyId&\"&labellanguage=en&period=1\"&CA22","v":"pp://General Data/Address of entity's registered office?taxonomy=ESEF&labellanguage=en&period=1&allowhtml=false&allowunicode=false&merge=true"}]
[{"$f":"\"\"&INDEX(PP_Locale,ROW(),PP_LanguageIndex)","v":"Principal place of business"},null,null,null,null,"PP_PrincipalPlaceOfBusiness",null,null,null,null,"",null,null,null,{"$f":"\"\"&IF(ISBLANK(INDEX(PP_Locale,ROW(),PP_LanguageIndex)),INDEX(PP_Locale,ROW(),1),INDEX(PP_Locale,ROW(),PP_LanguageIndex))","v":"Principal place of business"},"Principal place of business",null,null,"Hovedforretningssted","Hauptsitz der Geschäftstätigkeit",null,"Centro principal de actividad",null,null,"Établissement principal",null,null,"Principale luogo di attività",null,null,null,null,null,"Podstawowe miejsce prowadzenia działalności gospodarczej",null,null,null,null,null,null,null,null,null,null,null,null,null,null,null,null,null,null,null,null,null,null,null,null,null,null,null,null,null,null,null,null,null,null,null,null,null,null,null,null,null,null,null,null,"&allowhtml=false&allowunicode=false&merge=true",{"$f":"\"pp://General Data/\"&INDEX(PP_Locale,ROW(),1)&\"?taxonomy=\"&PP_TaxonomyId&\"&labellanguage=en&period=1\"&CA23","v":"pp://General Data/Principal place of business?taxonomy=ESEF&labellanguage=en&period=1&allowhtml=false&allowunicode=false&merge=true"}]
[{"$f":"\"\"&INDEX(PP_Locale,ROW(),PP_LanguageIndex)","v":"Description of nature of entity's operations and principal activities"},null,null,null,null,"PP_DescriptionOfNatureOfEntitysOperationsAndPrincipalActivities",null,null,null,null,"",null,null,null,{"$f":"\"\"&IF(ISBLANK(INDEX(PP_Locale,ROW(),PP_LanguageIndex)),INDEX(PP_Locale,ROW(),1),INDEX(PP_Locale,ROW(),PP_LanguageIndex))","v":"Description of nature of entity's operations and principal activities"},"Description of nature of entity's operations and principal activities",null,null,"Beskrivelse af virksomhedens drift og primære aktiviteter","Beschreibung der Art der Geschäftstätigkeit des Unternehmens und seiner Haupttätigkeiten",null,"Descripción de la naturaleza de las operaciones de la entidad y de sus actividades principales",null,null,"Description de la nature des opérations de l’entité et de ses principales activités",null,null,"Descrizione della natura dell'attività dell'entità e delle sue principali operazioni",null,null,null,null,null,"Opis charakteru oraz podstawowego zakresu działalności jednostki",null,null,null,null,null,null,null,null,null,null,null,null,null,null,null,null,null,null,null,null,null,null,null,null,null,null,null,null,null,null,null,null,null,null,null,null,null,null,null,null,null,null,null,null,"&allowhtml=false&allowunicode=false&merge=true",{"$f":"\"pp://General Data/\"&INDEX(PP_Locale,ROW(),1)&\"?taxonomy=\"&PP_TaxonomyId&\"&labellanguage=en&period=1\"&CA24","v":"pp://General Data/Description of nature of entity's operations and principal activities?taxonomy=ESEF&labellanguage=en&period=1&allowhtml=false&allowunicode=false&merge=true"}]
[{"$f":"\"\"&INDEX(PP_Locale,ROW(),PP_LanguageIndex)","v":"Name of parent entity"},null,null,null,null,"PP_NameOfParentEntity",null,null,null,null,"",null,null,null,{"$f":"\"\"&IF(ISBLANK(INDEX(PP_Locale,ROW(),PP_LanguageIndex)),INDEX(PP_Locale,ROW(),1),INDEX(PP_Locale,ROW(),PP_LanguageIndex))","v":"Name of parent entity"},"Name of parent entity",null,null,"Modervirksomhedens navn","Name des Mutterunternehmens",null,"Nombre de la dominante",null,null,"Nom de l’entité mère",null,null,"Ragione sociale dell'entità controllante",null,null,null,null,null,"Nazwa jednostki dominującej",null,null,null,null,null,null,null,null,null,null,null,null,null,null,null,null,null,null,null,null,null,null,null,null,null,null,null,null,null,null,null,null,null,null,null,null,null,null,null,null,null,null,null,null,"&allowhtml=false&allowunicode=false&merge=true",{"$f":"\"pp://General Data/\"&INDEX(PP_Locale,ROW(),1)&\"?taxonomy=\"&PP_TaxonomyId&\"&labellanguage=en&period=1\"&CA25","v":"pp://General Data/Name of parent entity?taxonomy=ESEF&labellanguage=en&period=1&allowhtml=false&allowunicode=false&merge=true"}]
[{"$f":"\"\"&INDEX(PP_Locale,ROW(),PP_LanguageIndex)","v":"Name of ultimate parent of group"},null,null,null,null,"PP_NameOfUltimateParentOfGroup",null,null,null,null,"",null,null,null,{"$f":"\"\"&IF(ISBLANK(INDEX(PP_Locale,ROW(),PP_LanguageIndex)),INDEX(PP_Locale,ROW(),1),INDEX(PP_Locale,ROW(),PP_LanguageIndex))","v":"Name of ultimate parent of group"},"Name of ultimate parent of group",null,null,"Navn på koncernens øverste modervirksomhed","Name des obersten Mutterunternehmens der Unternehmensgruppe",null,"Nombre de la dominante última del grupo",null,null,"Nom de la société tête de groupe",null,null,"Ragione sociale della capogruppo",null,null,null,null,null,"Nazwa jednostki dominującej najwyższego szczebla grupy",null,null,null,null,null,null,null,null,null,null,null,null,null,null,null,null,null,null,null,null,null,null,null,null,null,null,null,null,null,null,null,null,null,null,null,null,null,null,null,null,null,null,null,null,"&allowhtml=false&allowunicode=false&merge=true",{"$f":"\"pp://General Data/\"&INDEX(PP_Locale,ROW(),1)&\"?taxonomy=\"&PP_TaxonomyId&\"&labellanguage=en&period=1\"&CA26","v":"pp://General Data/Name of ultimate parent of group?taxonomy=ESEF&labellanguage=en&period=1&allowhtml=false&allowunicode=false&merge=true"}]
[{"$f":"\"\"&INDEX(PP_Locale,ROW(),PP_LanguageIndex)","v":"Explanation of change in name of reporting entity or other means of identification from end of preceding reporting period"},null,null,null,null,"PP_ExplanationOfChangeInNameOfReportingEntityOrOtherMeansOfIdentificationFromEndOfPrecedingReportingPeriod",null,null,null,null,{"$f":"\"\"&B27","v":""},null,null,null,{"$f":"\"\"&IF(ISBLANK(INDEX(PP_Locale,ROW(),PP_LanguageIndex)),INDEX(PP_Locale,ROW(),1),INDEX(PP_Locale,ROW(),PP_LanguageIndex))","v":"Explanation of change in name of reporting entity or other means of identification from end of preceding reporting period"},"Explanation of change in name of reporting entity or other means of identification from end of preceding reporting period",null,null,"Redegørelse for ændring af navn på regnskabsaflæggende virksomhed eller anden form for identifikation fra foregående regnskabsårs afslutning","Erläuterung von Änderungen des Namens des berichtenden Unternehmens oder anderer Mittel der Identifizierung gegenüber dem vorangegangenen Berichtszeitraum",null,"Explicación del cambio en el nombre de la entidad que informa u otras formas de identificación desde el final del ejercicio sobre el que se informa precedente",null,null,"Explication des modifications du nom ou de tout autre mode d’identification de l’entité présentant les états financiers intervenues depuis la fin de la période de reporting précédente",null,null,"Spiegazione dei cambiamenti relativi alla denominazione dell'entità che redige il bilancio o ad altro mezzo di identificazione dalla chiusura del periodo di riferimento precedente",null,null,null,null,null,"Wyjaśnienie zmian w nazwie jednostki sprawozdawczej lub innych danych identyfikacyjnych, które nastąpiły od zakończenia poprzedniego okresu sprawozdawczego",null,null,null,null,null,null,null,null,null,null,null,null,null,null,null,null,null,null,null,null,null,null,null,null,null,null,null,null,null,null,null,null,null,null,null,null,null,null,null,null,null,null,null,null,"&allowhtml=false&allowunicode=false&merge=true",{"$f":"\"pp://General Data/\"&INDEX(PP_Locale,ROW(),1)&\"?taxonomy=\"&PP_TaxonomyId&\"&labellanguage=en&period=1\"&CA27","v":"pp://General Data/Explanation of change in name of reporting entity or other means of identification from end of preceding reporting period?taxonomy=ESEF&labellanguage=en&period=1&allowhtml=false&allowunicode=false&merge=true"}]
[{"$f":"\"\"&INDEX(PP_Locale,ROW(),PP_LanguageIndex)","v":"Length of life of limited life entity"},null,null,null,null,"PP_LengthOfLifeOfLimitedLifeEntity",null,null,null,null,{"$f":"\"\"&B28","v":""},null,null,null,{"$f":"\"\"&IF(ISBLANK(INDEX(PP_Locale,ROW(),PP_LanguageIndex)),INDEX(PP_Locale,ROW(),1),INDEX(PP_Locale,ROW(),PP_LanguageIndex))","v":"Length of life of limited life entity"},"Length of life of limited life entity",null,null,"Levetid for tidsbegrænset virksomhed","Lebensdauer eines Unternehmens mit begrenzter Lebensdauer",null,"Duración de la vida de una entidad de vida limitada",null,null,"Durée de vie de l’entité à durée de vie limitée",null,null,"Durata dell'entità costituita a tempo determinato",null,null,null,null,null,"Długość okresu trwania jednostki o ograniczonym czasie trwania",null,null,null,null,null,null,null,null,null,null,null,null,null,null,null,null,null,null,null,null,null,null,null,null,null,null,null,null,null,null,null,null,null,null,null,null,null,null,null,null,null,null,null,null,"&allowhtml=false&allowunicode=false&merge=true",{"$f":"\"pp://General Data/\"&INDEX(PP_Locale,ROW(),1)&\"?taxonomy=\"&PP_TaxonomyId&\"&labellanguage=en&period=1\"&CA28","v":"pp://General Data/Length of life of limited life entity?taxonomy=ESEF&labellanguage=en&period=1&allowhtml=false&allowunicode=false&merge=true"}]
[{"$f":"\"\"&INDEX(PP_Locale,ROW(),PP_LanguageIndex)","v":"Period covered by financial statements"},null,null,null,null,"PP_PeriodCoveredByFinancialStatements",null,null,null,null,{"$f":"\"\"&B29","v":""},null,null,null,{"$f":"\"\"&IF(ISBLANK(INDEX(PP_Locale,ROW(),PP_LanguageIndex)),INDEX(PP_Locale,ROW(),1),INDEX(PP_Locale,ROW(),PP_LanguageIndex))","v":"Period covered by financial statements"},"Period covered by financial statements",null,null,"Periode, der dækkes af årsregnskabet","Berichtsperiode, auf die sich der Abschluss bezieht",null,"Período cubierto por los estados financieros",null,null,"Période couverte par les états financiers",null,null,"Esercizio coperto dal bilancio",null,null,null,null,null,"Okres objęty sprawozdaniem finansowym",null,null,null,null,null,null,null,null,null,null,null,null,null,null,null,null,null,null,null,null,null,null,null,null,null,null,null,null,null,null,null,null,null,null,null,null,null,null,null,null,null,null,null,null,"&allowhtml=false&allowunicode=false&merge=true",{"$f":"\"pp://General Data/\"&INDEX(PP_Locale,ROW(),1)&\"?taxonomy=\"&PP_TaxonomyId&\"&labellanguage=en&period=1\"&CA29","v":"pp://General Data/Period covered by financial statements?taxonomy=ESEF&labellanguage=en&period=1&allowhtml=false&allowunicode=false&merge=true"}]
[null,null,null,null,null,null,null,null,null,null,null,null,null,null,{"$f":"\"\"&IF(ISBLANK(INDEX(PP_Locale,ROW(),PP_LanguageIndex)),INDEX(PP_Locale,ROW(),1),INDEX(PP_Locale,ROW(),PP_LanguageIndex))","v":""}]
[{"$f":"\"\"&INDEX(PP_Locale,ROW(),PP_LanguageIndex)","v":"Dates:"},null,null,null,null,null,null,null,null,null,null,null,null,null,{"$f":"\"\"&IF(ISBLANK(INDEX(PP_Locale,ROW(),PP_LanguageIndex)),INDEX(PP_Locale,ROW(),1),INDEX(PP_Locale,ROW(),PP_LanguageIndex))","v":"Dates:"},"Dates:",null,null,"Datoer:","Termine:",null,"Fechas:",null,null,"Dates de reporting:",null,null,"Date:",null,null,null,null,null,"Daty:"]
[{"$f":"\"\"&INDEX(PP_Locale,ROW(),PP_LanguageIndex)","v":"Start date of reporting period 1"},"2020-01-01",null,null,null,"PP_StartDatePeriod1",43466,null,null,null,{"$f":"IF(COUNTBLANK(B32),\"\",TEXT(YEAR(B32),\"0000\")&\"-\"&TEXT(MONTH(B32),\"00\")&\"-\"&TEXT(DAY(B32),\"00\"))","v":"2020-01-01"},null,null,null,{"$f":"\"\"&IF(ISBLANK(INDEX(PP_Locale,ROW(),PP_LanguageIndex)),INDEX(PP_Locale,ROW(),1),INDEX(PP_Locale,ROW(),PP_LanguageIndex))","v":"Start date of reporting period 1"},"Start date of reporting period 1",null,null,"Startdato for periode 1","Startdatum des Berichtszeitraums 1",null,"Fecha de inicio del período del informe 1",null,null,"Date de début de la période de reporting 1",null,null,"Data di inizio del periodo di riferimento 1",null,null,null,null,null,"Data rozpoczęcia okresu sprawozdawczego 1"]
[{"$f":"\"\"&INDEX(PP_Locale,ROW(),PP_LanguageIndex)","v":"End date of reporting period 1"},"2020-12-31",null,null,null,"PP_EndDatePeriod1",43830,null,null,null,"2020-12-31",null,null,null,{"$f":"\"\"&IF(ISBLANK(INDEX(PP_Locale,ROW(),PP_LanguageIndex)),INDEX(PP_Locale,ROW(),1),INDEX(PP_Locale,ROW(),PP_LanguageIndex))","v":"End date of reporting period 1"},"End date of reporting period 1",null,null,"Slutdato for periode 1","Enddatum des Berichtszeitraums 1",null,"Fecha final del período del informe 1",null,null,"Date de fin de la période de reporting 1",null,null,"Data di fine del periodo di riferimento 1",null,null,null,null,null,"Data zakończenia okresu sprawozdawczego 1"]
[{"$f":"\"\"&INDEX(PP_Locale,ROW(),PP_LanguageIndex)","v":"Start date of reporting period 2"},{"$f":"DATE(YEAR(PP_StartDatePeriod1)-1,MONTH(PP_StartDatePeriod1),DAY(PP_StartDatePeriod1))","v":"2019-01-01"},null,null,null,"PP_StartDatePeriod2",{"$f":"DATE(YEAR(PP_StartDatePeriod1)-1,MONTH(PP_StartDatePeriod1),DAY(PP_StartDatePeriod1))","v":43466},null,null,null,"2019-01-01",null,null,null,{"$f":"\"\"&IF(ISBLANK(INDEX(PP_Locale,ROW(),PP_LanguageIndex)),INDEX(PP_Locale,ROW(),1),INDEX(PP_Locale,ROW(),PP_LanguageIndex))","v":"Start date of reporting period 2"},"Start date of reporting period 2",null,null,"Startdato for periode 2","Startdatum des Berichtszeitraums 2",null,"Fecha de inicio del período del informe 2",null,null,"Date de début de la période de reporting 2",null,null,"Data di inizio del periodo di riferimento 2",null,null,null,null,null,"Data rozpoczęcia okresu sprawozdawczego 2"]
[{"$f":"\"\"&INDEX(PP_Locale,ROW(),PP_LanguageIndex)","v":"End date of reporting period 2"},{"$f":"IF(COUNTBLANK(PP_StartDatePeriod2),0,PP_StartDatePeriod1-1)","v":"2019-12-31"},null,null,null,"PP_EndDatePeriod2",{"$f":"IF(COUNTBLANK(PP_StartDatePeriod2),0,PP_StartDatePeriod1-1)","v":43830},null,null,null,"2019-12-31",null,null,null,{"$f":"\"\"&IF(ISBLANK(INDEX(PP_Locale,ROW(),PP_LanguageIndex)),INDEX(PP_Locale,ROW(),1),INDEX(PP_Locale,ROW(),PP_LanguageIndex))","v":"End date of reporting period 2"},"End date of reporting period 2",null,null,"Slutdato for periode 2","Enddatum des Berichtszeitraums 2",null,"Fecha final del período del informe 2",null,null,"Date de fin de la période de reporting 2",null,null,"Data di fine del periodo di riferimento 2",null,null,null,null,null,"Data zakończenia okresu sprawozdawczego 2"]
[{"$f":"\"\"&INDEX(PP_Locale,ROW(),PP_LanguageIndex)","v":"Start date of reporting period 3"},{"$f":"DATE(YEAR(PP_StartDatePeriod1)-2,MONTH(PP_StartDatePeriod1),DAY(PP_StartDatePeriod1))","v":"2018-01-01"},null,null,null,"PP_StartDatePeriod3",{"$f":"DATE(YEAR(PP_StartDatePeriod1)-2,MONTH(PP_StartDatePeriod1),DAY(PP_StartDatePeriod1))","v":43101},null,null,null,"2018-01-01",null,null,null,{"$f":"\"\"&IF(ISBLANK(INDEX(PP_Locale,ROW(),PP_LanguageIndex)),INDEX(PP_Locale,ROW(),1),INDEX(PP_Locale,ROW(),PP_LanguageIndex))","v":"Start date of reporting period 3"},"Start date of reporting period 3",null,null,"Startdato for periode 3","Startdatum des Berichtszeitraums 3",null,"Fecha de inicio del período del informe 3",null,null,"Date de début de la période de reporting 3",null,null,"Data di inizio del periodo di riferimento 3",null,null,null,null,null,"Data rozpoczęcia okresu sprawozdawczego 3"]
[{"$f":"\"\"&INDEX(PP_Locale,ROW(),PP_LanguageIndex)","v":"End date of reporting period 3"},{"$f":"IF(COUNTBLANK(PP_StartDatePeriod3),0,PP_StartDatePeriod2-1)","v":"2018-12-31"},null,null,null,"PP_EndDatePeriod3",{"$f":"IF(COUNTBLANK(PP_StartDatePeriod3),0,PP_StartDatePeriod2-1)","v":43465},null,null,null,"2018-12-31",null,null,null,{"$f":"\"\"&IF(ISBLANK(INDEX(PP_Locale,ROW(),PP_LanguageIndex)),INDEX(PP_Locale,ROW(),1),INDEX(PP_Locale,ROW(),PP_LanguageIndex))","v":"End date of reporting period 3"},"End date of reporting period 3",null,null,"Slutdato for periode 3","Enddatum des Berichtszeitraums 3",null,"Fecha final del período del informe 3",null,null,"Date de fin de la période de reporting 3",null,null,"Data di fine del periodo di riferimento 3",null,null,null,null,null,"Data zakończenia okresu sprawozdawczego 3"]
[{"$f":"\"\"&INDEX(PP_Locale,ROW(),PP_LanguageIndex)","v":"Start date of reporting period 4"},{"$f":"DATE(YEAR(PP_StartDatePeriod1)-3,MONTH(PP_StartDatePeriod1),DAY(PP_StartDatePeriod1))","v":"2017-01-01"},null,null,null,"PP_StartDatePeriod4",{"$f":"DATE(YEAR(PP_StartDatePeriod1)-3,MONTH(PP_StartDatePeriod1),DAY(PP_StartDatePeriod1))","v":42736},null,null,null,"2017-01-01",null,null,null,{"$f":"\"\"&IF(ISBLANK(INDEX(PP_Locale,ROW(),PP_LanguageIndex)),INDEX(PP_Locale,ROW(),1),INDEX(PP_Locale,ROW(),PP_LanguageIndex))","v":"Start date of reporting period 4"},"Start date of reporting period 4",null,null,"Startdato for periode 4","Startdatum des Berichtszeitraums 4",null,"Fecha de inicio del período del informe 4",null,null,"Date de début de la période de reporting 4",null,null,"Data di inizio del periodo di riferimento 4",null,null,null,null,null,"Data rozpoczęcia okresu sprawozdawczego 4"]
[{"$f":"\"\"&INDEX(PP_Locale,ROW(),PP_LanguageIndex)","v":"End date of reporting period 4"},{"$f":"IF(COUNTBLANK(PP_StartDatePeriod4),0,PP_StartDatePeriod3-1)","v":"2017-12-31"},null,null,null,"PP_EndDatePeriod4",{"$f":"IF(COUNTBLANK(PP_StartDatePeriod4),0,PP_StartDatePeriod3-1)","v":43100},null,null,null,"2017-12-31",null,null,null,{"$f":"\"\"&IF(ISBLANK(INDEX(PP_Locale,ROW(),PP_LanguageIndex)),INDEX(PP_Locale,ROW(),1),INDEX(PP_Locale,ROW(),PP_LanguageIndex))","v":"End date of reporting period 4"},"End date of reporting period 4",null,null,"Slutdato for periode 4","Enddatum des Berichtszeitraums 4",null,"Fecha final del período del informe 4",null,null,"Date de fin de la période de reporting 4",null,null,"Data di fine del periodo di riferimento 4",null,null,null,null,null,"Data zakończenia okresu sprawozdawczego 4"]
[{"$f":"\"\"&INDEX(PP_Locale,ROW(),PP_LanguageIndex)","v":"Start date of reporting period 5"},{"$f":"DATE(YEAR(PP_StartDatePeriod1)-4,MONTH(PP_StartDatePeriod1),DAY(PP_StartDatePeriod1))","v":"2016-01-01"},null,null,null,"PP_StartDatePeriod5",{"$f":"DATE(YEAR(PP_StartDatePeriod1)-4,MONTH(PP_StartDatePeriod1),DAY(PP_StartDatePeriod1))","v":42370},null,null,null,"2016-01-01",null,null,null,{"$f":"\"\"&IF(ISBLANK(INDEX(PP_Locale,ROW(),PP_LanguageIndex)),INDEX(PP_Locale,ROW(),1),INDEX(PP_Locale,ROW(),PP_LanguageIndex))","v":"Start date of reporting period 5"},"Start date of reporting period 5",null,null,"Startdato for periode 5","Startdatum des Berichtszeitraums 5",null,"Fecha de inicio del período del informe 5",null,null,"Date de début de la période de reporting 5",null,null,"Data di inizio del periodo di riferimento 5",null,null,null,null,null,"Data rozpoczęcia okresu sprawozdawczego 5"]
[{"$f":"\"\"&INDEX(PP_Locale,ROW(),PP_LanguageIndex)","v":"End date of reporting period 5"},{"$f":"IF(COUNTBLANK(PP_StartDatePeriod5),0,PP_StartDatePeriod4-1)","v":"2016-12-31"},null,null,null,"PP_EndDatePeriod5",{"$f":"IF(COUNTBLANK(PP_StartDatePeriod5),0,PP_StartDatePeriod4-1)","v":42735},null,null,null,"2016-12-31",null,null,null,{"$f":"\"\"&IF(ISBLANK(INDEX(PP_Locale,ROW(),PP_LanguageIndex)),INDEX(PP_Locale,ROW(),1),INDEX(PP_Locale,ROW(),PP_LanguageIndex))","v":"End date of reporting period 5"},"End date of reporting period 5",null,null,"Slutdato for periode 5","Enddatum des Berichtszeitraums 5",null,"Fecha final del período del informe 5",null,null,"Date de fin de la période de reporting 5",null,null,"Data di fine del periodo di riferimento 5",null,null,null,null,null,"Data zakończenia okresu sprawozdawczego 5"]
[{"$f":"\"\"&INDEX(PP_Locale,ROW(),PP_LanguageIndex)","v":"Start date of reporting period 6"},{"$f":"DATE(YEAR(PP_StartDatePeriod1)-5,MONTH(PP_StartDatePeriod1),DAY(PP_StartDatePeriod1))","v":"2015-01-01"},null,null,null,"PP_StartDatePeriod6",{"$f":"DATE(YEAR(PP_StartDatePeriod1)-5,MONTH(PP_StartDatePeriod1),DAY(PP_StartDatePeriod1))","v":42005},null,null,null,"2015-01-01",null,null,null,{"$f":"\"\"&IF(ISBLANK(INDEX(PP_Locale,ROW(),PP_LanguageIndex)),INDEX(PP_Locale,ROW(),1),INDEX(PP_Locale,ROW(),PP_LanguageIndex))","v":"Start date of reporting period 6"},"Start date of reporting period 6",null,null,"Startdato for periode 6","Startdatum des Berichtszeitraums 6",null,"Fecha de inicio del período del informe 6",null,null,"Date de début de la période de reporting 6",null,null,"Data di inizio del periodo di riferimento 6",null,null,null,null,null,"Data rozpoczęcia okresu sprawozdawczego 6"]
[{"$f":"\"\"&INDEX(PP_Locale,ROW(),PP_LanguageIndex)","v":"End date of reporting period 6"},{"$f":"IF(COUNTBLANK(PP_StartDatePeriod6),0,PP_StartDatePeriod5-1)","v":"2015-12-31"},null,null,null,"PP_EndDatePeriod6",{"$f":"IF(COUNTBLANK(PP_StartDatePeriod6),0,PP_StartDatePeriod5-1)","v":42369},null,null,null,"2015-12-31",null,null,null,{"$f":"\"\"&IF(ISBLANK(INDEX(PP_Locale,ROW(),PP_LanguageIndex)),INDEX(PP_Locale,ROW(),1),INDEX(PP_Locale,ROW(),PP_LanguageIndex))","v":"End date of reporting period 6"},"End date of reporting period 6",null,null,"Slutdato for periode 6","Enddatum des Berichtszeitraums 6",null,"Fecha final del período del informe 6",null,null,"Date de fin de la période de reporting 6",null,null,"Data di fine del periodo di riferimento 6",null,null,null,null,null,"Data zakończenia okresu sprawozdawczego 6"]
[{"$f":"\"\"&INDEX(PP_Locale,ROW(),PP_LanguageIndex)","v":"Start date of reporting period 7"},{"$f":"DATE(YEAR(PP_StartDatePeriod1)-6,MONTH(PP_StartDatePeriod1),DAY(PP_StartDatePeriod1))","v":"2014-01-01"},null,null,null,"PP_StartDatePeriod7",{"$f":"DATE(YEAR(PP_StartDatePeriod1)-6,MONTH(PP_StartDatePeriod1),DAY(PP_StartDatePeriod1))","v":"2014-01-01"},null,null,null,{"$f":"IF(COUNTBLANK(B44),\"\",TEXT(YEAR(B44),\"0000\")&\"-\"&TEXT(MONTH(B44),\"00\")&\"-\"&TEXT(DAY(B44),\"00\"))","v":"2014-01-01"},null,null,null,{"$f":"\"\"&IF(ISBLANK(INDEX(PP_Locale,ROW(),PP_LanguageIndex)),INDEX(PP_Locale,ROW(),1),INDEX(PP_Locale,ROW(),PP_LanguageIndex))","v":"Start date of reporting period 7"},"Start date of reporting period 7",null,null,"Startdato for periode 7","Startdatum des Berichtszeitraums 7",null,"Fecha de inicio del período del informe 7",null,null,"Date de début de la période de reporting 7",null,null,"Data di inizio del periodo di riferimento 7",null,null,null,null,null,"Data rozpoczęcia okresu sprawozdawczego 7"]
[{"$f":"\"\"&INDEX(PP_Locale,ROW(),PP_LanguageIndex)","v":"End date of reporting period 7"},{"$f":"IF(COUNTBLANK(PP_StartDatePeriod7),0,PP_StartDatePeriod6-1)","v":"2014-12-31"},null,null,null,"PP_EndDatePeriod7",{"$f":"IF(COUNTBLANK(PP_StartDatePeriod7),0,PP_StartDatePeriod6-1)","v":42004},null,null,null,"2014-12-31",null,null,null,{"$f":"\"\"&IF(ISBLANK(INDEX(PP_Locale,ROW(),PP_LanguageIndex)),INDEX(PP_Locale,ROW(),1),INDEX(PP_Locale,ROW(),PP_LanguageIndex))","v":"End date of reporting period 7"},"End date of reporting period 7",null,null,"Slutdato for periode 7","Enddatum des Berichtszeitraums 7",null,"Fecha final del período del informe 7",null,null,"Date de fin de la période de reporting 7",null,null,"Data di fine del periodo di riferimento 7",null,null,null,null,null,"Data zakończenia okresu sprawozdawczego 7"]
[{"$f":"\"\"&INDEX(PP_Locale,ROW(),PP_LanguageIndex)","v":"Start date of reporting period 8"},{"$f":"DATE(YEAR(PP_StartDatePeriod1)-7,MONTH(PP_StartDatePeriod1),DAY(PP_StartDatePeriod1))","v":"2013-01-01"},null,null,null,"PP_StartDatePeriod8",{"$f":"DATE(YEAR(PP_StartDatePeriod1)-7,MONTH(PP_StartDatePeriod1),DAY(PP_StartDatePeriod1))","v":"2013-01-01"},null,null,null,"2013-01-01",null,null,null,{"$f":"\"\"&IF(ISBLANK(INDEX(PP_Locale,ROW(),PP_LanguageIndex)),INDEX(PP_Locale,ROW(),1),INDEX(PP_Locale,ROW(),PP_LanguageIndex))","v":"Start date of reporting period 8"},"Start date of reporting period 8",null,null,"Startdato for periode 8","Startdatum des Berichtszeitraums 8",null,"Fecha de inicio del período del informe 8",null,null,"Date de début de la période de reporting 8",null,null,"Data di inizio del periodo di riferimento 8",null,null,null,null,null,"Data rozpoczęcia okresu sprawozdawczego 8"]
[{"$f":"\"\"&INDEX(PP_Locale,ROW(),PP_LanguageIndex)","v":"End date of reporting period 8"},{"$f":"IF(COUNTBLANK(PP_StartDatePeriod8),0,PP_StartDatePeriod7-1)","v":"2013-12-31"},null,null,null,"PP_EndDatePeriod8",{"$f":"IF(COUNTBLANK(PP_StartDatePeriod8),0,PP_StartDatePeriod7-1)","v":41639},null,null,null,"2013-12-31",null,null,null,{"$f":"\"\"&IF(ISBLANK(INDEX(PP_Locale,ROW(),PP_LanguageIndex)),INDEX(PP_Locale,ROW(),1),INDEX(PP_Locale,ROW(),PP_LanguageIndex))","v":"End date of reporting period 8"},"End date of reporting period 8",null,null,"Slutdato for periode 8","Enddatum des Berichtszeitraums 8",null,"Fecha final del período del informe 8",null,null,"Date de fin de la période de reporting 8",null,null,"Data di fine del periodo di riferimento 8",null,null,null,null,null,"Data zakończenia okresu sprawozdawczego 8"]
[null,null,null,null,null,null,null,null,null,null,null,null,null,null,{"$f":"\"\"&IF(ISBLANK(INDEX(PP_Locale,ROW(),PP_LanguageIndex)),INDEX(PP_Locale,ROW(),1),INDEX(PP_Locale,ROW(),PP_LanguageIndex))","v":""}]
[{"$f":"\"\"&INDEX(PP_Locale,ROW(),PP_LanguageIndex)","v":"Technical information:"},null,null,null,null,null,null,null,null,null,null,null,null,null,{"$f":"\"\"&IF(ISBLANK(INDEX(PP_Locale,ROW(),PP_LanguageIndex)),INDEX(PP_Locale,ROW(),1),INDEX(PP_Locale,ROW(),PP_LanguageIndex))","v":"Technical information:"},"Technical information:",null,null,"Teknisk information:","Technische Information:",null,"Información técnica:",null,null,"Informations techniques:",null,null,"Informazioni tecniche:",null,null,null,null,null,"Specyfikacja:"]
[{"$f":"\"\"&INDEX(PP_Locale,ROW(),PP_LanguageIndex)","v":"Taxonomy"},"ESEF",null,null,null,"PP_Taxonomy","ESEF",null,null,null,null,null,null,null,{"$f":"\"\"&IF(ISBLANK(INDEX(PP_Locale,ROW(),PP_LanguageIndex)),INDEX(PP_Locale,ROW(),1),INDEX(PP_Locale,ROW(),PP_LanguageIndex))","v":"Taxonomy"},"Taxonomy",null,null,"Taksonomi","Taxonomie",null,"Taxonomía",null,null,"Taxonomie",null,null,"Tassonomia",null,null,null,null,null,"Taksonomia",null,null,null,null,null,null,null,null,null,null,null,null,null,null,null,null,null,null,null,null,null,null,null,null,null,null,null,null,null,null,null,null,null,null,null,null,null,null,null,null,"ESEF","ESEF 20200316","ESEF 20190327","ESEF 20170331"]
[{"$f":"\"\"&INDEX(PP_Locale,ROW(),PP_LanguageIndex)","v":"Taxonomy ID"},"ESEF",null,null,null,"PP_TaxonomyId","ESEF",null,null,null,null,null,null,null,{"$f":"\"\"&IF(ISBLANK(INDEX(PP_Locale,ROW(),PP_LanguageIndex)),INDEX(PP_Locale,ROW(),1),INDEX(PP_Locale,ROW(),PP_LanguageIndex))","v":"Taxonomy ID"},"Taxonomy ID",null,null,"Taksonomi ID","Taxonomie-ID",null,"ID de taxonomía",null,null,"ID de taxonomie",null,null,"ID tassonomia",null,null,null,null,null,"ID taksonomia"]
[{"$f":"\"\"&INDEX(PP_Locale,ROW(),PP_LanguageIndex)","v":"Taxonomy entrypoint"},"All",null,null,null,"PP_TaxonomyEntrypoint","All",null,null,null,{"$f":"\"\"&SUBSTITUTE(B52,\" / \",\", \")","v":"All"},null,null,null,{"$f":"\"\"&IF(ISBLANK(INDEX(PP_Locale,ROW(),PP_LanguageIndex)),INDEX(PP_Locale,ROW(),1),INDEX(PP_Locale,ROW(),PP_LanguageIndex))","v":"Taxonomy entrypoint"},"Taxonomy entrypoint",null,null,"Taksonomi entrypoint","Einstiegspunkt",null,"Punto de acceso",null,null,"Point d'accès",null,null,"Punto d'entrata",null,null,null,null,null,"Punkt wejścia",null,null,null,null,null,null,null,null,null,null,null,null,null,null,null,null,null,null,null,null,null,null,null,null,null,null,null,null,null,null,null,null,null,null,null,null,null,null,null,null,"All"]
[{"$f":"\"\"&INDEX(PP_Locale,ROW(),PP_LanguageIndex)","v":"Identifier scheme"},{"$f":"INDEX(PP_CountryLocale,ROW(),PP_CountryIndex)","v":"http://standards.iso.org/iso/17442"},null,null,null,"PP_IdentifierScheme",{"$f":"INDEX(PP_CountryLocale,ROW(),PP_CountryIndex)","v":"http://standards.iso.org/iso/17442"},null,null,null,{"$f":"\"\"&B53","v":"http://standards.iso.org/iso/17442"},null,null,null,{"$f":"\"\"&IF(ISBLANK(INDEX(PP_Locale,ROW(),PP_LanguageIndex)),INDEX(PP_Locale,ROW(),1),INDEX(PP_Locale,ROW(),PP_LanguageIndex))","v":"Identifier scheme"},"Identifier scheme",null,null,"Identifier scheme","Identifikationsschema",null,"Esquema de identificación",null,null,"Schéma d'identification",null,null,"Schema identificativo",null,null,null,null,null,"Schemat identyfikacyjny",null,null,null,null,null,null,"http://standards.iso.org/iso/17442","http://standards.iso.org/iso/17442","http://standards.iso.org/iso/17442","http://standards.iso.org/iso/17442","http://standards.iso.org/iso/17442","http://standards.iso.org/iso/17442","http://standards.iso.org/iso/17442","http://standards.iso.org/iso/17442",{"$f":"IF(LEN(PP_IdentificationOfReportingEntity)=8,\"http://www.dcca.dk/cvr\",\"http://standards.iso.org/iso/17442\")","v":"http://standards.iso.org/iso/17442"},"http://standards.iso.org/iso/17442","http://standards.iso.org/iso/17442","http://standards.iso.org/iso/17442","http://standards.iso.org/iso/17442","http://standards.iso.org/iso/17442","http://standards.iso.org/iso/17442","http://standards.iso.org/iso/17442","http://standards.iso.org/iso/17442","http://standards.iso.org/iso/17442","http://standards.iso.org/iso/17442","http://standards.iso.org/iso/17442","http://standards.iso.org/iso/17442","http://standards.iso.org/iso/17442","http://standards.iso.org/iso/17442","http://standards.iso.org/iso/17442","http://standards.iso.org/iso/17442","http://standards.iso.org/iso/17442","http://standards.iso.org/iso/17442","http://standards.iso.org/iso/17442","http://standards.iso.org/iso/17442","http://standards.iso.org/iso/17442","http://standards.iso.org/iso/17442","http://standards.iso.org/iso/17442","http://standards.iso.org/iso/17442","http://standards.iso.org/iso/17442"]
[{"$f":"\"\"&INDEX(PP_Locale,ROW(),PP_LanguageIndex)","v":"Customer domain"},{"$f":"SUBSTITUTE(SUBSTITUTE(SUBSTITUTE(SUBSTITUTE(LOWER(PP_HomepageOfReportingEntity),\"www.\",\"\"),\"https:\",\"\"),\"http:\",\"\"),\"/\",\"\")","v":"customerdomain.com"},null,null,null,"PP_CustomerDomain",{"$f":"SUBSTITUTE(SUBSTITUTE(SUBSTITUTE(SUBSTITUTE(LOWER(PP_HomepageOfReportingEntity),\"www.\",\"\"),\"https:\",\"\"),\"http:\",\"\"),\"/\",\"\")","v":"customerdomain.com"},null,null,null,null,null,null,null,{"$f":"\"\"&IF(ISBLANK(INDEX(PP_Locale,ROW(),PP_LanguageIndex)),INDEX(PP_Locale,ROW(),1),INDEX(PP_Locale,ROW(),PP_LanguageIndex))","v":"Customer domain"},"Customer domain",null,null,"Kunde domæne","Kundendomäne",null,"Dominio del cliente",null,null,"Domaine client",null,null,"Dominio del cliente",null,null,null,null,null,"Domena klienta"]
[{"$f":"\"\"&INDEX(PP_Locale,ROW(),PP_LanguageIndex)","v":"Reference date"},{"$f":"TEXT(YEAR(MAX(PP_Periods)),\"0000\")&\"-\"&TEXT(MONTH(MAX(PP_Periods)),\"00\")&\"-\"&TEXT(DAY(MAX(PP_Periods)),\"00\")","v":"2020-12-31"},null,null,null,"PP_ReferenceDate",{"$f":"TEXT(YEAR(MAX(PP_Periods)),\"0000\")&\"-\"&TEXT(MONTH(MAX(PP_Periods)),\"00\")&\"-\"&TEXT(DAY(MAX(PP_Periods)),\"00\")","v":"2020-12-31"},null,null,null,null,null,null,null,{"$f":"\"\"&IF(ISBLANK(INDEX(PP_Locale,ROW(),PP_LanguageIndex)),INDEX(PP_Locale,ROW(),1),INDEX(PP_Locale,ROW(),PP_LanguageIndex))","v":"Reference date"},"Reference date",null,null,"Reference dato","Referenzdatum",null,"Fecha de referencia",null,null,"Date de référence",null,null,"Data di riferimento",null,null,null,null,null,"Data odniesienia"]
[{"$f":"\"\"&INDEX(PP_Locale,ROW(),PP_LanguageIndex)","v":"Customer taxonomy filename"},{"$f":"INDEX(PP_CountryLocale,ROW(),PP_CountryIndex)","v":"12345NOTVALID1234503-2020-12-31-en"},null,null,null,"PP_CustomTaxonomyFileName",{"$f":"INDEX(PP_CountryLocale,ROW(),PP_CountryIndex)","v":"12345NOTVALID1234503-2020-12-31-en"},null,null,null,null,null,null,null,{"$f":"\"\"&IF(ISBLANK(INDEX(PP_Locale,ROW(),PP_LanguageIndex)),INDEX(PP_Locale,ROW(),1),INDEX(PP_Locale,ROW(),PP_LanguageIndex))","v":"Customer taxonomy filename"},"Customer taxonomy filename",null,null,"Kunde taksonomi filnavn","Dateiname der Kundentaxonomie ",null,"Nombre de archivo de taxonomía del cliente",null,null,"Nom du fichier de taxonomie client ",null,null,"Nome file tassonomia cliente",null,null,null,null,null,"Nazwa pliku taksonomii klienta",null,null,null,null,null,null,{"$f":"\"\"&PP_IdentificationOfReportingEntity&\"-\"&PP_ReferenceDate&\"-\"&LOWER(PP_Language)","v":"12345NOTVALID1234503-2020-12-31-en"},"12345NOTVALID1234503-2020-12-31-en","12345NOTVALID1234503-2020-12-31-en","12345NOTVALID1234503-2020-12-31-en","12345NOTVALID1234503-2020-12-31-en","12345NOTVALID1234503-2020-12-31-en","12345NOTVALID1234503-2020-12-31-en","12345NOTVALID1234503-2020-12-31-en","12345NOTVALID1234503-2020-12-31-en","12345NOTVALID1234503-2020-12-31-en","12345NOTVALID1234503-2020-12-31-en","12345NOTVALID1234503-2020-12-31-en","12345NOTVALID1234503-2020-12-31-en",{"$f":"\"\"&PP_IdentificationOfReportingEntity&\"-\"&PP_ReferenceDate&\"AR\"","v":"12345NOTVALID1234503-2020-12-31AR"},{"$f":"\"\"&PP_IdentificationOfReportingEntity&\"-\"&PP_ReferenceDate&\"-\"&LOWER(PP_Language)","v":"12345NOTVALID1234503-2020-12-31-en"},"12345NOTVALID1234503-2020-12-31-en","12345NOTVALID1234503-2020-12-31-en","12345NOTVALID1234503-2020-12-31-en","12345NOTVALID1234503-2020-12-31-en","12345NOTVALID1234503-2020-12-31-en","12345NOTVALID1234503-2020-12-31-en","12345NOTVALID1234503-2020-12-31-en","12345NOTVALID1234503-2020-12-31-en","12345NOTVALID1234503-2020-12-31-en","12345NOTVALID1234503-2020-12-31-en","12345NOTVALID1234503-2020-12-31-en","12345NOTVALID1234503-2020-12-31-en","12345NOTVALID1234503-2020-12-31-en","12345NOTVALID1234503-2020-12-31-en","12345NOTVALID1234503-2020-12-31-en","12345NOTVALID1234503-2020-12-31-en","12345NOTVALID1234503-2020-12-31-en","12345NOTVALID1234503-2020-12-31-en",{"$f":"\"\"&PP_IdentificationOfReportingEntity&\"-\"&PP_ReferenceDate","v":"12345NOTVALID1234503-2020-12-31"}]
[{"$f":"\"\"&INDEX(PP_Locale,ROW(),PP_LanguageIndex)","v":"Customer taxonomy report filename"},{"$f":"INDEX(PP_CountryLocale,ROW(),PP_CountryIndex)","v":"reports\\12345NOTVALID1234503-2020-12-31-en.xhtml"},null,null,null,"PP_CustomTaxonomyReportFileName",{"$f":"INDEX(PP_CountryLocale,ROW(),PP_CountryIndex)","v":"reports\\12345NOTVALID1234503-2020-12-31-en.xhtml"},null,null,null,null,null,null,null,{"$f":"\"\"&IF(ISBLANK(INDEX(PP_Locale,ROW(),PP_LanguageIndex)),INDEX(PP_Locale,ROW(),1),INDEX(PP_Locale,ROW(),PP_LanguageIndex))","v":"Customer taxonomy report filename"},"Customer taxonomy report filename",null,null,"Kunde taksonomi rapport filnavn","Dateiname des Kundentaxonomieberichts",null,"Nombre de archivo del informe de taxonomía del cliente",null,null,"Nom de fichier du rapport de taxonomie client",null,null,"Nome file report tassonomia cliente",null,null,null,null,null,"Nazwa pliku raportu taksonomii klienta",null,null,null,null,null,null,{"$f":"\"reports\\\"&PP_IdentificationOfReportingEntity&\"-\"&PP_ReferenceDate&\"-\"&LOWER(PP_Language)&\".xhtml\"","v":"reports\\12345NOTVALID1234503-2020-12-31-en.xhtml"},"reports\\12345NOTVALID1234503-2020-12-31-en.xhtml","reports\\12345NOTVALID1234503-2020-12-31-en.xhtml","reports\\12345NOTVALID1234503-2020-12-31-en.xhtml","reports\\12345NOTVALID1234503-2020-12-31-en.xhtml","reports\\12345NOTVALID1234503-2020-12-31-en.xhtml","reports\\12345NOTVALID1234503-2020-12-31-en.xhtml","reports\\12345NOTVALID1234503-2020-12-31-en.xhtml","reports\\12345NOTVALID1234503-2020-12-31-en.xhtml","reports\\12345NOTVALID1234503-2020-12-31-en.xhtml","reports\\12345NOTVALID1234503-2020-12-31-en.xhtml","reports\\12345NOTVALID1234503-2020-12-31-en.xhtml","reports\\12345NOTVALID1234503-2020-12-31-en.xhtml",{"$f":"\"reports\\\"&PP_IdentificationOfReportingEntity&\"-\"&PP_ReferenceDate&\"AR.xhtml\"","v":"reports\\12345NOTVALID1234503-2020-12-31AR.xhtml"},{"$f":"\"reports\\\"&PP_IdentificationOfReportingEntity&\"-\"&PP_ReferenceDate&\"-\"&LOWER(PP_Language)&\".xhtml\"","v":"reports\\12345NOTVALID1234503-2020-12-31-en.xhtml"},"reports\\12345NOTVALID1234503-2020-12-31-en.xhtml","reports\\12345NOTVALID1234503-2020-12-31-en.xhtml","reports\\12345NOTVALID1234503-2020-12-31-en.xhtml","reports\\12345NOTVALID1234503-2020-12-31-en.xhtml","reports\\12345NOTVALID1234503-2020-12-31-en.xhtml","reports\\12345NOTVALID1234503-2020-12-31-en.xhtml","reports\\12345NOTVALID1234503-2020-12-31-en.xhtml","reports\\12345NOTVALID1234503-2020-12-31-en.xhtml","reports\\12345NOTVALID1234503-2020-12-31-en.xhtml","reports\\12345NOTVALID1234503-2020-12-31-en.xhtml","reports\\12345NOTVALID1234503-2020-12-31-en.xhtml","reports\\12345NOTVALID1234503-2020-12-31-en.xhtml","reports\\12345NOTVALID1234503-2020-12-31-en.xhtml","reports\\12345NOTVALID1234503-2020-12-31-en.xhtml","reports\\12345NOTVALID1234503-2020-12-31-en.xhtml","reports\\12345NOTVALID1234503-2020-12-31-en.xhtml","reports\\12345NOTVALID1234503-2020-12-31-en.xhtml","reports\\12345NOTVALID1234503-2020-12-31-en.xhtml",{"$f":"\"reports\\\"&PP_IdentificationOfReportingEntity&\"-\"&PP_ReferenceDate&\"-T01.html\"","v":"reports\\12345NOTVALID1234503-2020-12-31-T01.html"}]
[{"$f":"\"\"&INDEX(PP_Locale,ROW(),PP_LanguageIndex)","v":"Customer taxonomy name"},{"$f":"INDEX(PP_CountryLocale,ROW(),PP_CountryIndex)","v":"customerdomain.com\\2020-12-31\\12345NOTVALID1234503-2020-12-31"},null,null,null,"PP_CustomTaxonomyName",{"$f":"INDEX(PP_CountryLocale,ROW(),PP_CountryIndex)","v":"customerdomain.com\\2020-12-31\\12345NOTVALID1234503-2020-12-31"},null,null,null,null,null,null,null,{"$f":"\"\"&IF(ISBLANK(INDEX(PP_Locale,ROW(),PP_LanguageIndex)),INDEX(PP_Locale,ROW(),1),INDEX(PP_Locale,ROW(),PP_LanguageIndex))","v":"Customer taxonomy name"},"Customer taxonomy name",null,null,"Kunde taksonomi navn","Name der Kundentaxonomie",null,"Nombre de taxonomía del cliente",null,null,"Nom de la taxonomie du client",null,null,"Nome tassonomia cliente",null,null,null,null,null,"Nazwa taksonomii klienta",null,null,null,null,null,null,{"$f":"PP_CustomerDomain&\"\\\"&PP_ReferenceDate&\"\\\"&PP_IdentificationOfReportingEntity&\"-\"&PP_ReferenceDate","v":"customerdomain.com\\2020-12-31\\12345NOTVALID1234503-2020-12-31"},{"$f":"PP_CustomerDomain&\"\\\"&PP_ReferenceDate&\"\\\"&PP_IdentificationOfReportingEntity&\"-\"&PP_ReferenceDate","v":"customerdomain.com\\2020-12-31\\12345NOTVALID1234503-2020-12-31"},{"$f":"PP_CustomerDomain&\"\\\"&PP_ReferenceDate&\"\\\"&PP_IdentificationOfReportingEntity&\"-\"&PP_ReferenceDate","v":"customerdomain.com\\2020-12-31\\12345NOTVALID1234503-2020-12-31"},{"$f":"PP_CustomerDomain&\"\\\"&PP_ReferenceDate&\"\\\"&PP_IdentificationOfReportingEntity&\"-\"&PP_ReferenceDate","v":"customerdomain.com\\2020-12-31\\12345NOTVALID1234503-2020-12-31"},{"$f":"PP_CustomerDomain&\"\\\"&PP_ReferenceDate&\"\\\"&PP_IdentificationOfReportingEntity&\"-\"&PP_ReferenceDate","v":"customerdomain.com\\2020-12-31\\12345NOTVALID1234503-2020-12-31"},{"$f":"PP_CustomerDomain&\"\\\"&PP_ReferenceDate&\"\\\"&PP_IdentificationOfReportingEntity&\"-\"&PP_ReferenceDate","v":"customerdomain.com\\2020-12-31\\12345NOTVALID1234503-2020-12-31"},{"$f":"PP_CustomerDomain&\"\\\"&PP_ReferenceDate&\"\\\"&PP_IdentificationOfReportingEntity&\"-\"&PP_ReferenceDate","v":"customerdomain.com\\2020-12-31\\12345NOTVALID1234503-2020-12-31"},{"$f":"PP_CustomerDomain&\"\\\"&PP_ReferenceDate&\"\\\"&PP_IdentificationOfReportingEntity&\"-\"&PP_ReferenceDate","v":"customerdomain.com\\2020-12-31\\12345NOTVALID1234503-2020-12-31"},{"$f":"\"xbrl.\"&PP_CustomerDomain&\"\\\"&PP_ReferenceDate&\"\\\"&PP_IdentificationOfReportingEntity&\"-\"&PP_ReferenceDate","v":"xbrl.customerdomain.com\\2020-12-31\\12345NOTVALID1234503-2020-12-31"},{"$f":"PP_CustomerDomain&\"\\\"&PP_ReferenceDate&\"\\\"&PP_IdentificationOfReportingEntity&\"-\"&PP_ReferenceDate","v":"customerdomain.com\\2020-12-31\\12345NOTVALID1234503-2020-12-31"},{"$f":"PP_CustomerDomain&\"\\\"&PP_ReferenceDate&\"\\\"&PP_IdentificationOfReportingEntity&\"-\"&PP_ReferenceDate","v":"customerdomain.com\\2020-12-31\\12345NOTVALID1234503-2020-12-31"},{"$f":"PP_CustomerDomain&\"\\\"&PP_ReferenceDate&\"\\\"&PP_IdentificationOfReportingEntity&\"-\"&PP_ReferenceDate","v":"customerdomain.com\\2020-12-31\\12345NOTVALID1234503-2020-12-31"},{"$f":"PP_CustomerDomain&\"\\\"&PP_ReferenceDate&\"\\\"&PP_IdentificationOfReportingEntity&\"-\"&PP_ReferenceDate","v":"customerdomain.com\\2020-12-31\\12345NOTVALID1234503-2020-12-31"},{"$f":"PP_CustomerDomain&\"\\\"&PP_ReferenceDate&\"\\\"&PP_IdentificationOfReportingEntity&\"-\"&PP_ReferenceDate","v":"customerdomain.com\\2020-12-31\\12345NOTVALID1234503-2020-12-31"},{"$f":"PP_CustomerDomain&\"\\\"&PP_ReferenceDate&\"\\\"&PP_IdentificationOfReportingEntity&\"-\"&PP_ReferenceDate","v":"customerdomain.com\\2020-12-31\\12345NOTVALID1234503-2020-12-31"},{"$f":"PP_CustomerDomain&\"\\\"&PP_ReferenceDate&\"\\\"&PP_IdentificationOfReportingEntity&\"-\"&PP_ReferenceDate","v":"customerdomain.com\\2020-12-31\\12345NOTVALID1234503-2020-12-31"},{"$f":"PP_CustomerDomain&\"\\\"&PP_ReferenceDate&\"\\\"&PP_IdentificationOfReportingEntity&\"-\"&PP_ReferenceDate","v":"customerdomain.com\\2020-12-31\\12345NOTVALID1234503-2020-12-31"},{"$f":"PP_CustomerDomain&\"\\\"&PP_ReferenceDate&\"\\\"&PP_IdentificationOfReportingEntity&\"-\"&PP_ReferenceDate","v":"customerdomain.com\\2020-12-31\\12345NOTVALID1234503-2020-12-31"},{"$f":"PP_CustomerDomain&\"\\\"&PP_ReferenceDate&\"\\\"&PP_IdentificationOfReportingEntity&\"-\"&PP_ReferenceDate","v":"customerdomain.com\\2020-12-31\\12345NOTVALID1234503-2020-12-31"},{"$f":"PP_CustomerDomain&\"\\\"&PP_ReferenceDate&\"\\\"&PP_IdentificationOfReportingEntity&\"-\"&PP_ReferenceDate","v":"customerdomain.com\\2020-12-31\\12345NOTVALID1234503-2020-12-31"},{"$f":"PP_CustomerDomain&\"\\\"&PP_ReferenceDate&\"\\\"&PP_IdentificationOfReportingEntity&\"-\"&PP_ReferenceDate","v":"customerdomain.com\\2020-12-31\\12345NOTVALID1234503-2020-12-31"},{"$f":"PP_CustomerDomain&\"\\\"&PP_ReferenceDate&\"\\\"&PP_IdentificationOfReportingEntity&\"-\"&PP_ReferenceDate","v":"customerdomain.com\\2020-12-31\\12345NOTVALID1234503-2020-12-31"},{"$f":"PP_CustomerDomain&\"\\\"&PP_ReferenceDate&\"\\\"&PP_IdentificationOfReportingEntity&\"-\"&PP_ReferenceDate","v":"customerdomain.com\\2020-12-31\\12345NOTVALID1234503-2020-12-31"},{"$f":"PP_CustomerDomain&\"\\\"&PP_ReferenceDate&\"\\\"&PP_IdentificationOfReportingEntity&\"-\"&PP_ReferenceDate","v":"customerdomain.com\\2020-12-31\\12345NOTVALID1234503-2020-12-31"},{"$f":"PP_CustomerDomain&\"\\\"&PP_ReferenceDate&\"\\\"&PP_IdentificationOfReportingEntity&\"-\"&PP_ReferenceDate","v":"customerdomain.com\\2020-12-31\\12345NOTVALID1234503-2020-12-31"},{"$f":"PP_CustomerDomain&\"\\\"&PP_ReferenceDate&\"\\\"&PP_IdentificationOfReportingEntity&\"-\"&PP_ReferenceDate","v":"customerdomain.com\\2020-12-31\\12345NOTVALID1234503-2020-12-31"},{"$f":"PP_CustomerDomain&\"\\\"&PP_ReferenceDate&\"\\\"&PP_IdentificationOfReportingEntity&\"-\"&PP_ReferenceDate","v":"customerdomain.com\\2020-12-31\\12345NOTVALID1234503-2020-12-31"},{"$f":"PP_CustomerDomain&\"\\\"&PP_ReferenceDate&\"\\\"&PP_IdentificationOfReportingEntity&\"-\"&PP_ReferenceDate","v":"customerdomain.com\\2020-12-31\\12345NOTVALID1234503-2020-12-31"},{"$f":"PP_CustomerDomain&\"\\\"&PP_ReferenceDate&\"\\\"&PP_IdentificationOfReportingEntity&\"-\"&PP_ReferenceDate","v":"customerdomain.com\\2020-12-31\\12345NOTVALID1234503-2020-12-31"},{"$f":"PP_CustomerDomain&\"\\\"&PP_ReferenceDate&\"\\\"&PP_IdentificationOfReportingEntity&\"-\"&PP_ReferenceDate","v":"customerdomain.com\\2020-12-31\\12345NOTVALID1234503-2020-12-31"},{"$f":"PP_CustomerDomain&\"\\\"&PP_ReferenceDate&\"\\\"&PP_IdentificationOfReportingEntity&\"-\"&PP_ReferenceDate","v":"customerdomain.com\\2020-12-31\\12345NOTVALID1234503-2020-12-31"},{"$f":"PP_CustomerDomain&\"\\\"&PP_ReferenceDate&\"\\\"&PP_IdentificationOfReportingEntity&\"-\"&PP_ReferenceDate","v":"customerdomain.com\\2020-12-31\\12345NOTVALID1234503-2020-12-31"},{"$f":"PP_CustomerDomain&\"\\\"&PP_ReferenceDate&\"\\\"&PP_IdentificationOfReportingEntity&\"-\"&PP_ReferenceDate","v":"customerdomain.com\\2020-12-31\\12345NOTVALID1234503-2020-12-31"},{"$f":"PP_CustomerDomain&\"\\\"&PP_ReferenceDate&\"\\\"&PP_IdentificationOfReportingEntity&\"-\"&PP_ReferenceDate","v":"customerdomain.com\\2020-12-31\\12345NOTVALID1234503-2020-12-31"}]
[{"$f":"\"\"&INDEX(PP_Locale,ROW(),PP_LanguageIndex)","v":"Customer taxonomy publisher"},{"$f":"\"\"&PP_NameOfReportingEntity","v":"Test customer"},null,null,null,"PP_CustomTaxonomyPublisher",{"$f":"\"\"&PP_NameOfReportingEntity","v":"Test customer"},null,null,null,null,null,null,null,{"$f":"\"\"&IF(ISBLANK(INDEX(PP_Locale,ROW(),PP_LanguageIndex)),INDEX(PP_Locale,ROW(),1),INDEX(PP_Locale,ROW(),PP_LanguageIndex))","v":"Customer taxonomy publisher"},"Customer taxonomy publisher",null,null,"Kunde taksonomi udgiver","Herausgeber der Kundentaxonomie",null,"Editor de taxonomía de clientes",null,null,"Éditeur de taxonomie client",null,null,"Editore della tassonomia del cliente",null,null,null,null,null,"Wydawca taksonomii klienta"]
[{"$f":"\"\"&INDEX(PP_Locale,ROW(),PP_LanguageIndex)","v":"Customer taxonomy publisher website"},{"$f":"\"\"&PP_HomepageOfReportingEntity","v":"www.customerdomain.com"},null,null,null,"PP_CustomTaxonomyPublisherWebsite",{"$f":"\"\"&PP_HomepageOfReportingEntity","v":"www.customerdomain.com"},null,null,null,null,null,null,null,{"$f":"\"\"&IF(ISBLANK(INDEX(PP_Locale,ROW(),PP_LanguageIndex)),INDEX(PP_Locale,ROW(),1),INDEX(PP_Locale,ROW(),PP_LanguageIndex))","v":"Customer taxonomy publisher website"},"Customer taxonomy publisher website",null,null,"Kunde taksonomi website","Publisher-Website für Kundentaxonomie",null,"Sitio web del editor de taxonomía de clientes",null,null,"Site Web de l'éditeur de taxonomie client",null,null,"Sito web dell'editore della tassonomia del cliente",null,null,null,null,null,"Witryna wydawcy taksonomii klientów"]
[{"$f":"\"\"&INDEX(PP_Locale,ROW(),PP_LanguageIndex)","v":"Customer taxonomy publisher country"},{"$f":"PP_CountryCode","v":"EU"},null,null,null,"PP_CustomTaxonomyPublisherCountry",{"$f":"PP_CountryCode","v":"EU"},null,null,null,null,null,null,null,{"$f":"\"\"&IF(ISBLANK(INDEX(PP_Locale,ROW(),PP_LanguageIndex)),INDEX(PP_Locale,ROW(),1),INDEX(PP_Locale,ROW(),PP_LanguageIndex))","v":"Customer taxonomy publisher country"},"Customer taxonomy publisher country",null,null,"Kunde taksonomi land","Verlagsland der Kundentaxonomie",null,"País editor de taxonomía del cliente",null,null,"Pays de l'éditeur de la taxonomie client",null,null,"Paese editore della tassonomia del cliente",null,null,null,null,null,"Kraj wydawcy taksonomii klienta"]
[{"$f":"\"\"&INDEX(PP_Locale,ROW(),PP_LanguageIndex)","v":"Customer taxonomy abbreviation"},{"$f":"IF(ISBLANK(PP_NameOfReportingEntity),\"REF\",LEFT(SUBSTITUTE(SUBSTITUTE(SUBSTITUTE(SUBSTITUTE(SUBSTITUTE(SUBSTITUTE(SUBSTITUTE(SUBSTITUTE(SUBSTITUTE(SUBSTITUTE(SUBSTITUTE(SUBSTITUTE(SUBSTITUTE(SUBSTITUTE(UPPER(PP_NameOfReportingEntity),\" \",\"\"),\"-\",\"\"),\".\",\"\"),\",\",\"\"),\"'\",\"\"),\"Á\",\"A\"),\"É\",\"E\"),\"Ü\",\"U\"),\"Í\",\"I\"),\"Æ\",\"A\"),\"Ø\",\"O\"),\"Å\",\"A\"),\"&\",\"\"),\"+\",\"\"),3))","v":"TES"},null,null,null,"PP_CustomTaxonomyAbbreviation",{"$f":"IF(ISBLANK(PP_NameOfReportingEntity),\"REF\",LEFT(SUBSTITUTE(SUBSTITUTE(SUBSTITUTE(SUBSTITUTE(SUBSTITUTE(SUBSTITUTE(SUBSTITUTE(SUBSTITUTE(SUBSTITUTE(SUBSTITUTE(SUBSTITUTE(SUBSTITUTE(SUBSTITUTE(SUBSTITUTE(UPPER(PP_NameOfReportingEntity),\" \",\"\"),\"-\",\"\"),\".\",\"\"),\",\",\"\"),\"'\",\"\"),\"Á\",\"A\"),\"É\",\"E\"),\"Ü\",\"U\"),\"Í\",\"I\"),\"Æ\",\"A\"),\"Ø\",\"O\"),\"Å\",\"A\"),\"&\",\"\"),\"+\",\"\"),3))","v":"TES"},null,null,null,null,null,null,null,{"$f":"\"\"&IF(ISBLANK(INDEX(PP_Locale,ROW(),PP_LanguageIndex)),INDEX(PP_Locale,ROW(),1),INDEX(PP_Locale,ROW(),PP_LanguageIndex))","v":"Customer taxonomy abbreviation"},"Customer taxonomy abbreviation",null,null,"Kunde taksonomi forkortelse","Abkürzung für Kundentaxonomie",null,"Abreviatura de taxonomía del cliente",null,null,"Abréviation de la taxonomie client",null,null,"Abbreviazione della tassonomia del cliente",null,null,null,null,null,"Skrót taksonomii klienta"]
[{"$f":"\"\"&INDEX(PP_Locale,ROW(),PP_LanguageIndex)","v":"Customer taxonomy date"},{"$f":"TEXT(YEAR(TODAY()),\"0000\")&\"-\"&TEXT(MONTH(TODAY()),\"00\")&\"-\"&TEXT(DAY(TODAY()),\"00\")","v":"2021-11-09"},null,null,null,"PP_CustomTaxonomyDate",{"$f":"TEXT(YEAR(TODAY()),\"0000\")&\"-\"&TEXT(MONTH(TODAY()),\"00\")&\"-\"&TEXT(DAY(TODAY()),\"00\")","v":"2021-11-09"},null,null,null,null,null,null,null,{"$f":"\"\"&IF(ISBLANK(INDEX(PP_Locale,ROW(),PP_LanguageIndex)),INDEX(PP_Locale,ROW(),1),INDEX(PP_Locale,ROW(),PP_LanguageIndex))","v":"Customer taxonomy date"},"Customer taxonomy date",null,null,"Kunde taksonomi dato","Datum der Kundentaxonomie",null,"Fecha de taxonomía del cliente",null,null,"Date de taxonomie du client",null,null,"Data tassonomia cliente",null,null,null,null,null,"Data taksonomii klienta"]
[{"$f":"\"\"&INDEX(PP_Locale,ROW(),PP_LanguageIndex)","v":"Customer taxonomy description"},"Taxonomy extension",null,null,null,"PP_CustomTaxonomyDescription","Taxonomy extension",null,null,null,null,null,null,null,{"$f":"\"\"&IF(ISBLANK(INDEX(PP_Locale,ROW(),PP_LanguageIndex)),INDEX(PP_Locale,ROW(),1),INDEX(PP_Locale,ROW(),PP_LanguageIndex))","v":"Customer taxonomy description"},"Customer taxonomy description",null,null,"Kunde taksonomi beskrivelse","Beschreibung der Kundentaxonomie",null,"Descripción de la taxonomía del cliente",null,null,"Description de la taxonomie du client",null,null,"Descrizione della tassonomia del cliente",null,null,null,null,null,"Opis taksonomii klienta"]
[{"$f":"\"\"&INDEX(PP_Locale,ROW(),PP_LanguageIndex)","v":"Customer taxonomy label languages"},{"$f":"LOWER(IF(AND(PP_Language<>\"EN\",PP_LabelLanguage<>\"EN\"),\"EN,\",\"\")&PP_Language&IF(PP_LabelLanguage<>PP_Language,\",\"&PP_LabelLanguage,\"\"))","v":"en"},null,null,null,"PP_CustomTaxonomyLabelLanguages",{"$f":"LOWER(IF(AND(PP_Language<>\"EN\",PP_LabelLanguage<>\"EN\"),\"EN,\",\"\")&PP_Language&IF(PP_LabelLanguage<>PP_Language,\",\"&PP_LabelLanguage,\"\"))","v":"en"},null,null,null,null,null,null,null,{"$f":"\"\"&IF(ISBLANK(INDEX(PP_Locale,ROW(),PP_LanguageIndex)),INDEX(PP_Locale,ROW(),1),INDEX(PP_Locale,ROW(),PP_LanguageIndex))","v":"Customer taxonomy label languages"},"Customer taxonomy label languages",null,null,"Kunde taksonomi sprog","Kennzeichnungssprachen für Kundentaxonomie",null,"Idiomas de las etiquetas de taxonomía del cliente",null,null,"Langues de label de taxonomie client",null,null,"Lingue delle etichette della tassonomia del cliente",null,null,null,null,null,"Języki etykiet taksonomii klienta",null,null,null,null,null,null,{"$f":"\"en,\"&LOWER(AO1)","v":"en,eu"},{"$f":"\"en,\"&LOWER(AP1)","v":"en,at"},"en,be","en,bg","en,ch","en,cy","en,cz","en,de","en,dk","en,ee","en,el","en,es","en,fi","en,fr",{"$f":"\"en,\"&LOWER(BC1)","v":"en,gr"},"en,hr","en,hu","en,ie","en,is","en,it","en,li","en,lt","en,lu","en,lv","en,mt","en,nl","en,no","en,pl","en,pt","en,ro","en,se","en,si","en,sk","en,uk"]
[{"$f":"\"\"&INDEX(PP_Locale,ROW(),PP_LanguageIndex)","v":"Customer ID"},null,null,null,null,"PP_RunAs",null,null,null,null,null,null,null,null,{"$f":"\"\"&IF(ISBLANK(INDEX(PP_Locale,ROW(),PP_LanguageIndex)),INDEX(PP_Locale,ROW(),1),INDEX(PP_Locale,ROW(),PP_LanguageIndex))","v":"Customer ID"},"Customer ID",null,null,"Kunde ID","Kundennummer",null,"Identificación del cliente",null,null,"Identifiant du client",null,null,"Identificativo del cliente",null,null,null,null,null,"Identyfikator klienta"]
[{"$f":"\"\"&INDEX(PP_Locale,ROW(),PP_LanguageIndex)","v":"Skip validation"},null,null,null,null,"PP_SkipValidation",null,null,null,null,null,null,null,null,{"$f":"\"\"&IF(ISBLANK(INDEX(PP_Locale,ROW(),PP_LanguageIndex)),INDEX(PP_Locale,ROW(),1),INDEX(PP_Locale,ROW(),PP_LanguageIndex))","v":"Skip validation"},"Skip validation",null,null,"Skip validering","Validierung überspringen",null,"Omitir validación",null,null,"Ignorez la validation",null,null,"Salta la convalida",null,null,null,null,null,"Pomiń weryfikację"]
[{"$f":"\"\"&INDEX(PP_Locale,ROW(),PP_LanguageIndex)","v":"Parameters"},null,null,null,null,"PP_Parameters",null,null,null,null,null,null,null,null,{"$f":"\"\"&IF(ISBLANK(INDEX(PP_Locale,ROW(),PP_LanguageIndex)),INDEX(PP_Locale,ROW(),1),INDEX(PP_Locale,ROW(),PP_LanguageIndex))","v":"Parameters"},"Parameters",null,null,"Parametre","Parameter",null,"Parámetros",null,null,"Paramètres",null,null,"Parametri",null,null,null,null,null,"Parametry"]
[null,null,null,null,null,null,null,null,null,null,null,null,null,null,{"$f":"\"\"&IF(ISBLANK(INDEX(PP_Locale,ROW(),PP_LanguageIndex)),INDEX(PP_Locale,ROW(),1),INDEX(PP_Locale,ROW(),PP_LanguageIndex))","v":""}]
[null,null,null,null,null,"IncomeStatementByNature",null,null,null,null,null,null,null,null,{"$f":"\"\"&IF(ISBLANK(INDEX(PP_Locale,ROW(),PP_LanguageIndex)),INDEX(PP_Locale,ROW(),1),INDEX(PP_Locale,ROW(),PP_LanguageIndex))","v":"Income Statement By Nature"},"Income Statement By Nature",null,null,"Resultatopgørelse, artsopdelt","Gewinn- und Verlustrechnung nach Gesamtkostenverfahren",null,"Cuenta de resultados por naturaleza",null,null,"Compte de résultat par nature",null,null,"Conto economico per natura",null,null,null,null,null,"Rachunek zysków i strat według rodzaju"]
[null,null,null,null,null,"IncomeStatementByFunction",null,null,null,null,null,null,null,null,{"$f":"\"\"&IF(ISBLANK(INDEX(PP_Locale,ROW(),PP_LanguageIndex)),INDEX(PP_Locale,ROW(),1),INDEX(PP_Locale,ROW(),PP_LanguageIndex))","v":"Income Statement By Function"},"Income Statement By Function",null,null,"Resultatopgørelse, funktionsopdelt","Gewinn- und Verlustrechnung nach Umsatzkostenverfahren",null,"Cuenta de resultados por función",null,null,"Compte de résultat par fonction",null,null,"Conto economico per destinazione",null,null,null,null,null,"Rachunek zysków i strat według funkcji"]
[null,null,null,null,null,"ComprehensiveIncomeByNature",null,null,null,null,null,null,null,null,{"$f":"\"\"&IF(ISBLANK(INDEX(PP_Locale,ROW(),PP_LanguageIndex)),INDEX(PP_Locale,ROW(),1),INDEX(PP_Locale,ROW(),PP_LanguageIndex))","v":"Comprehensive Income By Nature"},"Comprehensive Income By Nature",null,null,"Totalindkomstopgørelse, artsopdelt","Gesamtergebnisrechnung nach Gesamtkostenverfahren",null,"Cuenta de resultado global por naturaleza",null,null,"Résultat global par nature",null,null,"Prospetto di conto economico complessivo per natura",null,null,null,null,null,"Sprawozdanie z całkowitych dochodów według rodzaju"]
[null,null,null,null,null,"ComprehensiveIncomeByFunction",null,null,null,null,null,null,null,null,{"$f":"\"\"&IF(ISBLANK(INDEX(PP_Locale,ROW(),PP_LanguageIndex)),INDEX(PP_Locale,ROW(),1),INDEX(PP_Locale,ROW(),PP_LanguageIndex))","v":"Comprehensive Income By Function"},"Comprehensive Income By Function",null,null,"Totalindkomstopgørelse, funktionsopdelt","Gesamtergebnisrechnung nach Umsatzkostenverfahren",null,"Cuenta de resultado global por función",null,null,"Résultat global par fonction",null,null,"Prospetto di conto economico complessivo per destinazione",null,null,null,null,null,"Sprawozdanie z całkowitych dochodów według funkcji"]
[null,null,null,null,null,"AllocationOfProfit",null,null,null,null,null,null,null,null,{"$f":"\"\"&IF(ISBLANK(INDEX(PP_Locale,ROW(),PP_LanguageIndex)),INDEX(PP_Locale,ROW(),1),INDEX(PP_Locale,ROW(),PP_LanguageIndex))","v":"Allocation Of Profit"},"Allocation Of Profit",null,null,"Fordeling af årets resultat",null,null,"Asignación de beneficios",null,null,"Répartition des bénéfices",null,null,"Destinazione dell'utile",null,null,null,null,null,"Podział zysku"]
[null,null,null,null,null,"ComprehensiveIncomeBeforeTax",null,null,null,null,null,null,null,null,{"$f":"\"\"&IF(ISBLANK(INDEX(PP_Locale,ROW(),PP_LanguageIndex)),INDEX(PP_Locale,ROW(),1),INDEX(PP_Locale,ROW(),PP_LanguageIndex))","v":"Comprehensive Income Before Tax"},"Comprehensive Income Before Tax",null,null,"Totalindkomstopgørelse, før skat","Gesamtergebnisrechnung vor Steuern",null,"Cuenta de resultado global antes de impuestos",null,null,"Résultat global avant impôts",null,null,"Prospetto di conto economico complessivo prima delle imposte",null,null,null,null,null,"Sprawozdanie z całkowitych dochodów przed opodatkowaniem"]
[null,null,null,null,null,"ComprehensiveIncomeNetOfTax",null,null,null,null,null,null,null,null,{"$f":"\"\"&IF(ISBLANK(INDEX(PP_Locale,ROW(),PP_LanguageIndex)),INDEX(PP_Locale,ROW(),1),INDEX(PP_Locale,ROW(),PP_LanguageIndex))","v":"Comprehensive Income Net Of Tax"},"Comprehensive Income Net Of Tax",null,null,"Totalindkomstopgørelse, efter skat","Gesamtergebnisrechnung nach Steuern",null,"Cuenta de resultado global después de impuestos",null,null,"Résultat global après impôts",null,null,"Prospetto di conto economico complessivo al netto delle imposte",null,null,null,null,null,"Sprawozdanie z całkowitych dochodów po opodatkowaniu"]
[null,null,null,null,null,"AllocationOfComprehensiveIncome",null,null,null,null,null,null,null,null,{"$f":"\"\"&IF(ISBLANK(INDEX(PP_Locale,ROW(),PP_LanguageIndex)),INDEX(PP_Locale,ROW(),1),INDEX(PP_Locale,ROW(),PP_LanguageIndex))","v":"Allocation Of Comprehensive Income"},"Allocation Of Comprehensive Income",null,null,"Fordeling af totalindkomst","Allokation des Gesamtergebnisses",null,null,null,null,"Affectation du résultat global ",null,null,"Ripartizione del reddito complessivo ",null,null,null,null,null,"Alokacja całkowitych dochodów "]
[null,null,null,null,null,"NonCurrentAssets",null,null,null,null,null,null,null,null,{"$f":"\"\"&IF(ISBLANK(INDEX(PP_Locale,ROW(),PP_LanguageIndex)),INDEX(PP_Locale,ROW(),1),INDEX(PP_Locale,ROW(),PP_LanguageIndex))","v":"Non-Current Assets"},"Non-Current Assets","Нетекущи активи","Dlouhodobá aktiva","Langfristede aktiver","Langfristige Vermögenswerte","Μη κυκλοφορούντα περιουσιακά στοιχεία","Activos no corrientes","Põhivarad","Pitkäaikaiset varat","Actifs non courants","Dugotrajna imovina","Befektetett eszközök","Attività non correnti","Ilgalaikis turtas","Ilgtermiņa aktīvi","Assi mhux kurrenti","Vaste activa","Anleggsmidler","Aktywa trwałe","Ativos não correntes","Active imobilizate","Dlhodobé aktíva","Nekratkoročna sredstva","Anläggningstillgångar"]
[null,null,null,null,null,"CurrentAssets",null,null,null,null,null,null,null,null,{"$f":"\"\"&IF(ISBLANK(INDEX(PP_Locale,ROW(),PP_LanguageIndex)),INDEX(PP_Locale,ROW(),1),INDEX(PP_Locale,ROW(),PP_LanguageIndex))","v":"Current Assets"},"Current Assets","Текущи активи","Krátkodobá aktiva","Kortfristede aktiver","Kurzfristige Vermögenswerte","Κυκλοφορούντα περιουσιακά στοιχεία","Activos corrientes","Käibevara","Lyhytaikaiset varat","Actifs courants","Kratkotrajna imovina","Forgóeszközök","Attività correnti","Trumpalaikis turtas","Apgrozāme līdzekļi","Assi kurrenti","Vlottende activa","Omløpsmidler","Aktywa obrotowe","Ativos correntes","Active circulante","Krátkodobý majetok","Kratkoročna sredstva","Löpande tillgångar"]
[null,null,null,null,null,"Assets",null,null,null,null,null,null,null,null,{"$f":"\"\"&IF(ISBLANK(INDEX(PP_Locale,ROW(),PP_LanguageIndex)),INDEX(PP_Locale,ROW(),1),INDEX(PP_Locale,ROW(),PP_LanguageIndex))","v":"Assets"},"Assets","Активи","Aktiva","Aktiver","Vermögenswerte","Περιουσιακά στοιχεία","Activos","Varad","Varat","Actifs","Imovina","Eszközök","Attività","Turtas","Aktīvi","Assi","Activa","Eiendeler","Aktywa","Ativos","Active","Aktíva","Sredstva","Tillgångar"]
[null,null,null,null,null,"Equity",null,null,null,null,null,null,null,null,{"$f":"\"\"&IF(ISBLANK(INDEX(PP_Locale,ROW(),PP_LanguageIndex)),INDEX(PP_Locale,ROW(),1),INDEX(PP_Locale,ROW(),PP_LanguageIndex))","v":"Equity"},"Equity","Собствен капитал","Vlastní kapitál","Egenkapital","Eigenkapital","Ίδια κεφάλαια","Patrimonio neto","Omakapital","Oma pääoma","Capitaux propres","Kapital","Saját tőke","Patrimonio netto","Nuosavybė","Pašu kapitāls","Ekwità","Eigen vermogen","Egenkapital","Kapitał własny","Capital próprio","Capitaluri proprii","Vlastné imanie","Lastniški kapital","Eget kapital"]
[null,null,null,null,null,"Provisions",null,null,null,null,null,null,null,null,{"$f":"\"\"&IF(ISBLANK(INDEX(PP_Locale,ROW(),PP_LanguageIndex)),INDEX(PP_Locale,ROW(),1),INDEX(PP_Locale,ROW(),PP_LanguageIndex))","v":"Provisions"},"Provisions","Провизии","Rezervy","Hensatte forpligtelser","Rückstellungen","Προβλέψεις","Provisiones","Eraldised","Varaukset","Provisions","Rezerviranja","Céltartalékok","Accantonamenti","Atidėjiniai","Uzkrājumi","Provvedimenti","Voorzieningen","Bestemmelser","Rezerwy","Provisões","Provizioane","Rezervy","Rezervacije","Avsättningar"]
[null,null,null,null,null,"NonCurrentLiabilities",null,null,null,null,null,null,null,null,{"$f":"\"\"&IF(ISBLANK(INDEX(PP_Locale,ROW(),PP_LanguageIndex)),INDEX(PP_Locale,ROW(),1),INDEX(PP_Locale,ROW(),PP_LanguageIndex))","v":"Non-Current Liabilities"},"Non-Current Liabilities","Нетекущи пасиви","Dlouhodobé závazky","Langfristede forpligtelser","Langfristige Schulden","Μακροπρόθεσμες υποχρεώσεις","Pasivos no corrientes","Pikaajalised kohustised","Pitkäaikaiset velat","Passifs non courants","Dugoročne obveze","Hosszú lejáratú kötelezettségek","Passività non correnti","Ilgalaikiai įsipareigojimai","Ilgtermiņa saistības","Obbligazzjonijiet mhux kurrenti","Langlopende verplichtingen","Langsiktig gjeld","Zobowiązania długoterminowe","Passivos não correntes","Datorii pe termen lung","Dlhodobé záväzky","Nekratkoročne obveznosti","Långfristiga skulder"]
[null,null,null,null,null,"CurrentLiabilities",null,null,null,null,null,null,null,null,{"$f":"\"\"&IF(ISBLANK(INDEX(PP_Locale,ROW(),PP_LanguageIndex)),INDEX(PP_Locale,ROW(),1),INDEX(PP_Locale,ROW(),PP_LanguageIndex))","v":"Current Liabilities"},"Current Liabilities","Текущи пасиви","Krátkodobé závazky","Kortfristede forpligtelser","Kurzfristige Schulden","Βραχυπρόθεσμες υποχρεώσεις","Pasivos corrientes","Lühiajalised kohustised","Lyhytaikaiset velat","Passifs courants","Kratkoročne obveze","Rövid lejáratú kötelezettségek","Passività correnti","Trumpalaikiai įsipareigojimai","Īstermiņa saistības","Obbligazzjonijiet kurrenti","Kortlopende verplichtingen","Kortsiktig gjeld","Zobowiązania krótkoterminowe","Passivos correntes","Datorii curente","Krátkodobé záväzky","Kratkoročne obveznosti","Kortfristiga skulder"]
[null,null,null,null,null,"Liabilities",null,null,null,null,null,null,null,null,{"$f":"\"\"&IF(ISBLANK(INDEX(PP_Locale,ROW(),PP_LanguageIndex)),INDEX(PP_Locale,ROW(),1),INDEX(PP_Locale,ROW(),PP_LanguageIndex))","v":"Liabilities"},"Liabilities","Пасиви","Závazky","Forpligtelser","Schulden","Παθητικό","Pasivos","Kohustised","Velat","Passifs","Obveze","Kötelezettségek","Passività","Įsipareigojimai","Saistības","Obbligazzjonijiet","Verplichtingen","Gjeld","Zobowiązania","Passivos","Datorii","Záväzky","Obveznosti","Skulder"]
[null,null,null,null,null,"EquityAndLiabilities",null,null,null,null,null,null,null,null,{"$f":"\"\"&IF(ISBLANK(INDEX(PP_Locale,ROW(),PP_LanguageIndex)),INDEX(PP_Locale,ROW(),1),INDEX(PP_Locale,ROW(),PP_LanguageIndex))","v":"Equity And Liabilities"},"Equity And Liabilities","Собствен капитал и пасиви","Vlastní kapitál a závazky","Egenkapital Og Forpligtelser","Eigenkapital und Schulden","Ίδια κεφάλαια και υποχρεώσεις","Patrimonio neto y pasivo","Omakapital ja kohustised","Oma pääoma ja velat","Capitaux propres et passifs","Kapital i obveze","Saját tőke és kötelezettségek","Patrimonio netto e passività","Nuosavybė ir įsipareigojimai","Pasu kapitals un saistības","Ekwità u obbligazzjonijiet","Eigen vermogen en verplichtingen","Egenkapital og gjeld","Kapitał własny i zobowiązania","Capital próprio e passivos","Capitaluri proprii și datorii","Vlastné imanie a záväzky","Lastniški kapital in obveznosti","Eget kapital och skulder"]
[null,null,null,null,null,"StatementOfChangesInEquity",null,null,null,null,null,null,null,null,{"$f":"\"\"&IF(ISBLANK(INDEX(PP_Locale,ROW(),PP_LanguageIndex)),INDEX(PP_Locale,ROW(),1),INDEX(PP_Locale,ROW(),PP_LanguageIndex))","v":"Statement Of Changes In Equity"},"Statement Of Changes In Equity",null,null,"Egenkapitalopgørelse","Eigenkapitalveränderungsrechnung",null,"Estado de cambios en el patrimonio neto",null,null,"Etat des variations des capitaux propres",null,null,"Prospetto delle variazioni di patrimonio netto",null,null,null,null,null,"Sprawozdanie ze zmian w kapitale własnym"]
[null,null,null,null,null,"OperatingActivities",null,null,null,null,null,null,null,null,{"$f":"\"\"&IF(ISBLANK(INDEX(PP_Locale,ROW(),PP_LanguageIndex)),INDEX(PP_Locale,ROW(),1),INDEX(PP_Locale,ROW(),PP_LanguageIndex))","v":"Operating Activities"},"Operating Activities",null,null,"Driftsaktiviteter","Betriebliche Tätigkeit",null,"Actividades de explotación",null,null,"Activités d'exploitation",null,null,"Attività operative",null,null,null,null,null,"Działalność operacyjna"]
[null,null,null,null,null,"InvestingActivities",null,null,null,null,null,null,null,null,{"$f":"\"\"&IF(ISBLANK(INDEX(PP_Locale,ROW(),PP_LanguageIndex)),INDEX(PP_Locale,ROW(),1),INDEX(PP_Locale,ROW(),PP_LanguageIndex))","v":"Investing Activities"},"Investing Activities",null,null,"Investeringsaktiviteter","Investitionstätigkeit",null,"Actividades de inversión",null,null,"Activités d'investissement",null,null,"Attività di investimento",null,null,null,null,null,"Działalność inwestycyjna"]
[null,null,null,null,null,"FinancingActivities",null,null,null,null,null,null,null,null,{"$f":"\"\"&IF(ISBLANK(INDEX(PP_Locale,ROW(),PP_LanguageIndex)),INDEX(PP_Locale,ROW(),1),INDEX(PP_Locale,ROW(),PP_LanguageIndex))","v":"Financing Activities"},"Financing Activities",null,null,"Finansieringsaktiviteter","Finanzierungstätigkeit",null,"Actividades de financiación",null,null,"Activités de financement",null,null,"Attività di finanziamento",null,null,null,null,null,"Działalność finansowa"]
[null,null,null,null,null,"CashFlowStatement",null,null,null,null,null,null,null,null,{"$f":"\"\"&IF(ISBLANK(INDEX(PP_Locale,ROW(),PP_LanguageIndex)),INDEX(PP_Locale,ROW(),1),INDEX(PP_Locale,ROW(),PP_LanguageIndex))","v":"Cash Flow Statement"},"Cash Flow Statement",null,null,"Pengestrømsopgørelse","Kapitalflussrechnung",null,"Estado de flujos de efectivo",null,null,"Etat des flux de trésorerie",null,null,"Rendiconto finanziario",null,null,null,null,null,"Sprawozdanie z przepływów pieniężnych"]
[null,null,null,null,null,"CashAndCashEquivalents",null,null,null,null,null,null,null,null,{"$f":"\"\"&IF(ISBLANK(INDEX(PP_Locale,ROW(),PP_LanguageIndex)),INDEX(PP_Locale,ROW(),1),INDEX(PP_Locale,ROW(),PP_LanguageIndex))","v":"Cash And Cash Equivalents"},"Cash And Cash Equivalents",null,null,"Likvider","Zahlungsmittel und Zahlungsmitteläquivalente",null,"Efectivo y equivalentes al efectivo",null,null,"Trésorerie et équivalents de trésorerie",null,null,"Disponibilità liquide e mezzi equivalenti",null,null,null,null,null,"Środki pieniężne i ekwiwalenty środków pieniężnych"]
[null,null,null,null,null,null,null,null,null,null,null,null,null,null,{"$f":"\"\"&IF(ISBLANK(INDEX(PP_Locale,ROW(),PP_LanguageIndex)),INDEX(PP_Locale,ROW(),1),INDEX(PP_Locale,ROW(),PP_LanguageIndex))","v":"Current period"},"Current period",null,null,"Aktuel periode","Derzeitige Periode",null,"Período actual",null,null,"Période actuelle",null,null,"Periodo attuale",null,null,null,null,null,"Obecny okres"]
[null,null,null,null,null,null,null,null,null,null,null,null,null,null,{"$f":"\"\"&IF(ISBLANK(INDEX(PP_Locale,ROW(),PP_LanguageIndex)),INDEX(PP_Locale,ROW(),1),INDEX(PP_Locale,ROW(),PP_LanguageIndex))","v":"Previous period"},"Previous period",null,null,"Foregående periode","Vorherige Periode",null,"Periodo anterior",null,null,"Période précédente",null,null,"Periodo precedente",null,null,null,null,null,"Poprzedni okres"]
[null,null,null,null,null,null,null,null,null,null,null,null,null,null,{"$f":"\"\"&IF(ISBLANK(INDEX(PP_Locale,ROW(),PP_LanguageIndex)),INDEX(PP_Locale,ROW(),1),INDEX(PP_Locale,ROW(),PP_LanguageIndex))","v":"No"},"No",null,null,"Nej","Nein",null,"No",null,null,"Non",null,null,"No",null,null,null,null,null,"Nie"]
[null,null,null,null,null,null,null,null,null,null,null,null,null,null,{"$f":"\"\"&IF(ISBLANK(INDEX(PP_Locale,ROW(),PP_LanguageIndex)),INDEX(PP_Locale,ROW(),1),INDEX(PP_Locale,ROW(),PP_LanguageIndex))","v":"Yes"},"Yes",null,null,"Ja","Ja",null,"Si",null,null,"Oui",null,null,"Sì",null,null,null,null,null,"Tak"]
[null,null,null,null,null,null,null,null,null,null,null,null,null,null,{"$f":"\"\"&IF(ISBLANK(INDEX(PP_Locale,ROW(),PP_LanguageIndex)),INDEX(PP_Locale,ROW(),1),INDEX(PP_Locale,ROW(),PP_LanguageIndex))","v":"Group"},"Group",null,null,"Koncern","Konzern",null,"Grupo",null,null,"Groupe",null,null,"Gruppo",null,null,null,null,null,"Grupy"]
[null,null,null,null,null,null,null,null,null,null,null,null,null,null,{"$f":"\"\"&IF(ISBLANK(INDEX(PP_Locale,ROW(),PP_LanguageIndex)),INDEX(PP_Locale,ROW(),1),INDEX(PP_Locale,ROW(),PP_LanguageIndex))","v":"Parent"},"Parent",null,null,"Moder","Mutterunternehmen",null,"Dominante",null,null,"Société mère",null,null,"Controllante",null,null,null,null,null,"Jednostka dominująca"]
[null,null,null,null,null,null,null,null,null,null,null,null,null,null,{"$f":"\"\"&IF(ISBLANK(INDEX(PP_Locale,ROW(),PP_LanguageIndex)),INDEX(PP_Locale,ROW(),1),INDEX(PP_Locale,ROW(),PP_LanguageIndex))","v":"EUR"},"EUR",null,null,"DKK","EUR",null,"EUR",null,null,"EUR",null,null,"EUR",null,null,null,null,null,"PLN"]
[null,null,null,null,null,null,null,null,null,null,null,null,null,null,{"$f":"\"\"&IF(ISBLANK(INDEX(PP_Locale,ROW(),PP_LanguageIndex)),INDEX(PP_Locale,ROW(),1),INDEX(PP_Locale,ROW(),PP_LanguageIndex))","v":"Test customer"},"Test customer",null,null,"Test kunde","Kunden testen",null,"Cliente de prueba",null,null,"Test client",null,null,"Cliente di prova",null,null,null,null,null,"Klient testowy"]
[null,null,null,null,null,null,null,null,null,null,null,null,null,null,{"$f":"\"\"&IF(ISBLANK(INDEX(PP_Locale,ROW(),PP_LanguageIndex)),INDEX(PP_Locale,ROW(),1),INDEX(PP_Locale,ROW(),PP_LanguageIndex))","v":"UNKNOWN"},"UNKNOWN",null,null,"UKENDT","UNBEKANNT",null,"DESCONOCIDO",null,null,"INCONNU",null,null,"SCONOSCIUTO",null,null,null,null,null,"NIEZNANY"]
[null,null,null,null,null,null,null,null,null,null,null,null,null,null,{"$f":"\"\"&IF(ISBLANK(INDEX(PP_Locale,ROW(),PP_LanguageIndex)),INDEX(PP_Locale,ROW(),1),INDEX(PP_Locale,ROW(),PP_LanguageIndex))","v":"Income Statement"},"Income Statement",null,null,"Resultatopgørelse","Gewinn- und Verlustrechnung",null,"Cuenta de resultados",null,null,"Compte de résultat",null,null,"Conto economico",null,null,null,null,null,"Rachunek zysków i strat"]
[null,null,null,null,null,null,null,null,null,null,null,null,null,null,{"$f":"\"\"&IF(ISBLANK(INDEX(PP_Locale,ROW(),PP_LanguageIndex)),INDEX(PP_Locale,ROW(),1),INDEX(PP_Locale,ROW(),PP_LanguageIndex))","v":"Comprehensive income"},"Comprehensive income","Всеобхватен доход","Hospodářský výsledek","Totalindkomst","Gesamtergebnis","Συνολικά έσοδα","Resultado global","Koondkasum","Laaja tulos","Résultat global","Sveobuhvatna dobit","Átfogó jövedelem","Conto economico complessivo","Bendrosios pajamos","Apvienotie ienākumi","Introjtu komprensiv","Totaalresultaat","Komprehensiv inntekt","Całkowite dochody","Rendimento integral","Rezultatul global","Súčasti komplexného výsledku","Vseobsegajoči donos","Totalresultat"]
[null,null,null,null,null,null,null,null,null,null,null,null,null,null,{"$f":"\"\"&IF(ISBLANK(INDEX(PP_Locale,ROW(),PP_LanguageIndex)),INDEX(PP_Locale,ROW(),1),INDEX(PP_Locale,ROW(),PP_LanguageIndex))","v":"Balance Sheet"},"Balance Sheet",null,null,"Balance","Bilanz",null,"Hoja de balance",null,null,"Bilan",null,null,"Bilancio",null,null,null,null,null,"Bilans"]
[null,null,null,null,null,null,null,null,null,null,null,null,null,null,{"$f":"\"\"&IF(ISBLANK(INDEX(PP_Locale,ROW(),PP_LanguageIndex)),INDEX(PP_Locale,ROW(),1),INDEX(PP_Locale,ROW(),PP_LanguageIndex))","v":"Changes In Equity"},"Changes In Equity","Увеличение (намаление) на собствения капитал","Zvýšení (snížení) vlastního kapitálu","Egenkapitalopgørelse","Veränderungen des Eigenkapitals","Αύξηση (μείωση) ιδίων κεφαλαίων","Cambios en el patrimonio neto","Omakapitali suurenemine (vähenemine)","Oman pääoman lisäys (tai vähennys)","Variations des capitaux propres","Povećanje (smanjenje) vlasničkog kapitala","Saját tőke növekedése (csökkenése)","Variazioni di patrimonio netto","Nuosavybės padidėjimas (sumažėjimas)","Pašu kapitāla palielinājums (samazinājums)","Żieda (tnaqqis) fl-ekwità","Stijging (daling) van eigen vermogen","Endringer i egenkapitalen ","Zmian w kapitale własnym","Aumento (diminuição) do capital próprio","Creșterea (reducerea) capitalurilor proprii","Zvýšenie (zníženie) vlastného imania","Povečanje (zmanjšanje) lastniškega kapitala","Ökning (minskning) av eget kapital"]
[null,null,null,null,null,null,null,null,null,null,null,null,null,null,{"$f":"\"\"&IF(ISBLANK(INDEX(PP_Locale,ROW(),PP_LanguageIndex)),INDEX(PP_Locale,ROW(),1),INDEX(PP_Locale,ROW(),PP_LanguageIndex))","v":"Cash Flow"},"Cash Flow",null,null,"Pengestrømsopgørelse","Kapitalflussrechnung",null,"Flujos de efectivo",null,null,"Flux de trésorerie",null,null,"Rendiconto finanziario",null,null,null,null,null,"Przepływ pieniędzy"]
[null,null,null,null,null,null,null,null,null,null,null,null,null,null,{"$f":"\"\"&IF(ISBLANK(INDEX(PP_Locale,ROW(),PP_LanguageIndex)),INDEX(PP_Locale,ROW(),1),INDEX(PP_Locale,ROW(),PP_LanguageIndex))","v":"Profit for the period"},"Profit for the period","Печалба (загуба)","Hospodářský výsledek","Periodens resultat","Gewinn (Verlust)","Κέρδη (ζημίες)","Ganancia (pérdida)","Kasum (kahjum)","Voitto (tai tappio)","Résultat","Dobit (gubitak)","Eredmény","Utile (perdita)","Pelnas (nuostoliai)","Peļņa (zaudējumi)","Profitt (telf)","Winst (verlies)","Periodens resultat","Zysk (strata)","Lucros (perdas)","Profit (pierdere)","Zisk (strata)","Poslovni izid","Periodens resultat"]
[null,null,null,null,null,null,null,null,null,null,null,null,null,null,{"$f":"\"\"&IF(ISBLANK(INDEX(PP_Locale,ROW(),PP_LanguageIndex)),INDEX(PP_Locale,ROW(),1),INDEX(PP_Locale,ROW(),PP_LanguageIndex))","v":"Equity at end of period"},"Equity at end of period",null,null,"Egenkapital ultimo","Eigenkapital am Ende der Periode",null,"Patrimonio neto al final del período",null,null,"Capitaux propres en fin de période",null,null,"Patrimonio netto a fine periodo",null,null,null,null,null,"Kapitał własny na koniec okresu"]
[null,null,null,null,null,null,null,null,null,null,null,null,null,null,{"$f":"\"\"&IF(ISBLANK(INDEX(PP_Locale,ROW(),PP_LanguageIndex)),INDEX(PP_Locale,ROW(),1),INDEX(PP_Locale,ROW(),PP_LanguageIndex))","v":"Total equity"},"Total equity",null,null,"Egenkapital i alt","Eigenkapital",null,"Patrimonio neto",null,null,"Capitaux propres",null,null,"Patrimonio netto",null,null,null,null,null,"Kapitał własny"]
[null,null,null,null,null,null,null,null,null,null,null,null,null,null,{"$f":"\"\"&IF(ISBLANK(INDEX(PP_Locale,ROW(),PP_LanguageIndex)),INDEX(PP_Locale,ROW(),1),INDEX(PP_Locale,ROW(),PP_LanguageIndex))","v":"Cash flow from operating activities"},"Cash flow from operating activities","Парични потоци от (използвани в) оперативни дейности","Peněžní toky z (použité při) provozní činnosti","Pengestrømme fra driftsaktiviteter","Zahlungsströme aus (in) betrieblichen Tätigkeiten","Ταμειακές ροές από (που χρησιμοποιούνται σε) λειτουργικές δραστηριότητες","Flujos de efectivo procedentes de (utilizados en) actividades de explotación","Rahavood põhitegevusest","Liiketoiminnasta saadut (tai liiketoiminnassa käytetyt) rahavirrat","Flux de trésorerie résultant (utilisés dans le cadre) des activités opérationnelles","Novčani tokovi od (upotrijebljeni u okviru) poslovnih aktivnosti","Működési tevékenységekből származó (ezekben használt) cash flow-k","Flussi finanziari derivanti da (usati in) attività operative","Pinigų srautai, susidarantys dėl pagrindinės veiklos (arba jai naudojami)","Naudas plūsmas no (kas izmantotas) pamatdarbībām","Flussi ta’ flus minn (użati fi) attivitajiet operatorji","Kasstromen uit hoofde van (gebruikt in) operationele activiteiten","Kontantstrømmer fra (brukt i) driftsaktiviteter","Przepływy pieniężne z działalności operacyjnej (wykorzystane w działalności operacyjnej)","Fluxos de caixa de (utilizados em) atividades de exploração","Fluxurile de trezorerie provenite din (folosite în) activitățile de exploatare","Peňažné toky z prevádzkových činností (použité pri prevádzkových činnostiach)","Denarni tokovi iz poslovnih aktivnosti (uporabljeni pri poslovnih aktivnostih)","Kassaflöden från (som används i) den löpande verksamheten"]
[null,null,null,null,null,null,null,null,null,null,null,null,null,null,{"$f":"\"\"&IF(ISBLANK(INDEX(PP_Locale,ROW(),PP_LanguageIndex)),INDEX(PP_Locale,ROW(),1),INDEX(PP_Locale,ROW(),PP_LanguageIndex))","v":"Cash flow from investing activities"},"Cash flow from investing activities","Парични потоци от (използвани в) инвестиционни дейности","Peněžní toky z (použité při) investiční činnosti","Pengestrømme fra investingsaktiviteter","Zahlungsströme aus (in) Investitionstätigkeit","Ταμειακές ροές από (που χρησιμοποιούνται σε) επενδυτικές δραστηριότητες","Flujos de efectivo procedentes de (utilizados en) actividades de inversión","Rahavood investeerimistegevusest","Investoinneista saadut (tai investointeihin käytetyt) rahavirrat","Flux de trésorerie résultant (utilisés dans le cadre) d’activités d’investissement","Novčani tokovi od (upotrijebljeni u okviru) ulagačkih aktivnosti","Befektetési tevékenységekből származó (ezekben használt) cash flow-k","Flussi finanziari derivanti da (usati in) attività di investimento","Pinigų srautai, susidarantys dėl investicinės veiklos (arba jai naudojami)","Naudas plūsmas no (kas izmantotas) ieguldījumu darbībām","Flussi ta’ flus minn (użati fi) attivitajiet ta’ investiment","Kasstromen uit hoofde van (gebruikt in) investeringsactiviteiten","Kontantstrømmer fra (brukt i) investeringsaktiviteter","Przepływy pieniężne z działalności inwestycyjnej (wykorzystane w działalności inwestycyjnej)","Fluxos de caixa de (utilizados em) atividades de investimento","Fluxurile de trezorerie provenite din (folosite în) activitățile de investiție","Peňažné toky z investičných činností (použité pri investičných činnostiach)","Denarni tokovi iz naložbenih aktivnosti (uporabljeni pri naložbenih aktivnostih)","Kassaflöden från (som används i) investeringsverksamhet"]
[null,null,null,null,null,null,null,null,null,null,null,null,null,null,{"$f":"\"\"&IF(ISBLANK(INDEX(PP_Locale,ROW(),PP_LanguageIndex)),INDEX(PP_Locale,ROW(),1),INDEX(PP_Locale,ROW(),PP_LanguageIndex))","v":"Cash flow from financing activities"},"Cash flow from financing activities","Парични потоци от (използвани във) финансови дейности","Peněžní toky z (použité při) financování","Pengestrømme fra finansieringsaktiviteter","Zahlungsströme aus (in) Finanzierungstätigkeit","Ταμειακές ροές από (που χρησιμοποιούνται σε) χρηματοδοτικές δραστηριότητες","Flujos de efectivo procedentes de (utilizados en) actividades de financiación","Rahavood finantseerimistegevusest","Rahoituksesta saadut (tai rahoituksessa käytetyt) rahavirrat","Flux de trésorerie résultant (utilisés dans le cadre) d’activités de financement","Novčani tokovi od (upotrijebljeni u okviru) financijskih aktivnosti","Finanszírozási tevékenységekből származó (ezekben használt) cash flow-k","Flussi finanziari derivanti da (usati in) attività di finanziamento","Pinigų srautai, susidarantys dėl finansinės veiklos (arba jai naudojami)","Naudas plūsmas no (kas izmantotas) finansēšanas darbībām","Flussi ta’ flus minn (użati fi) attivitajiet ta’ finanzjament","Kasstromen uit hoofde van (gebruikt in) financieringsactiviteiten","Kontantstrømmer fra (brukt i) finansieringsaktiviteter","Przepływy pieniężne z działalności finansowej (wykorzystane w działalności finansowej)","Fluxos de caixa de (utilizados em) atividades de financiamento","Fluxuri de trezorerie provenite din (folosite în) activitățile de finanțare","Peňažné toky z finančných činností (použité pri finančných činnostiach)","Denarni tokovi iz aktivnosti financiranja (uporabljeni pri aktivnostih financiranja)","Kassaflöden från (som används i) finansieringsverksamhet"]
[null,null,null,null,null,null,null,null,null,null,null,null,null,null,{"$f":"\"\"&IF(ISBLANK(INDEX(PP_Locale,ROW(),PP_LanguageIndex)),INDEX(PP_Locale,ROW(),1),INDEX(PP_Locale,ROW(),PP_LanguageIndex))","v":"Change in cash and cash equivalents"},"Change in cash and cash equivalents","Увеличение (намаление) на паричните средства и паричните еквиваленти","Přírůstek (úbytek) peněžních prostředků a peněžních ekvivalentů","Ændringer i likvide beholdninger","Zunahme (Abnahme) von Zahlungsmitteln und Zahlungsmitteläquivalenten","Αύξηση(μείωση) ταμειακών διαθεσίμων και ταμειακών ισοδυνάμων","Incremento (decremento) en efectivo y equivalentes al efectivo","Raha ja raha ekvivalentide suurenemine (vähenemine)","Rahavarojen lisäys (tai vähennys)","Augmentation (diminution) de la trésorerie et des équivalents de trésorerie","Povećanje (smanjenje) novca i novčanih ekvivalenata","Pénzeszközök és pénzeszköz-egyenértékesek növekedése (csökkenése)","Aumento (diminuzione) di disponibilità liquide e mezzi equivalenti","Pinigų ir pinigų ekvivalentų padidėjimas (sumažėjimas)","Naudas un naudas ekvivalentu palielinājums (samazinājums)","Żieda (tnaqqis) fil-flus u fl-ekwivalenti ta’ flus","Stijging (daling) van geldmiddelen en kasequivalenten","Endring i kontanter og kontantekvivalenter","Zwiększenie (zmniejszenie) stanu środków pieniężnych i ich ekwiwalentów","Aumento (diminuição) de caixa e equivalentes de caixa","Creșterea (reducerea) numerarului și a echivalentelor de numerar","Zvýšenie (zníženie) peňažných prostriedkov a peňažných ekvivalentov","Povečanje (zmanjšanje) denarnih sredstev in njihovih ustreznikov","Ökning (minskning) av likvida medel"]
[null,null,null,null,null,null,null,null,null,null,null,null,null,null,{"$f":"\"\"&IF(ISBLANK(INDEX(PP_Locale,ROW(),PP_LanguageIndex)),INDEX(PP_Locale,ROW(),1),INDEX(PP_Locale,ROW(),PP_LanguageIndex))","v":"Dates"},"Dates",null,null,"Datoer","Dates",null,"Dates",null,null,"Dates",null,null,"Dates",null,null,null,null,null,"Dates"]
[null,null,null,null,null,null,null,null,null,null,null,null,null,null,{"$f":"\"\"&IF(ISBLANK(INDEX(PP_Locale,ROW(),PP_LanguageIndex)),INDEX(PP_Locale,ROW(),1),INDEX(PP_Locale,ROW(),PP_LanguageIndex))","v":"Properties"},"Properties",null,null,"Egenskaber","Properties",null,"Properties",null,null,"Properties",null,null,"Properties",null,null,null,null,null,"Properties"]
[null,null,null,null,null,null,null,null,null,null,null,null,null,null,{"$f":"\"\"&IF(ISBLANK(INDEX(PP_Locale,ROW(),PP_LanguageIndex)),INDEX(PP_Locale,ROW(),1),INDEX(PP_Locale,ROW(),PP_LanguageIndex))","v":"Period"},"Period","Период","Období","Periode","Zeitraum","Περίοδος","Periodo","Periood","Jakso","Période","Razdoblje","Időszak","Periodo","Laikotarpis","Periods","Perjodu","Periode","Periode","Okres","Período","Perioada","Obdobie","Obdobje","Period"]

{"sheet":"ESEF hypertags","index":1,"n_rows":236,"n_cols":2,"rows_kept":236,"cut":false,"hidden":false,"merged":[]}
["Element","Hypertag"]
[]
["Footnotes:"]
["(any label, header or amount)","pp://Footnotes?id=X"]
[]
["Notes:"]
["Disclosure of accounting judgements and estimates","pp://Notes/Disclosure of accounting judgements and estimates?labellanguage=en&period=1"]
["Disclosure of accrued expenses and other liabilities","pp://Notes/Disclosure of accrued expenses and other liabilities?labellanguage=en&period=1"]
["Disclosure of allowance for credit losses","pp://Notes/Disclosure of allowance for credit losses?labellanguage=en&period=1"]
["Disclosure of associates","pp://Notes/Disclosure of associates?labellanguage=en&period=1"]
["Disclosure of auditors' remuneration","pp://Notes/Disclosure of auditors' remuneration?labellanguage=en&period=1"]
["Disclosure of authorisation of financial statements","pp://Notes/Disclosure of authorisation of financial statements?labellanguage=en&period=1"]
["Disclosure of available-for-sale financial assets","pp://Notes/Disclosure of available-for-sale financial assets?labellanguage=en&period=1"]
["Disclosure of basis of consolidation","pp://Notes/Disclosure of basis of consolidation?labellanguage=en&period=1"]
["Disclosure of basis of preparation of financial statements","pp://Notes/Disclosure of basis of preparation of financial statements?labellanguage=en&period=1"]
["Disclosure of biological assets, agriculture produce at point of harvest and government grants related to biological assets","pp://Notes/Disclosure of biological assets, agriculture produce at point of harvest and government grants related to biological assets?labellanguage=en&period=1"]
["Disclosure of borrowing costs","pp://Notes/Disclosure of borrowing costs?labellanguage=en&period=1"]
["Disclosure of borrowings","pp://Notes/Disclosure of borrowings?labellanguage=en&period=1"]
["Disclosure of business combinations","pp://Notes/Disclosure of business combinations?labellanguage=en&period=1"]
["Disclosure of cash and bank balances at central banks","pp://Notes/Disclosure of cash and bank balances at central banks?labellanguage=en&period=1"]
["Disclosure of cash and cash equivalents","pp://Notes/Disclosure of cash and cash equivalents?labellanguage=en&period=1"]
["Disclosure of cash flow statement","pp://Notes/Disclosure of cash flow statement?labellanguage=en&period=1"]
["Disclosure of changes in accounting policies","pp://Notes/Disclosure of changes in accounting policies?labellanguage=en&period=1"]
["Disclosure of changes in accounting policies, accounting estimates and errors","pp://Notes/Disclosure of changes in accounting policies, accounting estimates and errors?labellanguage=en&period=1"]
["Disclosure of collateral","pp://Notes/Disclosure of collateral?labellanguage=en&period=1"]
["Disclosure of claims and benefits paid","pp://Notes/Disclosure of claims and benefits paid?labellanguage=en&period=1"]
["Disclosure of commitments","pp://Notes/Disclosure of commitments?labellanguage=en&period=1"]
["Disclosure of commitments and contingent liabilities","pp://Notes/Disclosure of commitments and contingent liabilities?labellanguage=en&period=1"]
["Disclosure of contingent liabilities","pp://Notes/Disclosure of contingent liabilities?labellanguage=en&period=1"]
["Disclosure of cost of sales","pp://Notes/Disclosure of cost of sales?labellanguage=en&period=1"]
["Disclosure of credit risk","pp://Notes/Disclosure of credit risk?labellanguage=en&period=1"]
["Disclosure of debt instruments","pp://Notes/Disclosure of debt instruments?labellanguage=en&period=1"]
["Disclosure of deferred acquisition costs arising from insurance contracts","pp://Notes/Disclosure of deferred acquisition costs arising from insurance contracts?labellanguage=en&period=1"]
["Disclosure of deferred income","pp://Notes/Disclosure of deferred income?labellanguage=en&period=1"]
["Disclosure of deferred taxes","pp://Notes/Disclosure of deferred taxes?labellanguage=en&period=1"]
["Disclosure of deposits from banks","pp://Notes/Disclosure of deposits from banks?labellanguage=en&period=1"]
["Disclosure of deposits from customers","pp://Notes/Disclosure of deposits from customers?labellanguage=en&period=1"]
["Disclosure of depreciation and amortisation expense","pp://Notes/Disclosure of depreciation and amortisation expense?labellanguage=en&period=1"]
["Disclosure of derivative financial instruments","pp://Notes/Disclosure of derivative financial instruments?labellanguage=en&period=1"]
["Disclosure of discontinued operations","pp://Notes/Disclosure of discontinued operations?labellanguage=en&period=1"]
["Disclosure of dividends","pp://Notes/Disclosure of dividends?labellanguage=en&period=1"]
["Disclosure of earnings per share","pp://Notes/Disclosure of earnings per share?labellanguage=en&period=1"]
["Disclosure of effect of changes in foreign exchange rates","pp://Notes/Disclosure of effect of changes in foreign exchange rates?labellanguage=en&period=1"]
["Disclosure of employee benefits","pp://Notes/Disclosure of employee benefits?labellanguage=en&period=1"]
["Disclosure of entity's operating segments","pp://Notes/Disclosure of entity's operating segments?labellanguage=en&period=1"]
["Disclosure of events after reporting period","pp://Notes/Disclosure of events after reporting period?labellanguage=en&period=1"]
["Disclosure of expenses","pp://Notes/Disclosure of expenses?labellanguage=en&period=1"]
["Disclosure of expenses by nature","pp://Notes/Disclosure of expenses by nature?labellanguage=en&period=1"]
["Disclosure of exploration and evaluation assets","pp://Notes/Disclosure of exploration and evaluation assets?labellanguage=en&period=1"]
["Disclosure of fair value measurement","pp://Notes/Disclosure of fair value measurement?labellanguage=en&period=1"]
["Disclosure of fair value of financial instruments","pp://Notes/Disclosure of fair value of financial instruments?labellanguage=en&period=1"]
["Disclosure of fee and commission income (expense)","pp://Notes/Disclosure of fee and commission income (expense)?labellanguage=en&period=1"]
["Disclosure of finance cost","pp://Notes/Disclosure of finance cost?labellanguage=en&period=1"]
["Disclosure of finance income (cost)","pp://Notes/Disclosure of finance income (cost)?labellanguage=en&period=1"]
["Disclosure of finance income","pp://Notes/Disclosure of finance income?labellanguage=en&period=1"]
["Disclosure of financial assets held for trading","pp://Notes/Disclosure of financial assets held for trading?labellanguage=en&period=1"]
["Disclosure of financial instruments","pp://Notes/Disclosure of financial instruments?labellanguage=en&period=1"]
["Disclosure of financial instruments at fair value through profit or loss","pp://Notes/Disclosure of financial instruments at fair value through profit or loss?labellanguage=en&period=1"]
["Disclosure of financial instruments designated at fair value through profit or loss","pp://Notes/Disclosure of financial instruments designated at fair value through profit or loss?labellanguage=en&period=1"]
["Disclosure of financial instruments held for trading","pp://Notes/Disclosure of financial instruments held for trading?labellanguage=en&period=1"]
["Disclosure of financial liabilities held for trading","pp://Notes/Disclosure of financial liabilities held for trading?labellanguage=en&period=1"]
["Disclosure of financial risk management","pp://Notes/Disclosure of financial risk management?labellanguage=en&period=1"]
["Disclosure of first-time adoption","pp://Notes/Disclosure of first-time adoption?labellanguage=en&period=1"]
["Disclosure of general and administrative expense","pp://Notes/Disclosure of general and administrative expense?labellanguage=en&period=1"]
["Disclosure of general information about financial statements","pp://Notes/Disclosure of general information about financial statements?labellanguage=en&period=1"]
["Disclosure of going concern","pp://Notes/Disclosure of going concern?labellanguage=en&period=1"]
["Disclosure of goodwill","pp://Notes/Disclosure of goodwill?labellanguage=en&period=1"]
["Disclosure of government grants","pp://Notes/Disclosure of government grants?labellanguage=en&period=1"]
["Disclosure of hyperinflationary reporting","pp://Notes/Disclosure of hyperinflationary reporting?labellanguage=en&period=1"]
["Disclosure of impairment of assets","pp://Notes/Disclosure of impairment of assets?labellanguage=en&period=1"]
["Disclosure of income tax","pp://Notes/Disclosure of income tax?labellanguage=en&period=1"]
["Disclosure of information about employees","pp://Notes/Disclosure of information about employees?labellanguage=en&period=1"]
["Disclosure of information about key management personnel","pp://Notes/Disclosure of information about key management personnel?labellanguage=en&period=1"]
["Disclosure of insurance contracts","pp://Notes/Disclosure of insurance contracts?labellanguage=en&period=1"]
["Disclosure of insurance premium revenue","pp://Notes/Disclosure of insurance premium revenue?labellanguage=en&period=1"]
["Disclosure of intangible assets","pp://Notes/Disclosure of intangible assets?labellanguage=en&period=1"]
["Disclosure of intangible assets and goodwill","pp://Notes/Disclosure of intangible assets and goodwill?labellanguage=en&period=1"]
["Disclosure of interest expense","pp://Notes/Disclosure of interest expense?labellanguage=en&period=1"]
["Disclosure of interest income","pp://Notes/Disclosure of interest income?labellanguage=en&period=1"]
["Disclosure of interest income (expense)","pp://Notes/Disclosure of interest income (expense)?labellanguage=en&period=1"]
["Disclosure of interests in other entities","pp://Notes/Disclosure of interests in other entities?labellanguage=en&period=1"]
["Disclosure of interim financial reporting","pp://Notes/Disclosure of interim financial reporting?labellanguage=en&period=1"]
["Disclosure of inventories","pp://Notes/Disclosure of inventories?labellanguage=en&period=1"]
["Disclosure of investment contracts liabilities","pp://Notes/Disclosure of investment contracts liabilities?labellanguage=en&period=1"]
["Disclosure of investment property","pp://Notes/Disclosure of investment property?labellanguage=en&period=1"]
["Disclosure of investments accounted for using equity method","pp://Notes/Disclosure of investments accounted for using equity method?labellanguage=en&period=1"]
["Disclosure of investments other than investments accounted for using equity method","pp://Notes/Disclosure of investments other than investments accounted for using equity method?labellanguage=en&period=1"]
["Disclosure of issued capital","pp://Notes/Disclosure of issued capital?labellanguage=en&period=1"]
["Disclosure of joint ventures","pp://Notes/Disclosure of joint ventures?labellanguage=en&period=1"]
["Disclosure of lease prepayments","pp://Notes/Disclosure of lease prepayments?labellanguage=en&period=1"]
["Disclosure of leases","pp://Notes/Disclosure of leases?labellanguage=en&period=1"]
["Disclosure of liquidity risk","pp://Notes/Disclosure of liquidity risk?labellanguage=en&period=1"]
["Disclosure of loans and advances to banks","pp://Notes/Disclosure of loans and advances to banks?labellanguage=en&period=1"]
["Disclosure of loans and advances to customers","pp://Notes/Disclosure of loans and advances to customers?labellanguage=en&period=1"]
["Disclosure of market risk","pp://Notes/Disclosure of market risk?labellanguage=en&period=1"]
["Disclosure of net asset value attributable to unit-holders","pp://Notes/Disclosure of net asset value attributable to unit-holders?labellanguage=en&period=1"]
["Disclosure of non-controlling interests","pp://Notes/Disclosure of non-controlling interests?labellanguage=en&period=1"]
["Disclosure of non-current assets held for sale and discontinued operations","pp://Notes/Disclosure of non-current assets held for sale and discontinued operations?labellanguage=en&period=1"]
["Disclosure of non-current assets or disposal groups classified as held for sale","pp://Notes/Disclosure of non-current assets or disposal groups classified as held for sale?labellanguage=en&period=1"]
["Disclosure of objectives, policies and processes for managing capital","pp://Notes/Disclosure of objectives, policies and processes for managing capital?labellanguage=en&period=1"]
["Disclosure of other assets","pp://Notes/Disclosure of other assets?labellanguage=en&period=1"]
["Disclosure of other current assets","pp://Notes/Disclosure of other current assets?labellanguage=en&period=1"]
["Disclosure of other current liabilities","pp://Notes/Disclosure of other current liabilities?labellanguage=en&period=1"]
["Disclosure of other liabilities","pp://Notes/Disclosure of other liabilities?labellanguage=en&period=1"]
["Disclosure of other non-current assets","pp://Notes/Disclosure of other non-current assets?labellanguage=en&period=1"]
["Disclosure of other non-current liabilities","pp://Notes/Disclosure of other non-current liabilities?labellanguage=en&period=1"]
["Disclosure of other operating expense","pp://Notes/Disclosure of other operating expense?labellanguage=en&period=1"]
["Disclosure of other operating income (expense)","pp://Notes/Disclosure of other operating income (expense)?labellanguage=en&period=1"]
["Disclosure of other operating income","pp://Notes/Disclosure of other operating income?labellanguage=en&period=1"]
["Disclosure of other provisions, contingent liabilities and contingent assets","pp://Notes/Disclosure of other provisions, contingent liabilities and contingent assets?labellanguage=en&period=1"]
["Disclosure of prepayments and other assets","pp://Notes/Disclosure of prepayments and other assets?labellanguage=en&period=1"]
["Disclosure of profit (loss) from operating activities","pp://Notes/Disclosure of profit (loss) from operating activities?labellanguage=en&period=1"]
["Disclosure of property, plant and equipment","pp://Notes/Disclosure of property, plant and equipment?labellanguage=en&period=1"]
["Disclosure of provisions","pp://Notes/Disclosure of provisions?labellanguage=en&period=1"]
["Disclosure of reclassification of financial instruments","pp://Notes/Disclosure of reclassification of financial instruments?labellanguage=en&period=1"]
["Disclosure of regulatory deferral accounts","pp://Notes/Disclosure of regulatory deferral accounts?labellanguage=en&period=1"]
["Disclosure of reinsurance","pp://Notes/Disclosure of reinsurance?labellanguage=en&period=1"]
["Disclosure of related party","pp://Notes/Disclosure of related party?labellanguage=en&period=1"]
["Disclosure of repurchase and reverse repurchase agreements","pp://Notes/Disclosure of repurchase and reverse repurchase agreements?labellanguage=en&period=1"]
["Disclosure of research and development expense","pp://Notes/Disclosure of research and development expense?labellanguage=en&period=1"]
["Disclosure of reserves within equity","pp://Notes/Disclosure of reserves within equity?labellanguage=en&period=1"]
["Disclosure of restricted cash and cash equivalents","pp://Notes/Disclosure of restricted cash and cash equivalents?labellanguage=en&period=1"]
["Disclosure of revenue","pp://Notes/Disclosure of revenue?labellanguage=en&period=1"]
["Disclosure of revenue from contracts with customers","pp://Notes/Disclosure of revenue from contracts with customers?labellanguage=en&period=1"]
["Disclosure of separate financial statements","pp://Notes/Disclosure of separate financial statements?labellanguage=en&period=1"]
["Disclosure of service concession arrangements","pp://Notes/Disclosure of service concession arrangements?labellanguage=en&period=1"]
["Disclosure of share capital, reserves and other equity interest","pp://Notes/Disclosure of share capital, reserves and other equity interest?labellanguage=en&period=1"]
["Disclosure of share-based payment arrangements","pp://Notes/Disclosure of share-based payment arrangements?labellanguage=en&period=1"]
["Disclosure of subordinated liabilities","pp://Notes/Disclosure of subordinated liabilities?labellanguage=en&period=1"]
["Disclosure of subsidiaries","pp://Notes/Disclosure of subsidiaries?labellanguage=en&period=1"]
["Disclosure of significant accounting policies","pp://Notes/Disclosure of significant accounting policies?labellanguage=en&period=1"]
["Disclosure of tax receivables and payables","pp://Notes/Disclosure of tax receivables and payables?labellanguage=en&period=1"]
["Disclosure of trade and other payables","pp://Notes/Disclosure of trade and other payables?labellanguage=en&period=1"]
["Disclosure of trade and other receivables","pp://Notes/Disclosure of trade and other receivables?labellanguage=en&period=1"]
["Disclosure of trading income (expense)","pp://Notes/Disclosure of trading income (expense)?labellanguage=en&period=1"]
["Disclosure of treasury shares","pp://Notes/Disclosure of treasury shares?labellanguage=en&period=1"]
["Disclosure of composition of group","pp://Notes/Disclosure of composition of group?labellanguage=en&period=1"]
[]
["Accounting policies:"]
["Disclosure of significant accounting policies","pp://Accounting Policies/Disclosure of significant accounting policies?labellanguage=en&period=1"]
["Description of accounting policy for available-for-sale financial assets","pp://Accounting Policies/Description of accounting policy for available-for-sale financial assets?labellanguage=en&period=1"]
["Description of accounting policy for biological assets","pp://Accounting Policies/Description of accounting policy for biological assets?labellanguage=en&period=1"]
["Description of accounting policy for borrowing costs","pp://Accounting Policies/Description of accounting policy for borrowing costs?labellanguage=en&period=1"]
["Description of accounting policy for borrowings","pp://Accounting Policies/Description of accounting policy for borrowings?labellanguage=en&period=1"]
["Description of accounting policy for business combinations","pp://Accounting Policies/Description of accounting policy for business combinations?labellanguage=en&period=1"]
["Description of accounting policy for business combinations and goodwill","pp://Accounting Policies/Description of accounting policy for business combinations and goodwill?labellanguage=en&period=1"]
["Description of accounting policy for cash flows","pp://Accounting Policies/Description of accounting policy for cash flows?labellanguage=en&period=1"]
["Description of accounting policy for collateral","pp://Accounting Policies/Description of accounting policy for collateral?labellanguage=en&period=1"]
["Description of accounting policy for construction in progress","pp://Accounting Policies/Description of accounting policy for construction in progress?labellanguage=en&period=1"]
["Description of accounting policy for contingent liabilities and contingent assets","pp://Accounting Policies/Description of accounting policy for contingent liabilities and contingent assets?labellanguage=en&period=1"]
["Description of accounting policy for customer acquisition costs","pp://Accounting Policies/Description of accounting policy for customer acquisition costs?labellanguage=en&period=1"]
["Description of accounting policy for customer loyalty programmes","pp://Accounting Policies/Description of accounting policy for customer loyalty programmes?labellanguage=en&period=1"]
["Description of accounting policy for decommissioning, restoration and rehabilitation provisions","pp://Accounting Policies/Description of accounting policy for decommissioning, restoration and rehabilitation provisions?labellanguage=en&period=1"]
["Description of accounting policy for deferred acquisition costs arising from insurance contracts","pp://Accounting Policies/Description of accounting policy for deferred acquisition costs arising from insurance contracts?labellanguage=en&period=1"]
["Description of accounting policy for deferred income tax","pp://Accounting Policies/Description of accounting policy for deferred income tax?labellanguage=en&period=1"]
["Description of accounting policy for depreciation expense","pp://Accounting Policies/Description of accounting policy for depreciation expense?labellanguage=en&period=1"]
["Description of accounting policy for derecognition of financial instruments","pp://Accounting Policies/Description of accounting policy for derecognition of financial instruments?labellanguage=en&period=1"]
["Description of accounting policy for derivative financial instruments","pp://Accounting Policies/Description of accounting policy for derivative financial instruments?labellanguage=en&period=1"]
["Description of accounting policy for derivative financial instruments and hedging","pp://Accounting Policies/Description of accounting policy for derivative financial instruments and hedging?labellanguage=en&period=1"]
["Description of accounting policy for determining components of cash and cash equivalents","pp://Accounting Policies/Description of accounting policy for determining components of cash and cash equivalents?labellanguage=en&period=1"]
["Description of accounting policy for discontinued operations","pp://Accounting Policies/Description of accounting policy for discontinued operations?labellanguage=en&period=1"]
["Description of accounting policy for discounts and rebates","pp://Accounting Policies/Description of accounting policy for discounts and rebates?labellanguage=en&period=1"]
["Description of accounting policy for dividends","pp://Accounting Policies/Description of accounting policy for dividends?labellanguage=en&period=1"]
["Description of accounting policy for earnings per share","pp://Accounting Policies/Description of accounting policy for earnings per share?labellanguage=en&period=1"]
["Description of accounting policy for emission rights","pp://Accounting Policies/Description of accounting policy for emission rights?labellanguage=en&period=1"]
["Description of accounting policy for employee benefits","pp://Accounting Policies/Description of accounting policy for employee benefits?labellanguage=en&period=1"]
["Description of accounting policy for environment related expense","pp://Accounting Policies/Description of accounting policy for environment related expense?labellanguage=en&period=1"]
["Description of accounting policy for exceptional items","pp://Accounting Policies/Description of accounting policy for exceptional items?labellanguage=en&period=1"]
["Description of accounting policy for expenses","pp://Accounting Policies/Description of accounting policy for expenses?labellanguage=en&period=1"]
["Description of accounting policy for exploration and evaluation expenditures","pp://Accounting Policies/Description of accounting policy for exploration and evaluation expenditures?labellanguage=en&period=1"]
["Description of accounting policy for fair value measurement","pp://Accounting Policies/Description of accounting policy for fair value measurement?labellanguage=en&period=1"]
["Description of accounting policy for fee and commission income and expense","pp://Accounting Policies/Description of accounting policy for fee and commission income and expense?labellanguage=en&period=1"]
["Description of accounting policy for finance costs","pp://Accounting Policies/Description of accounting policy for finance costs?labellanguage=en&period=1"]
["Description of accounting policy for finance income and costs","pp://Accounting Policies/Description of accounting policy for finance income and costs?labellanguage=en&period=1"]
["Description of accounting policy for financial assets","pp://Accounting Policies/Description of accounting policy for financial assets?labellanguage=en&period=1"]
["Description of accounting policy for financial guarantees","pp://Accounting Policies/Description of accounting policy for financial guarantees?labellanguage=en&period=1"]
["Description of accounting policy for financial instruments","pp://Accounting Policies/Description of accounting policy for financial instruments?labellanguage=en&period=1"]
["Description of accounting policy for financial instruments at fair value through profit or loss","pp://Accounting Policies/Description of accounting policy for financial instruments at fair value through profit or loss?labellanguage=en&period=1"]
["Description of accounting policy for financial liabilities","pp://Accounting Policies/Description of accounting policy for financial liabilities?labellanguage=en&period=1"]
["Description of accounting policy for foreign currency translation","pp://Accounting Policies/Description of accounting policy for foreign currency translation?labellanguage=en&period=1"]
["Description of accounting policy for franchise fees","pp://Accounting Policies/Description of accounting policy for franchise fees?labellanguage=en&period=1"]
["Description of accounting policy for functional currency","pp://Accounting Policies/Description of accounting policy for functional currency?labellanguage=en&period=1"]
["Description of accounting policy for goodwill","pp://Accounting Policies/Description of accounting policy for goodwill?labellanguage=en&period=1"]
["Description of accounting policy for government grants","pp://Accounting Policies/Description of accounting policy for government grants?labellanguage=en&period=1"]
["Description of accounting policy for hedging","pp://Accounting Policies/Description of accounting policy for hedging?labellanguage=en&period=1"]
["Description of accounting policy for held-to-maturity investments","pp://Accounting Policies/Description of accounting policy for held-to-maturity investments?labellanguage=en&period=1"]
["Description of accounting policy for impairment of assets","pp://Accounting Policies/Description of accounting policy for impairment of assets?labellanguage=en&period=1"]
["Description of accounting policy for impairment of financial assets","pp://Accounting Policies/Description of accounting policy for impairment of financial assets?labellanguage=en&period=1"]
["Description of accounting policy for impairment of non-financial assets","pp://Accounting Policies/Description of accounting policy for impairment of non-financial assets?labellanguage=en&period=1"]
["Description of accounting policy for income tax","pp://Accounting Policies/Description of accounting policy for income tax?labellanguage=en&period=1"]
["Description of accounting policy for insurance contracts and related assets, liabilities, income and expense","pp://Accounting Policies/Description of accounting policy for insurance contracts and related assets, liabilities, income and expense?labellanguage=en&period=1"]
["Description of accounting policy for intangible assets and goodwill","pp://Accounting Policies/Description of accounting policy for intangible assets and goodwill?labellanguage=en&period=1"]
["Description of accounting policy for intangible assets other than goodwill","pp://Accounting Policies/Description of accounting policy for intangible assets other than goodwill?labellanguage=en&period=1"]
["Description of accounting policy for interest income and expense","pp://Accounting Policies/Description of accounting policy for interest income and expense?labellanguage=en&period=1"]
["Description of accounting policy for investment in associates","pp://Accounting Policies/Description of accounting policy for investment in associates?labellanguage=en&period=1"]
["Description of accounting policy for investment in associates and joint ventures","pp://Accounting Policies/Description of accounting policy for investment in associates and joint ventures?labellanguage=en&period=1"]
["Description of accounting policy for investments in joint ventures","pp://Accounting Policies/Description of accounting policy for investments in joint ventures?labellanguage=en&period=1"]
["Description of accounting policy for investment property","pp://Accounting Policies/Description of accounting policy for investment property?labellanguage=en&period=1"]
["Description of accounting policy for investments other than investments accounted for using equity method","pp://Accounting Policies/Description of accounting policy for investments other than investments accounted for using equity method?labellanguage=en&period=1"]
["Description of accounting policy for issued capital","pp://Accounting Policies/Description of accounting policy for issued capital?labellanguage=en&period=1"]
["Description of accounting policy for leases","pp://Accounting Policies/Description of accounting policy for leases?labellanguage=en&period=1"]
["Description of accounting policy for loans and receivables","pp://Accounting Policies/Description of accounting policy for loans and receivables?labellanguage=en&period=1"]
["Description of accounting policy for measuring inventories","pp://Accounting Policies/Description of accounting policy for measuring inventories?labellanguage=en&period=1"]
["Description of accounting policy for mining assets","pp://Accounting Policies/Description of accounting policy for mining assets?labellanguage=en&period=1"]
["Description of accounting policy for mining rights","pp://Accounting Policies/Description of accounting policy for mining rights?labellanguage=en&period=1"]
["Description of accounting policy for non-current assets or disposal groups classified as held for sale","pp://Accounting Policies/Description of accounting policy for non-current assets or disposal groups classified as held for sale?labellanguage=en&period=1"]
["Description of accounting policy for non-current assets or disposal groups classified as held for sale and discontinued operations","pp://Accounting Policies/Description of accounting policy for non-current assets or disposal groups classified as held for sale and discontinued operations?labellanguage=en&period=1"]
["Description of accounting policy for offsetting of financial instruments","pp://Accounting Policies/Description of accounting policy for offsetting of financial instruments?labellanguage=en&period=1"]
["Description of accounting policy for oil and gas assets","pp://Accounting Policies/Description of accounting policy for oil and gas assets?labellanguage=en&period=1"]
["Description of accounting policy for programming assets","pp://Accounting Policies/Description of accounting policy for programming assets?labellanguage=en&period=1"]
["Description of accounting policy for property, plant and equipment","pp://Accounting Policies/Description of accounting policy for property, plant and equipment?labellanguage=en&period=1"]
["Description of accounting policy for provisions","pp://Accounting Policies/Description of accounting policy for provisions?labellanguage=en&period=1"]
["Description of accounting policy for reclassification of financial instruments","pp://Accounting Policies/Description of accounting policy for reclassification of financial instruments?labellanguage=en&period=1"]
["Description of accounting policy for recognising in profit or loss difference between fair value at initial recognition and transaction price","pp://Accounting Policies/Description of accounting policy for recognising in profit or loss difference between fair value at initial recognition and transaction price?labellanguage=en&period=1"]
["Description of accounting policy for recognition of revenue","pp://Accounting Policies/Description of accounting policy for recognition of revenue?labellanguage=en&period=1"]
["Description of accounting policy for regulatory deferral accounts","pp://Accounting Policies/Description of accounting policy for regulatory deferral accounts?labellanguage=en&period=1"]
["Description of accounting policy for reinsurance","pp://Accounting Policies/Description of accounting policy for reinsurance?labellanguage=en&period=1"]
["Description of accounting policy for repairs and maintenance","pp://Accounting Policies/Description of accounting policy for repairs and maintenance?labellanguage=en&period=1"]
["Description of accounting policy for repurchase and reverse repurchase agreements","pp://Accounting Policies/Description of accounting policy for repurchase and reverse repurchase agreements?labellanguage=en&period=1"]
["Description of accounting policy for research and development expense","pp://Accounting Policies/Description of accounting policy for research and development expense?labellanguage=en&period=1"]
["Description of accounting policy for restricted cash and cash equivalents","pp://Accounting Policies/Description of accounting policy for restricted cash and cash equivalents?labellanguage=en&period=1"]
["Description of accounting policy for segment reporting","pp://Accounting Policies/Description of accounting policy for segment reporting?labellanguage=en&period=1"]
["Description of accounting policy for service concession arrangements","pp://Accounting Policies/Description of accounting policy for service concession arrangements?labellanguage=en&period=1"]
["Description of accounting policy for share-based payment transactions","pp://Accounting Policies/Description of accounting policy for share-based payment transactions?labellanguage=en&period=1"]
["Description of accounting policy for stripping costs","pp://Accounting Policies/Description of accounting policy for stripping costs?labellanguage=en&period=1"]
["Description of accounting policy for subsidiaries","pp://Accounting Policies/Description of accounting policy for subsidiaries?labellanguage=en&period=1"]
["Description of accounting policy for taxes other than income tax","pp://Accounting Policies/Description of accounting policy for taxes other than income tax?labellanguage=en&period=1"]
["Description of accounting policy for termination benefits","pp://Accounting Policies/Description of accounting policy for termination benefits?labellanguage=en&period=1"]
["Description of accounting policy for trade and other payables","pp://Accounting Policies/Description of accounting policy for trade and other payables?labellanguage=en&period=1"]
["Description of accounting policy for trade and other receivables","pp://Accounting Policies/Description of accounting policy for trade and other receivables?labellanguage=en&period=1"]
["Description of accounting policy for trading income and expense","pp://Accounting Policies/Description of accounting policy for trading income and expense?labellanguage=en&period=1"]
["Description of accounting policy for transactions with non-controlling interests","pp://Accounting Policies/Description of accounting policy for transactions with non-controlling interests?labellanguage=en&period=1"]
["Description of accounting policy for transactions with related parties","pp://Accounting Policies/Description of accounting policy for transactions with related parties?labellanguage=en&period=1"]
["Description of accounting policy for treasury shares","pp://Accounting Policies/Description of accounting policy for treasury shares?labellanguage=en&period=1"]
["Description of accounting policy for warrants","pp://Accounting Policies/Description of accounting policy for warrants?labellanguage=en&period=1"]
["Description of other accounting policies relevant to understanding of financial statements","pp://Accounting Policies/Description of other accounting policies relevant to understanding of financial statements?labellanguage=en&period=1"]

{"sheet":"General data DKGAAP","index":2,"n_rows":301,"n_cols":99,"rows_kept":301,"cut":false,"hidden":false,"merged":[[44,1,44,4],[22,1,22,4],[23,1,23,4],[24,1,24,4],[25,1,25,4],[245,1,245,4],[42,1,42,4],[2,1,2,4],[3,1,3,4],[4,1,4,4],[8,1,8,4],[242,1,242,4],[9,1,9,4],[10,1,10,4],[11,1,11,4],[12,1,12,4],[244,1,244,4],[243,1,243,4],[26,1,26,4],[15,1,15,4],[35,1,35,4],[17,3,17,4],[41,1,41,4],[17,1,17,2],[13,1,13,4],[14,1,14,4],[50,1,50,4],[51,1,51,4],[52,1,52,4],[38,1,38,4],[53,1,53,4],[34,1,34,4],[47,1,47,4],[27,1,27,4],[28,1,28,4],[29,1,29,4],[30,1,30,4],[31,1,31,4],[32,1,32,4],[33,1,33,4],[18,1,18,4],[19,1,19,4],[20,1,20,4],[21,1,21,4],[48,1,48,4],[49,1,49,4],[43,1,43,4],[45,1,45,4],[68,1,68,4],[69,1,69,4],[70,1,70,4],[71,1,71,4],[79,1,79,4],[56,1,56,4],[57,1,57,4],[58,1,58,4],[59,1,59,4],[60,1,60,4],[61,1,61,4],[46,1,46,4],[87,1,87,4],[88,1,88,4],[89,1,89,4],[90,1,90,4],[93,1,93,4],[94,1,94,4],[81,1,81,4],[82,1,82,4],[83,1,83,4],[84,1,84,4],[85,1,85,4],[86,1,86,4],[54,1,54,4],[55,1,55,4],[80,1,80,4],[75,1,75,4],[76,1,76,4],[62,1,62,4],[63,1,63,4],[64,1,64,4],[65,1,65,4],[66,1,66,4],[67,1,67,4],[101,1,101,4],[102,1,102,4],[103,1,103,4],[104,1,104,4],[105,1,105,4],[106,1,106,4],[95,1,95,4],[96,1,96,4],[97,1,97,4],[98,1,98,4],[99,1,99,4],[100,1,100,4],[113,1,113,4],[114,1,114,4],[115,1,115,4],[116,1,116,4],[117,1,117,4],[118,1,118,4],[107,1,107,4],[108,1,108,4],[109,1,109,4],[110,1,110,4],[111,1,111,4],[112,1,112,4],[125,1,125,4],[126,1,126,4],[127,1,127,4],[128,1,128,4],[129,1,129,4],[130,1,130,4],[119,1,119,4],[120,1,120,4],[121,1,121,4],[122,1,122,4],[123,1,123,4],[124,1,124,4],[139,1,139,4],[142,1,142,4],[143,1,143,4],[146,1,146,4],[147,1,147,4],[148,1,148,4],[131,1,131,4],[132,1,132,4],[135,1,135,4],[136,1,136,4],[137,1,137,4],[138,1,138,4],[159,1,159,4],[160,1,160,4],[161,1,161,4],[162,1,162,4],[163,1,163,4],[164,1,164,4],[149,1,149,4],[152,1,152,4],[153,1,153,4],[156,1,156,4],[157,1,157,4],[158,1,158,4],[173,1,173,4],[174,1,174,4],[175,1,175,4],[176,1,176,4],[177,1,177,4],[178,1,178,4],[165,1,165,4],[166,1,166,4],[167,1,167,4],[168,1,168,4],[169,1,169,4],[170,1,170,4],[185,1,185,4],[186,1,186,4],[187,1,187,4],[190,1,190,4],[191,1,191,4],[192,1,192,4],[179,1,179,4],[180,1,180,4],[181,1,181,4],[182,1,182,4],[183,1,183,4],[184,1,184,4],[201,1,201,4],[202,1,202,4],[203,1,203,4],[204,1,204,4],[206,1,206,4],[207,1,207,4],[193,1,193,4],[194,1,194,4],[195,1,195,4],[198,1,198,4],[199,1,199,4],[200,1,200,4],[238,1,238,4],[239,1,239,4],[232,1,232,4],[233,1,233,4],[234,1,234,4],[235,1,235,4],[236,1,236,4],[237,1,237,4],[224,1,224,4],[225,1,225,4],[226,1,226,4],[227,1,227,4],[230,1,230,4],[231,1,231,4],[216,1,216,4],[219,1,219,4],[220,1,220,4],[221,1,221,4],[222,1,222,4],[223,1,223,4],[208,1,208,4],[209,1,209,4],[210,1,210,4],[211,1,211,4],[212,1,212,4],[215,1,215,4]]}
[null,null,null,null,null,"Range name","Defaults x4 columns",null,null,null,"Adjusted values x4 columns",{"$f":"ISERROR(INDIRECT(\"'General Data ESEF'!PP_Language\"))","v":false},{"$f":"IFERROR(MATCH(PP_Language,PP_Languages,0),1)","v":1},{"$f":"IF(ISBLANK(INDEX(PP_Locale,2,M1)),1,M1)","v":1},"Current","EN","BG","CS","DA","DE","EL","ES","ET","FI","FR","HR","HU","IT","LT","LV","MT","NL","NO","PL","PT","RO","SK","SL","SV",{"$f":"IFERROR(MATCH(PP_CountryCode,PP_Countries,0),1)","v":1},"EU","AT","BE","BG","CH","CY","CZ","DE","DK","EE","EL","ES","FI","FR","GR","HR","HU","IE","IS","IT","LI","LT","LU","LV","MT","NL","NO","PL","PT","RO","SE","SI","SK","UK","Validation lists"]
[{"$f":"\"\"&INDEX(PP_Locale,ROW(),PP_LanguageIndex)&\" 1.0.6.5\"","v":"ParsePort DKGAAP general data, version 1.0.6.5"},null,null,null,null,null,null,null,null,null,null,null,null,null,{"$f":"\"\"&INDEX(PP_Locale,ROW(),PP_LanguageIndex)","v":"ParsePort DKGAAP general data, version"},"ParsePort DKGAAP general data, version",null,null,"ParsePort DKGAAP stamdata, version",null,null,null,null,null,null,null,null,null,null,null,null,null,null,null,null,null,null,null,null,null,null,null,null,null,null,null,null,null,null,null,null,null,null,null,null,null,null,null,null,null,null,null,null,null,null,null,null,null,null,null,null,null,null,null,null,null,null,null,null,null,null,null,null,null,null,null,null,null,null,null,null,null,null,null,null,null,null,"Hypertag properties","Hypertag:"]
[null,{"$f":"\"\"&INDEX($P3:$S3,PP_LanguageIndex)","v":"MANDATORY FIELD"},null,null,null,null,null,null,null,null,null,null,null,null,{"$f":"\"\"&INDEX(PP_Locale,ROW(),PP_LanguageIndex)","v":"MANDATORY FIELD"},"MANDATORY FIELD",null,null,"OBLIGATORISK FELT"]
[null,{"$f":"\"\"&INDEX($P4:$S4,PP_LanguageIndex)","v":"AUTOMATIC FIELD (can be overruled)"},null,null,null,null,null,null,null,null,null,null,null,null,{"$f":"\"\"&INDEX(PP_Locale,ROW(),PP_LanguageIndex)","v":"AUTOMATIC FIELD (can be overruled)"},"AUTOMATIC FIELD (can be overruled)",null,null,"AUTOMATISK FELT (kan overstyres)"]
[null,{"$f":"\"\"&INDEX($P5:$S5,PP_LanguageIndex)","v":"FILL OUT IF INFORMATION IS PRESENT IN REPORT"},null,null,null,null,null,null,null,null,null,null,null,null,{"$f":"\"\"&INDEX(PP_Locale,ROW(),PP_LanguageIndex)","v":"FILL OUT IF INFORMATION IS PRESENT IN REPORT"},"FILL OUT IF INFORMATION IS PRESENT IN REPORT",null,null,"UDFYLDES HVIS INFORMATIONEN FINDES I RAPPORTEN"]
[null,null,null,null,null,null,null,null,null,null,null,null,null,null,{"$f":"\"\"&INDEX(PP_Locale,ROW(),PP_LanguageIndex)","v":""}]
[null,{"$f":"IFERROR(VLOOKUP(\"Period\",PP_Locale,PP_LanguageIndex,FALSE),\"Period\")&\" 1\"&IF(PP_Consolidated,\" \"&IFERROR(VLOOKUP(\"Group\",PP_Locale,PP_LanguageIndex,FALSE),\"Group\"),\"\")","v":"Period 1 Group"},{"$f":"IFERROR(VLOOKUP(\"Period\",PP_Locale,PP_LanguageIndex,FALSE),\"Period\")&\" 2\"&IF(PP_Consolidated,\" \"&IFERROR(VLOOKUP(\"Group\",PP_Locale,PP_LanguageIndex,FALSE),\"Group\"),\"\")","v":"Period 2 Group"},{"$f":"IF(PP_Consolidated,IFERROR(VLOOKUP(\"Period\",PP_Locale,PP_LanguageIndex,FALSE),\"Period\")&\" 1 \"&IFERROR(VLOOKUP(\"Parent\",PP_Locale,PP_LanguageIndex,FALSE),\"Parent\"),\"\")","v":"Period 1 Parent"},{"$f":"IF(PP_Consolidated,IFERROR(VLOOKUP(\"Period\",PP_Locale,PP_LanguageIndex,FALSE),\"Period\")&\" 2 \"&IFERROR(VLOOKUP(\"Parent\",PP_Locale,PP_LanguageIndex,FALSE),\"Parent\"),\"\")","v":"Period 2 Parent"},null,{"$f":"IFERROR(VLOOKUP(\"Period\",PP_Locale,PP_LanguageIndex,FALSE),\"Period\")&\" 1\"&IF(PP_Consolidated,\" \"&IFERROR(VLOOKUP(\"Group\",PP_Locale,PP_LanguageIndex,FALSE),\"Group\"),\"\")","v":"Period 1 Group"},{"$f":"IFERROR(VLOOKUP(\"Period\",PP_Locale,PP_LanguageIndex,FALSE),\"Period\")&\" 2\"&IF(PP_Consolidated,\" \"&IFERROR(VLOOKUP(\"Group\",PP_Locale,PP_LanguageIndex,FALSE),\"Group\"),\"\")","v":"Period 2 Group"},{"$f":"IF(PP_Consolidated,IFERROR(VLOOKUP(\"Period\",PP_Locale,PP_LanguageIndex,FALSE),\"Period\")&\" 1 \"&IFERROR(VLOOKUP(\"Parent\",PP_Locale,PP_LanguageIndex,FALSE),\"Parent\"),\"\")","v":"Period 1 Parent"},{"$f":"IF(PP_Consolidated,IFERROR(VLOOKUP(\"Period\",PP_Locale,PP_LanguageIndex,FALSE),\"Period\")&\" 2 \"&IFERROR(VLOOKUP(\"Parent\",PP_Locale,PP_LanguageIndex,FALSE),\"Parent\"),\"\")","v":"Period 2 Parent"},{"$f":"B7","v":"Period 1 Group"},{"$f":"C7","v":"Period 2 Group"},"Period 1 Parent","Period 2 Parent",{"$f":"\"\"&INDEX(PP_Locale,ROW(),PP_LanguageIndex)","v":""}]
[{"$f":"\"\"&INDEX(PP_Locale,ROW(),PP_LanguageIndex)","v":"General:"},null,null,null,null,null,null,null,null,null,null,null,null,null,{"$f":"\"\"&INDEX(PP_Locale,ROW(),PP_LanguageIndex)","v":"General:"},"General:",null,null,"Generelt:",null,null,null,null,null,null,null,null,null,null,null,null,null,null,null,null,null,null,null,null,null,null,null,null,null,null,null,null,null,null,null,null,null,null,null,null,null,null,null,null,null,null,null,null,null,null,null,null,null,null,null,null,null,null,null,{"$f":"SUBSTITUTE(\"/General data \"&PP_TaxonomyId&\"(headers=\"&CELL(\"address\",$K$7)&\":\"&CELL(\"address\",$N$7)&\"[language=\"&LOWER(INDEX(PP_Languages,0,PP_LanguageIndex))&\"],labels=\"&CELL(\"address\",A8)&\":\"&CELL(\"address\",A247)&\"[language=\"&LOWER(INDEX(PP_Languages,0,PP_LanguageIndex))&\"],values=\"&CELL(\"address\",K8)&\":\"&CELL(\"address\",N247)&\"[language=\"&LOWER(PP_Language)&\"])\",\"$\",\"\")","v":"/General data DKGAAP(headers=K7:N7[language=en],labels=A8:A247[language=en],values=K8:N247[language=en])"}]
[{"$f":"\"\"&INDEX(PP_Locale,ROW(),PP_LanguageIndex)","v":"Report language code"},{"$f":"IFERROR(INDIRECT(\"'General Data ESEF'!PP_Language\"),\"DA\")","v":"EN"},null,null,null,"PP_Language",{"$f":"IFERROR(INDIRECT(\"'General Data ESEF'!PP_Language\"),\"DA\")","v":"EN"},null,null,null,null,null,null,null,{"$f":"\"\"&INDEX(PP_Locale,ROW(),PP_LanguageIndex)","v":"Report language code"},"Report language code",null,null,"Rapport sprogkode","Bericht Sprachcode",null,"Código de lenguaje",null,null,"Code de langue",null,null,"Codice lingua",null,null,null,null,null,"Kod języka"]
[{"$f":"\"\"&INDEX(PP_Locale,ROW(),PP_LanguageIndex)","v":"Label language code"},{"$f":"PP_Language","v":"EN"},{"$f":"PP_Language","v":"EN"},{"$f":"PP_Language","v":"EN"},{"$f":"PP_Language","v":"EN"},"PP_LabelLanguage",{"$f":"PP_Language","v":"EN"},null,null,null,null,null,null,null,{"$f":"\"\"&INDEX(PP_Locale,ROW(),PP_LanguageIndex)","v":"Label language code"},"Label language code",null,null,"Label sprogkode","Tag-Sprachcode",null,"Código de lenguaje de la etiqueta",null,null,"Code de langue de l'étiquette",null,null,"Codice lingua etichetta",null,null,null,null,null,"Kod języka etykiety"]
[{"$f":"\"\"&INDEX(PP_Locale,ROW(),PP_LanguageIndex)","v":"Currency code"},{"$f":"IFERROR(INDIRECT(\"'General Data ESEF'!PP_Currency\"),\"DKK\")","v":"EUR"},null,null,null,"PP_Currency",{"$f":"IFERROR(INDIRECT(\"'General Data ESEF'!PP_Currency\"),\"DKK\")","v":"EUR"},null,null,null,{"$f":"\"\"&UPPER(B11)","v":"EUR"},null,null,null,{"$f":"\"\"&INDEX(PP_Locale,ROW(),PP_LanguageIndex)","v":"Currency code"},"Currency code",null,null,"Valutakode","Währungscode",null,"Código de moneda",null,null,"Code devise",null,null,"Codice valuta",null,null,null,null,null,"Kod waluty"]
[{"$f":"\"\"&INDEX(PP_Locale,ROW(),PP_LanguageIndex)","v":"Scale"},{"$f":"IFERROR(INDIRECT(\"'General Data ESEF'!PP_MonetaryScaling\"),0)","v":6},null,null,null,"PP_MonetaryScaling",{"$f":"IFERROR(INDIRECT(\"'General Data ESEF'!PP_MonetaryScaling\"),0)","v":6},null,null,null,null,null,null,null,{"$f":"\"\"&INDEX(PP_Locale,ROW(),PP_LanguageIndex)","v":"Scale"},"Scale",null,null,"Skalering","Skalierung",null,"Redondeo",null,null,"Mise à l'échelle",null,null,"Ridimensionamento",null,null,null,null,null,"Skalowanie",null,null,null,null,null,null,null,null,null,null,null,null,null,null,null,null,null,null,null,null,null,null,null,null,null,null,null,null,null,null,null,null,null,null,null,null,null,null,null,null,0,3,6,9]
[{"$f":"\"\"&INDEX(PP_Locale,ROW(),PP_LanguageIndex)","v":"Consolidated"},{"$f":"IFERROR(INDIRECT(\"'General Data ESEF'!PP_Consolidated\"),FALSE)","v":true},null,null,null,"PP_Consolidated",{"$f":"IFERROR(INDIRECT(\"'General Data ESEF'!PP_Consolidated\"),FALSE)","v":true},null,null,null,null,null,null,null,{"$f":"\"\"&INDEX(PP_Locale,ROW(),PP_LanguageIndex)","v":"Consolidated"},"Consolidated",null,null,"Koncern",null,null,null,null,null,null,null,null,null,null,null,null,null,null,null,null,null,null,null,null,null,null,null,null,null,null,null,null,null,null,null,null,null,null,null,null,null,null,null,null,null,null,null,null,null,null,null,null,null,null,null,null,null,null,null,false,true]
[{"$f":"\"\"&INDEX(PP_Locale,ROW(),PP_LanguageIndex)","v":"Report type"},{"$f":"IF(OR(EDATE(PP_Period1StartDate,3)-1=PP_Period1EndDate,EDATE(PP_Period1StartDate,9)-1=PP_Period1EndDate),IFERROR(VLOOKUP(\"Interim report (other than 6 months)\",PP_Locale,PP_LanguageIndex,FALSE),\"Interim report (other than 6 months)\"),IF(EDATE(PP_Period1StartDate,6)-1=PP_Period1EndDate,IFERROR(VLOOKUP(\"Interim report (6 months)\",PP_Locale,PP_LanguageIndex,FALSE),\"Interim report (6 months)\"),IFERROR(VLOOKUP(\"Annual report\",PP_Locale,PP_LanguageIndex,FALSE),\"Annual report\")))","v":"Annual report"},null,null,null,"PP_InformationOnTypeOfSubmittedReport",{"$f":"IF(OR(EDATE(PP_Period1StartDate,3)-1=PP_Period1EndDate,EDATE(PP_Period1StartDate,9)-1=PP_Period1EndDate),IFERROR(VLOOKUP(\"Interim report (other than 6 months)\",PP_Locale,PP_LanguageIndex,FALSE),\"Interim report (other than 6 months)\"),IF(EDATE(PP_Period1StartDate,6)-1=PP_Period1EndDate,IFERROR(VLOOKUP(\"Interim report (6 months)\",PP_Locale,PP_LanguageIndex,FALSE),\"Interim report (6 months)\"),IFERROR(VLOOKUP(\"Annual report\",PP_Locale,PP_LanguageIndex,FALSE),\"Annual report\")))","v":"Annual report"},null,null,null,{"$f":"\"\"&B14","v":"Annual report"},null,null,null,{"$f":"\"\"&INDEX(PP_Locale,ROW(),PP_LanguageIndex)","v":"Report type"},"Report type",null,null,"Rapporttype",null,null,null,null,null,null,null,null,null,null,null,null,null,null,null,null,null,null,null,null,null,null,null,null,null,null,null,null,null,null,null,null,null,null,null,null,null,null,null,null,null,null,null,null,null,null,null,null,null,null,null,null,null,null,null,{"$f":"IFERROR(VLOOKUP(\"Annual report\",PP_Locale,PP_LanguageIndex,FALSE),\"Annual report\")","v":"Annual report"},{"$f":"IFERROR(VLOOKUP(\"Liquidation accounts\",PP_Locale,PP_LanguageIndex,FALSE),\"Liquidation accounts\")","v":"Liquidation accounts"},{"$f":"IFERROR(VLOOKUP(\"Interim report (6 months)\",PP_Locale,PP_LanguageIndex,FALSE),\"Interim report (6 months)\")","v":"Interim report (6 months)"},{"$f":"IFERROR(VLOOKUP(\"Interim report (other than 6 months)\",PP_Locale,PP_LanguageIndex,FALSE),\"Interim report (other than 6 months)\")","v":"Interim report (other than 6 months)"},{"$f":"IFERROR(VLOOKUP(\"Erklæring om undtagelse fra aflæggelse årsrapport\",PP_Locale,PP_LanguageIndex,FALSE),\"Erklæring om undtagelse fra aflæggelse årsrapport\")","v":"Erklæring om undtagelse fra aflæggelse årsrapport"},{"$f":"IFERROR(VLOOKUP(\"Erklæring vedr. omsætningsgrænse [Lukkelov]\",PP_Locale,PP_LanguageIndex,FALSE),\"Erklæring vedr. omsætningsgrænse [Lukkelov]\")","v":"Erklæring vedr. omsætningsgrænse [Lukkelov]"}]
[{"$f":"\"\"&INDEX(PP_Locale,ROW(),PP_LanguageIndex)","v":"Type of auditor assistance"},{"$f":"IF(PP_InformationOnTypeOfSubmittedReport=VLOOKUP(\"Annual report\",PP_Locale,PP_LanguageIndex,FALSE),IFERROR(VLOOKUP(\"Auditor's report on audited financial statements\",PP_Locale,PP_LanguageIndex,FALSE),\"Auditor's report on audited financial statements\"),IFERROR(VLOOKUP(\"No audit assistance\",PP_Locale,PP_LanguageIndex,FALSE),\"No audit assistance\"))","v":"Auditor's report on audited financial statements"},null,null,null,"PP_TypeOfAuditorAssistance",{"$f":"IF(PP_InformationOnTypeOfSubmittedReport=VLOOKUP(\"Annual report\",PP_Locale,PP_LanguageIndex,FALSE),IFERROR(VLOOKUP(\"Auditor's report on audited financial statements\",PP_Locale,PP_LanguageIndex,FALSE),\"Auditor's report on audited financial statements\"),IFERROR(VLOOKUP(\"No audit assistance\",PP_Locale,PP_LanguageIndex,FALSE),\"No audit assistance\"))","v":"Auditor's report on audited financial statements"},null,null,null,{"$f":"\"\"&B15","v":"Auditor's report on audited financial statements"},null,null,null,{"$f":"\"\"&INDEX(PP_Locale,ROW(),PP_LanguageIndex)","v":"Type of auditor assistance"},"Type of auditor assistance",null,null,"Type af revisorbistand",null,null,null,null,null,null,null,null,null,null,null,null,null,null,null,null,null,null,null,null,null,null,null,null,null,null,null,null,null,null,null,null,null,null,null,null,null,null,null,null,null,null,null,null,null,null,null,null,null,null,null,null,null,null,null,{"$f":"IFERROR(VLOOKUP(\"Auditor's report on audited financial statements\",PP_Locale,PP_LanguageIndex,FALSE),\"Auditor's report on audited financial statements\")","v":"Auditor's report on audited financial statements"},{"$f":"IFERROR(VLOOKUP(\"Auditor's report on extended review\",PP_Locale,PP_LanguageIndex,FALSE),\"Auditor's report on extended review\")","v":"Auditor's report on extended review"},{"$f":"IFERROR(VLOOKUP(\"The independent auditor's reports (Review)\",PP_Locale,PP_LanguageIndex,FALSE),\"The independent auditor's reports (Review)\")","v":"The independent auditor's reports (Review)"},{"$f":"IFERROR(VLOOKUP(\"The independent auditor's reports (Other assurance Reports)\",PP_Locale,PP_LanguageIndex,FALSE),\"The independent auditor's reports (Other assurance Reports)\")","v":"The independent auditor's reports (Other assurance Reports)"},{"$f":"IFERROR(VLOOKUP(\"Auditor's reports (Other non-assurance reports)\",PP_Locale,PP_LanguageIndex,FALSE),\"Auditor's reports (Other non-assurance reports)\")","v":"Auditor's reports (Other non-assurance reports)"},{"$f":"IFERROR(VLOOKUP(\"No audit assistance\",PP_Locale,PP_LanguageIndex,FALSE),\"No audit assistance\")","v":"No audit assistance"}]
[{"$f":"\"\"&INDEX(PP_Locale,ROW(),PP_LanguageIndex)","v":"Tool for preparing the XBRL-instance document"},"ParsePort XBRL Converter",{"$f":"\"\"&LOOKUP(PP_Language,{\"DA\";\"EN\"},{\"Balance (kontoform) / resultatopgørelse (artsopdelt)\";\"Balance sheet (account form) / income statement (by nature)\"})","v":"Balance sheet (account form) / income statement (by nature)"},{"$f":"\"\"&LOOKUP(PP_Language,{\"DA\";\"EN\"},{\"Balance (kontoform) / resultatopgørelse (artsopdelt)\";\"Balance sheet (account form) / income statement (by nature)\"})","v":"Balance sheet (account form) / income statement (by nature)"},{"$f":"\"\"&LOOKUP(PP_Language,{\"DA\";\"EN\"},{\"Balance (kontoform) / resultatopgørelse (artsopdelt)\";\"Balance sheet (account form) / income statement (by nature)\"})","v":"Balance sheet (account form) / income statement (by nature)"},"PP_ToolForPreparingTheXBRLInstanceDocument","ParsePort XBRL Converter",null,null,null,{"$f":"\"\"&B16","v":"ParsePort XBRL Converter"},null,null,null,{"$f":"\"\"&INDEX(PP_Locale,ROW(),PP_LanguageIndex)","v":"Tool for preparing the XBRL-instance document"},"Tool for preparing the XBRL-instance document",null,null,"Systemværktøj til udarbejdelse af XBRL-instansen"]
[null,null,null,null,null,null,null,null,null,null,null,null,null,null,{"$f":"\"\"&INDEX(PP_Locale,ROW(),PP_LanguageIndex)","v":""}]
[{"$f":"\"\"&INDEX(PP_Locale,ROW(),PP_LanguageIndex)","v":"Dates:"},null,null,null,null,null,null,null,null,null,null,null,null,null,{"$f":"\"\"&INDEX(PP_Locale,ROW(),PP_LanguageIndex)","v":"Dates:"},"Dates:",null,null,"Datoer:"]
[{"$f":"\"\"&INDEX(PP_Locale,ROW(),PP_LanguageIndex)","v":"Start date of reporting period 1"},{"$f":"IFERROR(INDIRECT(\"'General Data ESEF'!PP_StartDatePeriod1\"),DATE(YEAR(TODAY())-1,1,1))","v":"2020-01-01"},null,null,null,"PP_Period1StartDate",{"$f":"IFERROR(INDIRECT(\"'General Data ESEF'!PP_StartDatePeriod1\"),DATE(YEAR(TODAY())-1,1,1))","v":43831},null,null,null,{"$f":"IF(COUNTBLANK(B19),\"\",TEXT(YEAR(B19),\"0000\")&\"-\"&TEXT(MONTH(B19),\"00\")&\"-\"&TEXT(DAY(B19),\"00\"))","v":"2020-01-01"},null,null,null,{"$f":"\"\"&INDEX(PP_Locale,ROW(),PP_LanguageIndex)","v":"Start date of reporting period 1"},"Start date of reporting period 1",null,null,"Startdato for periode 1","Startdatum des Berichtszeitraums 1",null,"Fecha de inicio del período del informe 1",null,null,"Date de début de la période de reporting 1",null,null,"Data di inizio del periodo di riferimento 1",null,null,null,null,null,"Data rozpoczęcia okresu sprawozdawczego 1"]
[{"$f":"\"\"&INDEX(PP_Locale,ROW(),PP_LanguageIndex)","v":"End date of reporting period 1"},{"$f":"IFERROR(INDIRECT(\"'General Data ESEF'!PP_EndDatePeriod1\"),DATE(YEAR(TODAY())-1,12,31))","v":"2020-12-31"},null,null,null,"PP_Period1EndDate",{"$f":"IFERROR(INDIRECT(\"'General Data ESEF'!PP_EndDatePeriod1\"),DATE(YEAR(TODAY())-1,12,31))","v":44196},null,null,null,{"$f":"IF(COUNTBLANK(B20),\"\",TEXT(YEAR(B20),\"0000\")&\"-\"&TEXT(MONTH(B20),\"00\")&\"-\"&TEXT(DAY(B20),\"00\"))","v":"2020-12-31"},null,null,null,{"$f":"\"\"&INDEX(PP_Locale,ROW(),PP_LanguageIndex)","v":"End date of reporting period 1"},"End date of reporting period 1",null,null,"Slutdato for periode 1","Enddatum des Berichtszeitraums 1",null,"Fecha final del período del informe 1",null,null,"Date de fin de la période de reporting 1",null,null,"Data di fine del periodo di riferimento 1",null,null,null,null,null,"Data zakończenia okresu sprawozdawczego 1"]
[{"$f":"\"\"&INDEX(PP_Locale,ROW(),PP_LanguageIndex)","v":"Start date of reporting period 2"},{"$f":"IFERROR(INDIRECT(\"'General Data ESEF'!PP_StartDatePeriod2\"),DATE(YEAR(PP_Period1StartDate)-1,MONTH(PP_Period1StartDate),DAY(PP_Period1StartDate)))","v":"2019-01-01"},null,null,null,"PP_Period2StartDate",{"$f":"IFERROR(INDIRECT(\"'General Data ESEF'!PP_StartDatePeriod2\"),DATE(YEAR(PP_Period1StartDate)-1,MONTH(PP_Period1StartDate),DAY(PP_Period1StartDate)))","v":43466},null,null,null,{"$f":"IF(COUNTBLANK(B21),\"\",TEXT(YEAR(B21),\"0000\")&\"-\"&TEXT(MONTH(B21),\"00\")&\"-\"&TEXT(DAY(B21),\"00\"))","v":"2019-01-01"},null,null,null,{"$f":"\"\"&INDEX(PP_Locale,ROW(),PP_LanguageIndex)","v":"Start date of reporting period 2"},"Start date of reporting period 2",null,null,"Startdato for periode 2","Startdatum des Berichtszeitraums 2",null,"Fecha de inicio del período del informe 2",null,null,"Date de début de la période de reporting 2",null,null,"Data di inizio del periodo di riferimento 2",null,null,null,null,null,"Data rozpoczęcia okresu sprawozdawczego 2"]
[{"$f":"\"\"&INDEX(PP_Locale,ROW(),PP_LanguageIndex)","v":"End date of reporting period 2"},{"$f":"IFERROR(INDIRECT(\"'General Data ESEF'!PP_EndDatePeriod2\"),IF(COUNTBLANK(PP_Period2StartDate),\"\",PP_Period1StartDate-1))","v":"2019-12-31"},null,null,null,"PP_Period2EndDate",{"$f":"IFERROR(INDIRECT(\"'General Data ESEF'!PP_EndDatePeriod2\"),IF(COUNTBLANK(PP_Period2StartDate),\"\",PP_Period1StartDate-1))","v":43830},null,null,null,{"$f":"IF(COUNTBLANK(B22),\"\",TEXT(YEAR(B22),\"0000\")&\"-\"&TEXT(MONTH(B22),\"00\")&\"-\"&TEXT(DAY(B22),\"00\"))","v":"2019-12-31"},null,null,null,{"$f":"\"\"&INDEX(PP_Locale,ROW(),PP_LanguageIndex)","v":"End date of reporting period 2"},"End date of reporting period 2",null,null,"Slutdato for periode 2","Enddatum des Berichtszeitraums 2",null,"Fecha final del período del informe 2",null,null,"Date de fin de la période de reporting 2",null,null,"Data di fine del periodo di riferimento 2",null,null,null,null,null,"Data zakończenia okresu sprawozdawczego 2"]
[{"$f":"\"\"&INDEX(PP_Locale,ROW(),PP_LanguageIndex)","v":"Start date of reporting period 3"},{"$f":"IFERROR(INDIRECT(\"'General Data ESEF'!PP_StartDatePeriod3\"),DATE(YEAR(PP_Period1StartDate)-2,MONTH(PP_Period1StartDate),DAY(PP_Period1StartDate)))","v":"2018-01-01"},null,null,null,"PP_Period3StartDate",{"$f":"IFERROR(INDIRECT(\"'General Data ESEF'!PP_StartDatePeriod3\"),DATE(YEAR(PP_Period1StartDate)-2,MONTH(PP_Period1StartDate),DAY(PP_Period1StartDate)))","v":43101},null,null,null,{"$f":"IF(COUNTBLANK(B23),\"\",TEXT(YEAR(B23),\"0000\")&\"-\"&TEXT(MONTH(B23),\"00\")&\"-\"&TEXT(DAY(B23),\"00\"))","v":"2018-01-01"},null,null,null,{"$f":"\"\"&INDEX(PP_Locale,ROW(),PP_LanguageIndex)","v":"Start date of reporting period 3"},"Start date of reporting period 3",null,null,"Startdato for periode 3","Startdatum des Berichtszeitraums 3",null,"Fecha de inicio del período del informe 3",null,null,"Date de début de la période de reporting 3",null,null,"Data di inizio del periodo di riferimento 3",null,null,null,null,null,"Data rozpoczęcia okresu sprawozdawczego 3"]
[{"$f":"\"\"&INDEX(PP_Locale,ROW(),PP_LanguageIndex)","v":"End date of reporting period 3"},{"$f":"IFERROR(INDIRECT(\"'General Data ESEF'!PP_EndDatePeriod3\"),IF(COUNTBLANK(PP_Period3StartDate),\"\",PP_Period2StartDate-1))","v":"2018-12-31"},null,null,null,"PP_Period3EndDate",{"$f":"IFERROR(INDIRECT(\"'General Data ESEF'!PP_EndDatePeriod3\"),IF(COUNTBLANK(PP_Period3StartDate),\"\",PP_Period2StartDate-1))","v":43465},null,null,null,"2018-12-31",null,null,null,{"$f":"\"\"&INDEX(PP_Locale,ROW(),PP_LanguageIndex)","v":"End date of reporting period 3"},"End date of reporting period 3",null,null,"Slutdato for periode 3","Enddatum des Berichtszeitraums 3",null,"Fecha final del período del informe 3",null,null,"Date de fin de la période de reporting 3",null,null,"Data di fine del periodo di riferimento 3",null,null,null,null,null,"Data zakończenia okresu sprawozdawczego 3"]
[{"$f":"\"\"&INDEX(PP_Locale,ROW(),PP_LanguageIndex)","v":"Start date of reporting period 4"},{"$f":"IFERROR(INDIRECT(\"'General Data ESEF'!PP_StartDatePeriod4\"),DATE(YEAR(PP_Period1StartDate)-3,MONTH(PP_Period1StartDate),DAY(PP_Period1StartDate)))","v":"2017-01-01"},null,null,null,"PP_Period4StartDate",{"$f":"IFERROR(INDIRECT(\"'General Data ESEF'!PP_StartDatePeriod4\"),DATE(YEAR(PP_Period1StartDate)-3,MONTH(PP_Period1StartDate),DAY(PP_Period1StartDate)))","v":42736},null,null,null,"2017-01-01",null,null,null,{"$f":"\"\"&INDEX(PP_Locale,ROW(),PP_LanguageIndex)","v":"Start date of reporting period 4"},"Start date of reporting period 4",null,null,"Startdato for periode 4","Startdatum des Berichtszeitraums 4",null,"Fecha de inicio del período del informe 4",null,null,"Date de début de la période de reporting 4",null,null,"Data di inizio del periodo di riferimento 4",null,null,null,null,null,"Data rozpoczęcia okresu sprawozdawczego 4"]
[{"$f":"\"\"&INDEX(PP_Locale,ROW(),PP_LanguageIndex)","v":"End date of reporting period 4"},{"$f":"IFERROR(INDIRECT(\"'General Data ESEF'!PP_EndDatePeriod4\"),IF(COUNTBLANK(PP_Period4StartDate),\"\",PP_Period3StartDate-1))","v":"2017-12-31"},null,null,null,"PP_Period4EndDate",{"$f":"IFERROR(INDIRECT(\"'General Data ESEF'!PP_EndDatePeriod4\"),IF(COUNTBLANK(PP_Period4StartDate),\"\",PP_Period3StartDate-1))","v":43100},null,null,null,"2017-12-31",null,null,null,{"$f":"\"\"&INDEX(PP_Locale,ROW(),PP_LanguageIndex)","v":"End date of reporting period 4"},"End date of reporting period 4",null,null,"Slutdato for periode 4","Enddatum des Berichtszeitraums 4",null,"Fecha final del período del informe 4",null,null,"Date de fin de la période de reporting 4",null,null,"Data di fine del periodo di riferimento 4",null,null,null,null,null,"Data zakończenia okresu sprawozdawczego 4"]
[{"$f":"\"\"&INDEX(PP_Locale,ROW(),PP_LanguageIndex)","v":"Start date of reporting period 5"},{"$f":"IFERROR(INDIRECT(\"'General Data ESEF'!PP_StartDatePeriod5\"),DATE(YEAR(PP_Period1StartDate)-4,MONTH(PP_Period1StartDate),DAY(PP_Period1StartDate)))","v":"2016-01-01"},null,null,null,"PP_Period5StartDate",{"$f":"IFERROR(INDIRECT(\"'General Data ESEF'!PP_StartDatePeriod5\"),DATE(YEAR(PP_Period1StartDate)-4,MONTH(PP_Period1StartDate),DAY(PP_Period1StartDate)))","v":42370},null,null,null,"2016-01-01",null,null,null,{"$f":"\"\"&INDEX(PP_Locale,ROW(),PP_LanguageIndex)","v":"Start date of reporting period 5"},"Start date of reporting period 5",null,null,"Startdato for periode 5","Startdatum des Berichtszeitraums 5",null,"Fecha de inicio del período del informe 5",null,null,"Date de début de la période de reporting 5",null,null,"Data di inizio del periodo di riferimento 5",null,null,null,null,null,"Data rozpoczęcia okresu sprawozdawczego 5"]
[{"$f":"\"\"&INDEX(PP_Locale,ROW(),PP_LanguageIndex)","v":"End date of reporting period 5"},{"$f":"IFERROR(INDIRECT(\"'General Data ESEF'!PP_EndDatePeriod5\"),IF(COUNTBLANK(PP_Period5StartDate),\"\",PP_Period4StartDate-1))","v":"2016-12-31"},null,null,null,"PP_Period5EndDate",{"$f":"IFERROR(INDIRECT(\"'General Data ESEF'!PP_EndDatePeriod5\"),IF(COUNTBLANK(PP_Period5StartDate),\"\",PP_Period4StartDate-1))","v":42735},null,null,null,"2016-12-31",null,null,null,{"$f":"\"\"&INDEX(PP_Locale,ROW(),PP_LanguageIndex)","v":"End date of reporting period 5"},"End date of reporting period 5",null,null,"Slutdato for periode 5","Enddatum des Berichtszeitraums 5",null,"Fecha final del período del informe 5",null,null,"Date de fin de la période de reporting 5",null,null,"Data di fine del periodo di riferimento 5",null,null,null,null,null,"Data zakończenia okresu sprawozdawczego 5"]
[{"$f":"\"\"&INDEX(PP_Locale,ROW(),PP_LanguageIndex)","v":"Start date of reporting period 6"},{"$f":"IFERROR(INDIRECT(\"'General Data ESEF'!PP_StartDatePeriod6\"),DATE(YEAR(PP_Period1StartDate)-5,MONTH(PP_Period1StartDate),DAY(PP_Period1StartDate)))","v":"2015-01-01"},null,null,null,"PP_Period6StartDate",{"$f":"IFERROR(INDIRECT(\"'General Data ESEF'!PP_StartDatePeriod6\"),DATE(YEAR(PP_Period1StartDate)-5,MONTH(PP_Period1StartDate),DAY(PP_Period1StartDate)))","v":42005},null,null,null,"2015-01-01",null,null,null,{"$f":"\"\"&INDEX(PP_Locale,ROW(),PP_LanguageIndex)","v":"Start date of reporting period 6"},"Start date of reporting period 6",null,null,"Startdato for periode 6","Startdatum des Berichtszeitraums 6",null,"Fecha de inicio del período del informe 6",null,null,"Date de début de la période de reporting 6",null,null,"Data di inizio del periodo di riferimento 6",null,null,null,null,null,"Data rozpoczęcia okresu sprawozdawczego 6"]
[{"$f":"\"\"&INDEX(PP_Locale,ROW(),PP_LanguageIndex)","v":"End date of reporting period 6"},{"$f":"IFERROR(INDIRECT(\"'General Data ESEF'!PP_EndDatePeriod6\"),IF(COUNTBLANK(PP_Period6StartDate),\"\",PP_Period5StartDate-1))","v":"2015-12-31"},null,null,null,"PP_Period6EndDate",{"$f":"IFERROR(INDIRECT(\"'General Data ESEF'!PP_EndDatePeriod6\"),IF(COUNTBLANK(PP_Period6StartDate),\"\",PP_Period5StartDate-1))","v":42369},null,null,null,"2015-12-31",null,null,null,{"$f":"\"\"&INDEX(PP_Locale,ROW(),PP_LanguageIndex)","v":"End date of reporting period 6"},"End date of reporting period 6",null,null,"Slutdato for periode 6","Enddatum des Berichtszeitraums 6",null,"Fecha final del período del informe 6",null,null,"Date de fin de la période de reporting 6",null,null,"Data di fine del periodo di riferimento 6",null,null,null,null,null,"Data zakończenia okresu sprawozdawczego 6"]
[{"$f":"\"\"&INDEX(PP_Locale,ROW(),PP_LanguageIndex)","v":"Start date of reporting period 7"},{"$f":"IFERROR(INDIRECT(\"'General Data ESEF'!PP_StartDatePeriod7\"),DATE(YEAR(PP_Period1StartDate)-6,MONTH(PP_Period1StartDate),DAY(PP_Period1StartDate)))","v":"2014-01-01"},null,null,null,"PP_Period7StartDate",{"$f":"IFERROR(INDIRECT(\"'General Data ESEF'!PP_StartDatePeriod7\"),DATE(YEAR(PP_Period1StartDate)-6,MONTH(PP_Period1StartDate),DAY(PP_Period1StartDate)))","v":41640},null,null,null,{"$f":"IF(COUNTBLANK(B31),\"\",TEXT(YEAR(B31),\"0000\")&\"-\"&TEXT(MONTH(B31),\"00\")&\"-\"&TEXT(DAY(B31),\"00\"))","v":"2014-01-01"},null,null,null,{"$f":"\"\"&INDEX(PP_Locale,ROW(),PP_LanguageIndex)","v":"Start date of reporting period 7"},"Start date of reporting period 7",null,null,"Startdato for periode 7","Startdatum des Berichtszeitraums 7",null,"Fecha de inicio del período del informe 7",null,null,"Date de début de la période de reporting 7",null,null,"Data di inizio del periodo di riferimento 7",null,null,null,null,null,"Data rozpoczęcia okresu sprawozdawczego 7"]
[{"$f":"\"\"&INDEX(PP_Locale,ROW(),PP_LanguageIndex)","v":"End date of reporting period 7"},{"$f":"IFERROR(INDIRECT(\"'General Data ESEF'!PP_EndDatePeriod7\"),IF(COUNTBLANK(PP_Period7StartDate),\"\",PP_Period6StartDate-1))","v":"2014-12-31"},null,null,null,"PP_Period7EndDate",{"$f":"IFERROR(INDIRECT(\"'General Data ESEF'!PP_EndDatePeriod7\"),IF(COUNTBLANK(PP_Period7StartDate),\"\",PP_Period6StartDate-1))","v":42004},null,null,null,"2014-12-31",null,null,null,{"$f":"\"\"&INDEX(PP_Locale,ROW(),PP_LanguageIndex)","v":"End date of reporting period 7"},"End date of reporting period 7",null,null,"Slutdato for periode 7","Enddatum des Berichtszeitraums 7",null,"Fecha final del período del informe 7",null,null,"Date de fin de la période de reporting 7",null,null,"Data di fine del periodo di riferimento 7",null,null,null,null,null,"Data zakończenia okresu sprawozdawczego 7"]
[{"$f":"\"\"&INDEX(PP_Locale,ROW(),PP_LanguageIndex)","v":"Start date of reporting period 8"},{"$f":"IFERROR(INDIRECT(\"'General Data ESEF'!PP_StartDatePeriod8\"),DATE(YEAR(PP_Period1StartDate)-7,MONTH(PP_Period1StartDate),DAY(PP_Period1StartDate)))","v":"2013-01-01"},null,null,null,"PP_Period8StartDate",{"$f":"IFERROR(INDIRECT(\"'General Data ESEF'!PP_StartDatePeriod8\"),DATE(YEAR(PP_Period1StartDate)-7,MONTH(PP_Period1StartDate),DAY(PP_Period1StartDate)))","v":41275},null,null,null,"2013-01-01",null,null,null,{"$f":"\"\"&INDEX(PP_Locale,ROW(),PP_LanguageIndex)","v":"Start date of reporting period 8"},"Start date of reporting period 8",null,null,"Startdato for periode 8","Startdatum des Berichtszeitraums 8",null,"Fecha de inicio del período del informe 8",null,null,"Date de début de la période de reporting 8",null,null,"Data di inizio del periodo di riferimento 8",null,null,null,null,null,"Data rozpoczęcia okresu sprawozdawczego 8"]
[{"$f":"\"\"&INDEX(PP_Locale,ROW(),PP_LanguageIndex)","v":"End date of reporting period 8"},{"$f":"IFERROR(INDIRECT(\"'General Data ESEF'!PP_EndDatePeriod8\"),IF(COUNTBLANK(PP_Period8StartDate),\"\",PP_Period7StartDate-1))","v":"2013-12-31"},null,null,null,"PP_Period8EndDate",{"$f":"IFERROR(INDIRECT(\"'General Data ESEF'!PP_EndDatePeriod8\"),IF(COUNTBLANK(PP_Period8StartDate),\"\",PP_Period7StartDate-1))","v":41639},null,null,null,"2013-12-31",null,null,null,{"$f":"\"\"&INDEX(PP_Locale,ROW(),PP_LanguageIndex)","v":"End date of reporting period 8"},"End date of reporting period 8",null,null,"Slutdato for periode 8","Enddatum des Berichtszeitraums 8",null,"Fecha final del período del informe 8",null,null,"Date de fin de la période de reporting 8",null,null,"Data di fine del periodo di riferimento 8",null,null,null,null,null,"Data zakończenia okresu sprawozdawczego 8"]
[{"$f":"\"\"&INDEX(PP_Locale,ROW(),PP_LanguageIndex)","v":"Date of general meeting"},null,null,null,null,"PP_DateOfGeneralMeeting",null,null,null,null,{"$f":"IF(COUNTBLANK(B35),\"\",TEXT(YEAR(B35),\"0000\")&\"-\"&TEXT(MONTH(B35),\"00\")&\"-\"&TEXT(DAY(B35),\"00\"))","v":""},null,null,null,{"$f":"\"\"&INDEX(PP_Locale,ROW(),PP_LanguageIndex)","v":"Date of general meeting"},"Date of general meeting",null,null,"Generalforsamlingsdato",null,null,null,null,null,null,null,null,null,null,null,null,null,null,null,null,null,null,null,null,null,null,null,null,null,null,null,null,null,null,null,null,null,null,null,null,null,null,null,null,null,null,null,null,null,null,null,null,null,null,null,null,null,null,null,null,null,null,null,null,null,null,null,null,null,null,null,null,null,null,null,null,null,null,null,null,null,null,"&allowhtml=false&merge=false",{"$f":"\"pp://General Data/\"&INDEX(PP_Locale,ROW(),1)&\"?taxonomy=\"&PP_TaxonomyId&\"&labellanguage=en&period=1\"&IF(PP_Consolidated,\"_Consolidated\",\"\")&CT35","v":"pp://General Data/Date of general meeting?taxonomy=DKGAAP&labellanguage=en&period=1_Consolidated&allowhtml=false&merge=false"}]
[{"$f":"\"\"&INDEX(PP_Locale,ROW(),PP_LanguageIndex)","v":"Reporting period, number"},null,null,null,null,"PP_ReportingPeriodNumber",null,null,null,null,{"$f":"\"\"&B36","v":""},null,null,null,{"$f":"\"\"&INDEX(PP_Locale,ROW(),PP_LanguageIndex)","v":"Reporting period, number"},"Reporting period, number",null,null,"Regnskabsår (nr.)",null,null,null,null,null,null,null,null,null,null,null,null,null,null,null,null,null,null,null,null,null,null,null,null,null,null,null,null,null,null,null,null,null,null,null,null,null,null,null,null,null,null,null,null,null,null,null,null,null,null,null,null,null,null,null,null,null,null,null,null,null,null,null,null,null,null,null,null,null,null,null,null,null,null,null,null,null,null,"&allowhtml=false&merge=false",{"$f":"\"pp://General Data/\"&INDEX(PP_Locale,ROW(),1)&\"?taxonomy=\"&PP_TaxonomyId&\"&labellanguage=en&period=1\"&IF(PP_Consolidated,\"_Consolidated\",\"\")&CT36","v":"pp://General Data/Reporting period, number?taxonomy=DKGAAP&labellanguage=en&period=1_Consolidated&allowhtml=false&merge=false"}]
[null,null,null,null,null,null,null,null,null,null,null,null,null,null,{"$f":"\"\"&INDEX(PP_Locale,ROW(),PP_LanguageIndex)","v":""}]
[{"$f":"\"\"&INDEX(PP_Locale,ROW(),PP_LanguageIndex)","v":"Chairman of general meeting:"},null,null,null,null,null,null,null,null,null,null,null,null,null,{"$f":"\"\"&INDEX(PP_Locale,ROW(),PP_LanguageIndex)","v":"Chairman of general meeting:"},"Chairman of general meeting:",null,null,"Dirigent:"]
[{"$f":"\"\"&INDEX(PP_Locale,ROW(),PP_LanguageIndex)","v":"Name and surname of chairman of general meeting"},null,null,null,null,"PP_NameAndSurnameOfChairmanOfGeneralMeeting",null,null,null,null,{"$f":"\"\"&B39","v":""},null,null,null,{"$f":"\"\"&INDEX(PP_Locale,ROW(),PP_LanguageIndex)","v":"Name and surname of chairman of general meeting"},"Name and surname of chairman of general meeting",null,null,"Dirigentens navn",null,null,null,null,null,null,null,null,null,null,null,null,null,null,null,null,null,null,null,null,null,null,null,null,null,null,null,null,null,null,null,null,null,null,null,null,null,null,null,null,null,null,null,null,null,null,null,null,null,null,null,null,null,null,null,null,null,null,null,null,null,null,null,null,null,null,null,null,null,null,null,null,null,null,null,null,null,null,"&allowhtml=false&merge=false",{"$f":"\"pp://General Data/\"&INDEX(PP_Locale,ROW(),1)&\"?taxonomy=\"&PP_TaxonomyId&\"&labellanguage=en&period=1\"&IF(PP_Consolidated,\"_Consolidated\",\"\")&CT39","v":"pp://General Data/Name and surname of chairman of general meeting?taxonomy=DKGAAP&labellanguage=en&period=1_Consolidated&allowhtml=false&merge=false"}]
[null,null,null,null,null,null,null,null,null,null,null,null,null,null,{"$f":"\"\"&INDEX(PP_Locale,ROW(),PP_LanguageIndex)","v":""}]
[{"$f":"\"\"&INDEX(PP_Locale,ROW(),PP_LanguageIndex)","v":"Information on reporting entity:"},null,null,null,null,null,null,null,null,null,null,null,null,null,{"$f":"\"\"&INDEX(PP_Locale,ROW(),PP_LanguageIndex)","v":"Information on reporting entity:"},"Information on reporting entity:",null,null,"Information om den regnskabsaflæggende virksomhed:"]
[{"$f":"\"\"&INDEX(PP_Locale,ROW(),PP_LanguageIndex)","v":"Legal Entity Identifier [LEI] of reporting entity"},{"$f":"IF(ISERROR(INDIRECT(\"'General Data ESEF'!PP_IdentificationOfReportingEntity\")),\"\",IF(LEN(INDIRECT(\"'General Data ESEF'!PP_IdentificationOfReportingEntity\"))<>20,\"\",INDIRECT(\"'General Data ESEF'!PP_IdentificationOfReportingEntity\")))","v":"12345NOTVALID1234503"},null,null,null,"PP_LegalEntityIdentifierOfReportingEntity",{"$f":"IF(ISERROR(INDIRECT(\"'General Data ESEF'!PP_IdentificationOfReportingEntity\")),\"\",IF(LEN(INDIRECT(\"'General Data ESEF'!PP_IdentificationOfReportingEntity\"))<>20,\"\",INDIRECT(\"'General Data ESEF'!PP_IdentificationOfReportingEntity\")))","v":"12345NOTVALID1234503"},null,null,null,{"$f":"\"\"&B42","v":"12345NOTVALID1234503"},null,null,null,{"$f":"\"\"&INDEX(PP_Locale,ROW(),PP_LanguageIndex)","v":"Legal Entity Identifier [LEI] of reporting entity"},"Legal Entity Identifier [LEI] of reporting entity",null,null,"Regnskabsaflæggende virksomheds LEI-kode",null,null,null,null,null,null,null,null,null,null,null,null,null,null,null,null,null,null,null,null,null,null,null,null,null,null,null,null,null,null,null,null,null,null,null,null,null,null,null,null,null,null,null,null,null,null,null,null,null,null,null,null,null,null,null,null,null,null,null,null,null,null,null,null,null,null,null,null,null,null,null,null,null,null,null,null,null,null,"&allowhtml=false&merge=false&skipspace=true",{"$f":"\"pp://General Data/\"&INDEX(PP_Locale,ROW(),1)&\"?taxonomy=\"&PP_TaxonomyId&\"&labellanguage=en&period=1\"&IF(PP_Consolidated,\"_Consolidated\",\"\")&CT42","v":"pp://General Data/Legal Entity Identifier [LEI] of reporting entity?taxonomy=DKGAAP&labellanguage=en&period=1_Consolidated&allowhtml=false&merge=false&skipspace=true"}]
[{"$f":"\"\"&INDEX(PP_Locale,ROW(),PP_LanguageIndex)","v":"Name of reporting entity"},{"$f":"IFERROR(INDIRECT(\"'General Data ESEF'!PP_NameOfReportingEntity\"),IFERROR(VLOOKUP(\"Test customer\",PP_Locale,PP_LanguageIndex,FALSE),\"Test customer\"))","v":"Test customer"},null,null,null,"PP_NameOfReportingEntity",{"$f":"IFERROR(INDIRECT(\"'General Data ESEF'!PP_NameOfReportingEntity\"),IFERROR(VLOOKUP(\"Test customer\",PP_Locale,PP_LanguageIndex,FALSE),\"Test customer\"))","v":"Test customer"},null,null,null,{"$f":"\"\"&B43","v":"Test customer"},null,null,null,{"$f":"\"\"&INDEX(PP_Locale,ROW(),PP_LanguageIndex)","v":"Name of reporting entity"},"Name of reporting entity",null,null,"Regnskabsaflæggende virksomheds navn",null,null,null,null,null,null,null,null,null,null,null,null,null,null,null,null,null,null,null,null,null,null,null,null,null,null,null,null,null,null,null,null,null,null,null,null,null,null,null,null,null,null,null,null,null,null,null,null,null,null,null,null,null,null,null,null,null,null,null,null,null,null,null,null,null,null,null,null,null,null,null,null,null,null,null,null,null,null,"&allowhtml=false&merge=false",{"$f":"\"pp://General Data/\"&INDEX(PP_Locale,ROW(),1)&\"?taxonomy=\"&PP_TaxonomyId&\"&labellanguage=en&period=1\"&IF(PP_Consolidated,\"_Consolidated\",\"\")&CT43","v":"pp://General Data/Name of reporting entity?taxonomy=DKGAAP&labellanguage=en&period=1_Consolidated&allowhtml=false&merge=false"}]
[{"$f":"\"\"&INDEX(PP_Locale,ROW(),PP_LanguageIndex)","v":"Class of reporting entity"},{"$f":"IFERROR(VLOOKUP(\"Reporting Class B\",PP_Locale,PP_LanguageIndex,FALSE),\"Reporting Class B\")","v":"Reporting class B"},{"$f":"\"\"&LOOKUP(PP_Language,{\"DA\";\"EN\"},{\"Regnskabsklasse B\";\"Reporting class B\"})","v":"Reporting class B"},{"$f":"\"\"&LOOKUP(PP_Language,{\"DA\";\"EN\"},{\"Regnskabsklasse B\";\"Reporting class B\"})","v":"Reporting class B"},{"$f":"\"\"&LOOKUP(PP_Language,{\"DA\";\"EN\"},{\"Regnskabsklasse B\";\"Reporting class B\"})","v":"Reporting class B"},"PP_ClassOfReportingEntity",{"$f":"IFERROR(VLOOKUP(\"Reporting Class B\",PP_Locale,PP_LanguageIndex,FALSE),\"Reporting Class B\")","v":"Reporting class B"},null,null,null,{"$f":"\"\"&SUBSTITUTE(B44,\" / \",\", \")","v":"Reporting class B"},null,null,null,{"$f":"\"\"&INDEX(PP_Locale,ROW(),PP_LanguageIndex)","v":"Class of reporting entity"},"Class of reporting entity",null,null,"Regnskabsaflæggende virksomheds regnskabsklasse",null,null,null,null,null,null,null,null,null,null,null,null,null,null,null,null,null,null,null,null,null,null,null,null,null,null,null,null,null,null,null,null,null,null,null,null,null,null,null,null,null,null,null,null,null,null,null,null,null,null,null,null,null,null,null,{"$f":"\"\"&LOOKUP(PP_Language,{\"DA\";\"EN\"},{\"Regnskabsklasse A\";\"Reporting class A\"})","v":"Reporting class A"},{"$f":"\"\"&LOOKUP(PP_Language,{\"DA\";\"EN\"},{\"Regnskabsklasse B\";\"Reporting class B\"})","v":"Reporting class B"},{"$f":"\"\"&LOOKUP(PP_Language,{\"DA\";\"EN\"},{\"Regnskabsklasse B / mikrovirksomhed\";\"Reporting class B / micro-undertaking\"})","v":"Reporting class B / micro-undertaking"},{"$f":"\"\"&LOOKUP(PP_Language,{\"DA\";\"EN\"},{\"Regnskabsklasse C / mellemstor virksomhed\";\"Reporting class C / medium-size enterprise\"})","v":"Reporting class C / medium-size enterprise"},{"$f":"\"\"&LOOKUP(PP_Language,{\"DA\";\"EN\"},{\"Regnskabsklasse C / stor virksomhed\";\"Reporting class C / large enterprise\"})","v":"Reporting class C / large enterprise"},{"$f":"\"\"&LOOKUP(PP_Language,{\"DA\";\"EN\"},{\"Regnskabsklasse D\";\"Reporting class D\"})","v":"Reporting class D"},null,null,null,null,null,null,null,null,null,null,null,null,null,null,null,null,null,"&allowhtml=false&merge=false"]
[{"$f":"IF(ISERROR(INDIRECT(\"'General Data ESEF'!PP_Language\")),\"\"&INDEX(PP_Locale,ROW(),PP_LanguageIndex),\"\")","v":""},{"$f":"No","v":"No"},null,null,null,"PP_SelectedElementsFromReportingClassC",{"$f":"No","v":"No"},null,null,null,{"$f":"IF(B45=Yes,\"true\",IF(B45=No,\"false\",\"\"))","v":"false"},null,null,null,{"$f":"\"\"&INDEX(PP_Locale,ROW(),PP_LanguageIndex)","v":"Selected elements from reporting class C"},"Selected elements from reporting class C",null,null,"Der er tilvalgt elementer fra Regnskabsklasse C",null,null,null,null,null,null,null,null,null,null,null,null,null,null,null,null,null,null,null,null,null,null,null,null,null,null,null,null,null,null,null,null,null,null,null,null,null,null,null,null,null,null,null,null,null,null,null,null,null,null,null,null,null,null,null,{"$f":"No","v":"No"},{"$f":"Yes","v":"Yes"}]
[{"$f":"IF(ISERROR(INDIRECT(\"'General Data ESEF'!PP_Language\")),\"\"&INDEX(PP_Locale,ROW(),PP_LanguageIndex),\"\")","v":""},{"$f":"No","v":"No"},null,null,null,"PP_SelectedElementsFromReportingClassD",{"$f":"No","v":"No"},null,null,null,{"$f":"IF(B46=Yes,\"true\",IF(B46=No,\"false\",\"\"))","v":"false"},null,null,null,{"$f":"\"\"&INDEX(PP_Locale,ROW(),PP_LanguageIndex)","v":"Selected elements from reporting class D"},"Selected elements from reporting class D",null,null,"Der er tilvalgt elementer fra Regnskabsklasse D",null,null,null,null,null,null,null,null,null,null,null,null,null,null,null,null,null,null,null,null,null,null,null,null,null,null,null,null,null,null,null,null,null,null,null,null,null,null,null,null,null,null,null,null,null,null,null,null,null,null,null,null,null,null,null,{"$f":"No","v":"No"},{"$f":"Yes","v":"Yes"}]
[{"$f":"IF(ISERROR(INDIRECT(\"'General Data ESEF'!PP_Language\")),\"\"&INDEX(PP_Locale,ROW(),PP_LanguageIndex),\"\")","v":""},{"$f":"Yes","v":"Yes"},null,null,null,"PP_AccountingPoliciesAreUnchangedFromPreviousPeriod",{"$f":"Yes","v":"Yes"},null,null,null,{"$f":"IF(B47=Yes,\"true\",IF(B47=No,\"false\",\"\"))","v":"true"},null,null,null,{"$f":"\"\"&INDEX(PP_Locale,ROW(),PP_LanguageIndex)","v":"Accounting policies are unchanged from previous period"},"Accounting policies are unchanged from previous period",null,null,"Den anvendte regnskabspraksis er uændret i forhold til foregående periode",null,null,null,null,null,null,null,null,null,null,null,null,null,null,null,null,null,null,null,null,null,null,null,null,null,null,null,null,null,null,null,null,null,null,null,null,null,null,null,null,null,null,null,null,null,null,null,null,null,null,null,null,null,null,null,{"$f":"Yes","v":"Yes"},{"$f":"No","v":"No"}]
[{"$f":"IF(ISERROR(INDIRECT(\"'General Data ESEF'!PP_Language\")),\"\"&INDEX(PP_Locale,ROW(),PP_LanguageIndex),\"\")","v":""},{"$f":"No","v":"No"},null,null,null,"PP_TheReportingEntityAppliesTheExceptionConcerningOptingOutOfTheStatementByManagementEtc",{"$f":"No","v":"No"},null,null,null,{"$f":"IF(B48=Yes,\"true\",IF(B48=No,\"false\",\"\"))","v":"false"},null,null,null,{"$f":"\"\"&INDEX(PP_Locale,ROW(),PP_LanguageIndex)","v":"The reporting entity applies the exception concerning opting out of the statement by management etc."},"The reporting entity applies the exception concerning opting out of the statement by management etc.",null,null,"Virksomheden anvender undtagelsen om at fravælge ledelsespåtegningen",null,null,null,null,null,null,null,null,null,null,null,null,null,null,null,null,null,null,null,null,null,null,null,null,null,null,null,null,null,null,null,null,null,null,null,null,null,null,null,null,null,null,null,null,null,null,null,null,null,null,null,null,null,null,null,{"$f":"No","v":"No"},{"$f":"Yes","v":"Yes"}]
[{"$f":"\"\"&INDEX(PP_Locale,ROW(),PP_LanguageIndex)","v":"Identification number [CVR] of reporting entity"},{"$f":"IF(IFERROR(LEN(INDIRECT(\"'General Data ESEF'!PP_IdentificationOfReportingEntity\")),0)=8,INDIRECT(\"'General Data ESEF'!PP_IdentificationOfReportingEntity\"),\"12345678\")","v":"12345678"},null,null,null,"PP_IdentificationNumberCvrOfReportingEntity",{"$f":"IF(IFERROR(LEN(INDIRECT(\"'General Data ESEF'!PP_IdentificationOfReportingEntity\")),0)=8,INDIRECT(\"'General Data ESEF'!PP_IdentificationOfReportingEntity\"),\"12345678\")","v":"12345678"},null,null,null,{"$f":"\"\"&SUBSTITUTE(B49,\" \",\"\")","v":"12345678"},null,null,null,{"$f":"\"\"&INDEX(PP_Locale,ROW(),PP_LanguageIndex)","v":"Identification number [CVR] of reporting entity"},"Identification number [CVR] of reporting entity",null,null,"Regnskabsaflæggende virksomheds CVR-nr.",null,null,null,null,null,null,null,null,null,null,null,null,null,null,null,null,null,null,null,null,null,null,null,null,null,null,null,null,null,null,null,null,null,null,null,null,null,null,null,null,null,null,null,null,null,null,null,null,null,null,null,null,null,null,null,null,null,null,null,null,null,null,null,null,null,null,null,null,null,null,null,null,null,null,null,null,null,null,"&allowhtml=false&merge=false&skipspace=true",{"$f":"\"pp://General Data/\"&INDEX(PP_Locale,ROW(),1)&\"?taxonomy=\"&PP_TaxonomyId&\"&labellanguage=en&period=1\"&IF(PP_Consolidated,\"_Consolidated\",\"\")&CT49","v":"pp://General Data/Identification number [CVR] of reporting entity?taxonomy=DKGAAP&labellanguage=en&period=1_Consolidated&allowhtml=false&merge=false&skipspace=true"}]
[{"$f":"\"\"&INDEX(PP_Locale,ROW(),PP_LanguageIndex)","v":"Address of reporting entity, street name"},{"$f":"IFERROR(VLOOKUP(\"UNKNOWN\",PP_Locale,PP_LanguageIndex,FALSE),\"UNKNOWN\")","v":"UNKNOWN"},null,null,null,"PP_AddressOfReportingEntityStreetName",{"$f":"IFERROR(VLOOKUP(\"UNKNOWN\",PP_Locale,PP_LanguageIndex,FALSE),\"UNKNOWN\")","v":"UNKNOWN"},null,null,null,{"$f":"\"\"&B50","v":"UNKNOWN"},null,null,null,{"$f":"\"\"&INDEX(PP_Locale,ROW(),PP_LanguageIndex)","v":"Address of reporting entity, street name"},"Address of reporting entity, street name",null,null,"Regnskabsaflæggende virksomheds adresse, vejnavn",null,null,null,null,null,null,null,null,null,null,null,null,null,null,null,null,null,null,null,null,null,null,null,null,null,null,null,null,null,null,null,null,null,null,null,null,null,null,null,null,null,null,null,null,null,null,null,null,null,null,null,null,null,null,null,null,null,null,null,null,null,null,null,null,null,null,null,null,null,null,null,null,null,null,null,null,null,null,"&allowhtml=false&merge=false",{"$f":"\"pp://General Data/\"&INDEX(PP_Locale,ROW(),1)&\"?taxonomy=\"&PP_TaxonomyId&\"&labellanguage=en&period=1\"&IF(PP_Consolidated,\"_Consolidated\",\"\")&CT50","v":"pp://General Data/Address of reporting entity, street name?taxonomy=DKGAAP&labellanguage=en&period=1_Consolidated&allowhtml=false&merge=false"}]
[{"$f":"\"\"&INDEX(PP_Locale,ROW(),PP_LanguageIndex)","v":"Address of reporting entity, street building identifier"},{"$f":"IFERROR(VLOOKUP(\"UNKNOWN\",PP_Locale,PP_LanguageIndex,FALSE),\"UNKNOWN\")","v":"UNKNOWN"},null,null,null,"PP_AddressOfReportingEntityStreetBuildingIdentifier",{"$f":"IFERROR(VLOOKUP(\"UNKNOWN\",PP_Locale,PP_LanguageIndex,FALSE),\"UNKNOWN\")","v":"UNKNOWN"},null,null,null,"UNKNOWN",null,null,null,{"$f":"\"\"&INDEX(PP_Locale,ROW(),PP_LanguageIndex)","v":"Address of reporting entity, street building identifier"},"Address of reporting entity, street building identifier",null,null,"Regnskabsaflæggende virksomheds adresse, vejnr og etage",null,null,null,null,null,null,null,null,null,null,null,null,null,null,null,null,null,null,null,null,null,null,null,null,null,null,null,null,null,null,null,null,null,null,null,null,null,null,null,null,null,null,null,null,null,null,null,null,null,null,null,null,null,null,null,null,null,null,null,null,null,null,null,null,null,null,null,null,null,null,null,null,null,null,null,null,null,null,"&allowhtml=false&merge=false",{"$f":"\"pp://General Data/\"&INDEX(PP_Locale,ROW(),1)&\"?taxonomy=\"&PP_TaxonomyId&\"&labellanguage=en&period=1\"&IF(PP_Consolidated,\"_Consolidated\",\"\")&CT51","v":"pp://General Data/Address of reporting entity, street building identifier?taxonomy=DKGAAP&labellanguage=en&period=1_Consolidated&allowhtml=false&merge=false"}]
[{"$f":"\"\"&INDEX(PP_Locale,ROW(),PP_LanguageIndex)","v":"Address of reporting entity, post code identifier"},{"$f":"IFERROR(VLOOKUP(\"UNKNOWN\",PP_Locale,PP_LanguageIndex,FALSE),\"UNKNOWN\")","v":"UNKNOWN"},null,null,null,"PP_AddressOfReportingEntityPostCodeIdentifier",{"$f":"IFERROR(VLOOKUP(\"UNKNOWN\",PP_Locale,PP_LanguageIndex,FALSE),\"UNKNOWN\")","v":"UNKNOWN"},null,null,null,"UNKNOWN",null,null,null,{"$f":"\"\"&INDEX(PP_Locale,ROW(),PP_LanguageIndex)","v":"Address of reporting entity, post code identifier"},"Address of reporting entity, post code identifier",null,null,"Regnskabsaflæggende virksomheds adresse, postnummer",null,null,null,null,null,null,null,null,null,null,null,null,null,null,null,null,null,null,null,null,null,null,null,null,null,null,null,null,null,null,null,null,null,null,null,null,null,null,null,null,null,null,null,null,null,null,null,null,null,null,null,null,null,null,null,null,null,null,null,null,null,null,null,null,null,null,null,null,null,null,null,null,null,null,null,null,null,null,"&allowhtml=false&merge=false",{"$f":"\"pp://General Data/\"&INDEX(PP_Locale,ROW(),1)&\"?taxonomy=\"&PP_TaxonomyId&\"&labellanguage=en&period=1\"&IF(PP_Consolidated,\"_Consolidated\",\"\")&CT52","v":"pp://General Data/Address of reporting entity, post code identifier?taxonomy=DKGAAP&labellanguage=en&period=1_Consolidated&allowhtml=false&merge=false"}]
[{"$f":"\"\"&INDEX(PP_Locale,ROW(),PP_LanguageIndex)","v":"Address of reporting entity, district name"},{"$f":"IFERROR(VLOOKUP(\"UNKNOWN\",PP_Locale,PP_LanguageIndex,FALSE),\"UNKNOWN\")","v":"UNKNOWN"},null,null,null,"PP_AddressOfReportingEntityDistrictName",{"$f":"IFERROR(VLOOKUP(\"UNKNOWN\",PP_Locale,PP_LanguageIndex,FALSE),\"UNKNOWN\")","v":"UNKNOWN"},null,null,null,"UNKNOWN",null,null,null,{"$f":"\"\"&INDEX(PP_Locale,ROW(),PP_LanguageIndex)","v":"Address of reporting entity, district name"},"Address of reporting entity, district name",null,null,"Regnskabsaflæggende virksomheds adresse, by",null,null,null,null,null,null,null,null,null,null,null,null,null,null,null,null,null,null,null,null,null,null,null,null,null,null,null,null,null,null,null,null,null,null,null,null,null,null,null,null,null,null,null,null,null,null,null,null,null,null,null,null,null,null,null,null,null,null,null,null,null,null,null,null,null,null,null,null,null,null,null,null,null,null,null,null,null,null,"&allowhtml=false&merge=false",{"$f":"\"pp://General Data/\"&INDEX(PP_Locale,ROW(),1)&\"?taxonomy=\"&PP_TaxonomyId&\"&labellanguage=en&period=1\"&IF(PP_Consolidated,\"_Consolidated\",\"\")&CT53","v":"pp://General Data/Address of reporting entity, district name?taxonomy=DKGAAP&labellanguage=en&period=1_Consolidated&allowhtml=false&merge=false"}]
[{"$f":"\"\"&INDEX(PP_Locale,ROW(),PP_LanguageIndex)","v":"Address of reporting entity, country"},null,null,null,null,"PP_AddressOfReportingEntityCountry",null,null,null,null,"",null,null,null,{"$f":"\"\"&INDEX(PP_Locale,ROW(),PP_LanguageIndex)","v":"Address of reporting entity, country"},"Address of reporting entity, country",null,null,"Regnskabsaflæggende virksomheds adresse, land",null,null,null,null,null,null,null,null,null,null,null,null,null,null,null,null,null,null,null,null,null,null,null,null,null,null,null,null,null,null,null,null,null,null,null,null,null,null,null,null,null,null,null,null,null,null,null,null,null,null,null,null,null,null,null,null,null,null,null,null,null,null,null,null,null,null,null,null,null,null,null,null,null,null,null,null,null,null,"&allowhtml=false&merge=false",{"$f":"\"pp://General Data/\"&INDEX(PP_Locale,ROW(),1)&\"?taxonomy=\"&PP_TaxonomyId&\"&labellanguage=en&period=1\"&IF(PP_Consolidated,\"_Consolidated\",\"\")&CT54","v":"pp://General Data/Address of reporting entity, country?taxonomy=DKGAAP&labellanguage=en&period=1_Consolidated&allowhtml=false&merge=false"}]
[{"$f":"\"\"&INDEX(PP_Locale,ROW(),PP_LanguageIndex)","v":"Address of reporting entity, country identification code"},null,null,null,null,"PP_AddressOfReportingEntityCountryIdentificationCode",null,null,null,null,"",null,null,null,{"$f":"\"\"&INDEX(PP_Locale,ROW(),PP_LanguageIndex)","v":"Address of reporting entity, country identification code"},"Address of reporting entity, country identification code",null,null,"Regnskabsaflæggende virksomheds adresse, landekode",null,null,null,null,null,null,null,null,null,null,null,null,null,null,null,null,null,null,null,null,null,null,null,null,null,null,null,null,null,null,null,null,null,null,null,null,null,null,null,null,null,null,null,null,null,null,null,null,null,null,null,null,null,null,null,null,null,null,null,null,null,null,null,null,null,null,null,null,null,null,null,null,null,null,null,null,null,null,"&allowhtml=false&merge=false",{"$f":"\"pp://General Data/\"&INDEX(PP_Locale,ROW(),1)&\"?taxonomy=\"&PP_TaxonomyId&\"&labellanguage=en&period=1\"&IF(PP_Consolidated,\"_Consolidated\",\"\")&CT55","v":"pp://General Data/Address of reporting entity, country identification code?taxonomy=DKGAAP&labellanguage=en&period=1_Consolidated&allowhtml=false&merge=false"}]
[{"$f":"\"\"&INDEX(PP_Locale,ROW(),PP_LanguageIndex)","v":"Date of foundation of reporting entity"},null,null,null,null,"PP_DateOfFoundationOfReportingEntity",null,null,null,null,{"$f":"IF(COUNTBLANK(B56),\"\",TEXT(YEAR(B56),\"0000\")&\"-\"&TEXT(MONTH(B56),\"00\")&\"-\"&TEXT(DAY(B56),\"00\"))","v":""},null,null,null,{"$f":"\"\"&INDEX(PP_Locale,ROW(),PP_LanguageIndex)","v":"Date of foundation of reporting entity"},"Date of foundation of reporting entity",null,null,"Regnskabsaflæggende virksomheds stiftelsesdato",null,null,null,null,null,null,null,null,null,null,null,null,null,null,null,null,null,null,null,null,null,null,null,null,null,null,null,null,null,null,null,null,null,null,null,null,null,null,null,null,null,null,null,null,null,null,null,null,null,null,null,null,null,null,null,null,null,null,null,null,null,null,null,null,null,null,null,null,null,null,null,null,null,null,null,null,null,null,"&allowhtml=false&merge=false",{"$f":"\"pp://General Data/\"&INDEX(PP_Locale,ROW(),1)&\"?taxonomy=\"&PP_TaxonomyId&\"&labellanguage=en&period=1\"&IF(PP_Consolidated,\"_Consolidated\",\"\")&CT56","v":"pp://General Data/Date of foundation of reporting entity?taxonomy=DKGAAP&labellanguage=en&period=1_Consolidated&allowhtml=false&merge=false"}]
[{"$f":"\"\"&INDEX(PP_Locale,ROW(),PP_LanguageIndex)","v":"Registered office of reporting entity"},null,null,null,null,"PP_RegisteredOfficeOfReportingEntity",null,null,null,null,{"$f":"\"\"&B57","v":""},null,null,null,{"$f":"\"\"&INDEX(PP_Locale,ROW(),PP_LanguageIndex)","v":"Registered office of reporting entity"},"Registered office of reporting entity",null,null,"Regnskabsaflæggende virksomheds hjemsted",null,null,null,null,null,null,null,null,null,null,null,null,null,null,null,null,null,null,null,null,null,null,null,null,null,null,null,null,null,null,null,null,null,null,null,null,null,null,null,null,null,null,null,null,null,null,null,null,null,null,null,null,null,null,null,null,null,null,null,null,null,null,null,null,null,null,null,null,null,null,null,null,null,null,null,null,null,null,"&allowhtml=false&merge=false",{"$f":"\"pp://General Data/\"&INDEX(PP_Locale,ROW(),1)&\"?taxonomy=\"&PP_TaxonomyId&\"&labellanguage=en&period=1\"&IF(PP_Consolidated,\"_Consolidated\",\"\")&CT57","v":"pp://General Data/Registered office of reporting entity?taxonomy=DKGAAP&labellanguage=en&period=1_Consolidated&allowhtml=false&merge=false"}]
[{"$f":"\"\"&INDEX(PP_Locale,ROW(),PP_LanguageIndex)","v":"Telephone number of reporting entity"},null,null,null,null,"PP_TelephoneNumberOfReportingEntity",null,null,null,null,{"$f":"\"\"&SUBSTITUTE(B58,\" \",\"\")","v":""},null,null,null,{"$f":"\"\"&INDEX(PP_Locale,ROW(),PP_LanguageIndex)","v":"Telephone number of reporting entity"},"Telephone number of reporting entity",null,null,"Regnskabsaflæggende virksomheds telefonnummer",null,null,null,null,null,null,null,null,null,null,null,null,null,null,null,null,null,null,null,null,null,null,null,null,null,null,null,null,null,null,null,null,null,null,null,null,null,null,null,null,null,null,null,null,null,null,null,null,null,null,null,null,null,null,null,null,null,null,null,null,null,null,null,null,null,null,null,null,null,null,null,null,null,null,null,null,null,null,"&allowhtml=false&merge=false",{"$f":"\"pp://General Data/\"&INDEX(PP_Locale,ROW(),1)&\"?taxonomy=\"&PP_TaxonomyId&\"&labellanguage=en&period=1\"&IF(PP_Consolidated,\"_Consolidated\",\"\")&CT58","v":"pp://General Data/Telephone number of reporting entity?taxonomy=DKGAAP&labellanguage=en&period=1_Consolidated&allowhtml=false&merge=false"}]
[{"$f":"\"\"&INDEX(PP_Locale,ROW(),PP_LanguageIndex)","v":"Fax number of reporting entity"},null,null,null,null,"PP_FaxNumberOfReportingEntity",null,null,null,null,{"$f":"\"\"&SUBSTITUTE(B59,\" \",\"\")","v":""},null,null,null,{"$f":"\"\"&INDEX(PP_Locale,ROW(),PP_LanguageIndex)","v":"Fax number of reporting entity"},"Fax number of reporting entity",null,null,"Regnskabsaflæggende virksomheds faxnummer",null,null,null,null,null,null,null,null,null,null,null,null,null,null,null,null,null,null,null,null,null,null,null,null,null,null,null,null,null,null,null,null,null,null,null,null,null,null,null,null,null,null,null,null,null,null,null,null,null,null,null,null,null,null,null,null,null,null,null,null,null,null,null,null,null,null,null,null,null,null,null,null,null,null,null,null,null,null,"&allowhtml=false&merge=false",{"$f":"\"pp://General Data/\"&INDEX(PP_Locale,ROW(),1)&\"?taxonomy=\"&PP_TaxonomyId&\"&labellanguage=en&period=1\"&IF(PP_Consolidated,\"_Consolidated\",\"\")&CT59","v":"pp://General Data/Fax number of reporting entity?taxonomy=DKGAAP&labellanguage=en&period=1_Consolidated&allowhtml=false&merge=false"}]
[{"$f":"\"\"&INDEX(PP_Locale,ROW(),PP_LanguageIndex)","v":"Homepage of reporting entity"},null,null,null,null,"PP_HomepageOfReportingEntity",null,null,null,null,{"$f":"\"\"&B60","v":""},null,null,null,{"$f":"\"\"&INDEX(PP_Locale,ROW(),PP_LanguageIndex)","v":"Homepage of reporting entity"},"Homepage of reporting entity",null,null,"Regnskabsaflæggende virksomheds hjemmeside",null,null,null,null,null,null,null,null,null,null,null,null,null,null,null,null,null,null,null,null,null,null,null,null,null,null,null,null,null,null,null,null,null,null,null,null,null,null,null,null,null,null,null,null,null,null,null,null,null,null,null,null,null,null,null,null,null,null,null,null,null,null,null,null,null,null,null,null,null,null,null,null,null,null,null,null,null,null,"&allowhtml=false&merge=false",{"$f":"\"pp://General Data/\"&INDEX(PP_Locale,ROW(),1)&\"?taxonomy=\"&PP_TaxonomyId&\"&labellanguage=en&period=1\"&IF(PP_Consolidated,\"_Consolidated\",\"\")&CT60","v":"pp://General Data/Homepage of reporting entity?taxonomy=DKGAAP&labellanguage=en&period=1_Consolidated&allowhtml=false&merge=false"}]
[{"$f":"\"\"&INDEX(PP_Locale,ROW(),PP_LanguageIndex)","v":"E-mail of reporting entity"},null,null,null,null,"PP_EmailOfReportingEntity",null,null,null,null,"",null,null,null,{"$f":"\"\"&INDEX(PP_Locale,ROW(),PP_LanguageIndex)","v":"E-mail of reporting entity"},"E-mail of reporting entity",null,null,"Regnskabsaflæggende virksomheds e-mail",null,null,null,null,null,null,null,null,null,null,null,null,null,null,null,null,null,null,null,null,null,null,null,null,null,null,null,null,null,null,null,null,null,null,null,null,null,null,null,null,null,null,null,null,null,null,null,null,null,null,null,null,null,null,null,null,null,null,null,null,null,null,null,null,null,null,null,null,null,null,null,null,null,null,null,null,null,null,"&allowhtml=false&merge=false",{"$f":"\"pp://General Data/\"&INDEX(PP_Locale,ROW(),1)&\"?taxonomy=\"&PP_TaxonomyId&\"&labellanguage=en&period=1\"&IF(PP_Consolidated,\"_Consolidated\",\"\")&CT61","v":"pp://General Data/E-mail of reporting entity?taxonomy=DKGAAP&labellanguage=en&period=1_Consolidated&allowhtml=false&merge=false"}]
[{"$f":"\"\"&INDEX(PP_Locale,ROW(),PP_LanguageIndex)","v":"Secondary name of reporting entity 1"},null,null,null,null,"PP_SecondaryNameOfReportingEntity_1",null,null,null,null,"",null,null,null,{"$f":"\"\"&INDEX(PP_Locale,ROW(),PP_LanguageIndex)","v":"Secondary name of reporting entity 1"},"Secondary name of reporting entity 1",null,null,"Regnskabsaflæggende virksomheds binavn 1",null,null,null,null,null,null,null,null,null,null,null,null,null,null,null,null,null,null,null,null,null,null,null,null,null,null,null,null,null,null,null,null,null,null,null,null,null,null,null,null,null,null,null,null,null,null,null,null,null,null,null,null,null,null,null,null,null,null,null,null,null,null,null,null,null,null,null,null,null,null,null,null,null,null,null,null,null,null,"&allowhtml=false&merge=false",{"$f":"\"pp://General Data/\"&INDEX(PP_Locale,ROW(),1)&\"?taxonomy=\"&PP_TaxonomyId&\"&labellanguage=en&period=1\"&IF(PP_Consolidated,\"_Consolidated\",\"\")&CT62","v":"pp://General Data/Secondary name of reporting entity 1?taxonomy=DKGAAP&labellanguage=en&period=1_Consolidated&allowhtml=false&merge=false"}]
[{"$f":"\"\"&INDEX(PP_Locale,ROW(),PP_LanguageIndex)","v":"Secondary name of reporting entity 2"},null,null,null,null,"PP_SecondaryNameOfReportingEntity_2",null,null,null,null,"",null,null,null,{"$f":"\"\"&INDEX(PP_Locale,ROW(),PP_LanguageIndex)","v":"Secondary name of reporting entity 2"},"Secondary name of reporting entity 2",null,null,"Regnskabsaflæggende virksomheds binavn 2",null,null,null,null,null,null,null,null,null,null,null,null,null,null,null,null,null,null,null,null,null,null,null,null,null,null,null,null,null,null,null,null,null,null,null,null,null,null,null,null,null,null,null,null,null,null,null,null,null,null,null,null,null,null,null,null,null,null,null,null,null,null,null,null,null,null,null,null,null,null,null,null,null,null,null,null,null,null,"&allowhtml=false&merge=false",{"$f":"\"pp://General Data/\"&INDEX(PP_Locale,ROW(),1)&\"?taxonomy=\"&PP_TaxonomyId&\"&labellanguage=en&period=1\"&IF(PP_Consolidated,\"_Consolidated\",\"\")&CT63","v":"pp://General Data/Secondary name of reporting entity 2?taxonomy=DKGAAP&labellanguage=en&period=1_Consolidated&allowhtml=false&merge=false"}]
[{"$f":"\"\"&INDEX(PP_Locale,ROW(),PP_LanguageIndex)","v":"Secondary name of reporting entity 3"},null,null,null,null,"PP_SecondaryNameOfReportingEntity_3",null,null,null,null,"",null,null,null,{"$f":"\"\"&INDEX(PP_Locale,ROW(),PP_LanguageIndex)","v":"Secondary name of reporting entity 3"},"Secondary name of reporting entity 3",null,null,"Regnskabsaflæggende virksomheds binavn 3",null,null,null,null,null,null,null,null,null,null,null,null,null,null,null,null,null,null,null,null,null,null,null,null,null,null,null,null,null,null,null,null,null,null,null,null,null,null,null,null,null,null,null,null,null,null,null,null,null,null,null,null,null,null,null,null,null,null,null,null,null,null,null,null,null,null,null,null,null,null,null,null,null,null,null,null,null,null,"&allowhtml=false&merge=false",{"$f":"\"pp://General Data/\"&INDEX(PP_Locale,ROW(),1)&\"?taxonomy=\"&PP_TaxonomyId&\"&labellanguage=en&period=1\"&IF(PP_Consolidated,\"_Consolidated\",\"\")&CT64","v":"pp://General Data/Secondary name of reporting entity 3?taxonomy=DKGAAP&labellanguage=en&period=1_Consolidated&allowhtml=false&merge=false"}]
[{"$f":"\"\"&INDEX(PP_Locale,ROW(),PP_LanguageIndex)","v":"Link to corporate governance report"},null,null,null,null,"PP_LinkToCorporateGovernanceReport",null,null,null,null,"",null,null,null,{"$f":"\"\"&INDEX(PP_Locale,ROW(),PP_LanguageIndex)","v":"Link to corporate governance report"},"Link to corporate governance report",null,null,"Link til redegørelse for virksomhedsledelse",null,null,null,null,null,null,null,null,null,null,null,null,null,null,null,null,null,null,null,null,null,null,null,null,null,null,null,null,null,null,null,null,null,null,null,null,null,null,null,null,null,null,null,null,null,null,null,null,null,null,null,null,null,null,null,null,null,null,null,null,null,null,null,null,null,null,null,null,null,null,null,null,null,null,null,null,null,null,"&allowhtml=false&merge=false",{"$f":"\"pp://General Data/\"&INDEX(PP_Locale,ROW(),1)&\"?taxonomy=\"&PP_TaxonomyId&\"&labellanguage=en&period=1\"&IF(PP_Consolidated,\"_Consolidated\",\"\")&CT65","v":"pp://General Data/Link to corporate governance report?taxonomy=DKGAAP&labellanguage=en&period=1_Consolidated&allowhtml=false&merge=false"}]
[{"$f":"\"\"&INDEX(PP_Locale,ROW(),PP_LanguageIndex)","v":"Link to statement of corporate social responsibility"},null,null,null,null,"PP_LinkToStatementOfCorporateSocialResponsibility",null,null,null,null,"",null,null,null,{"$f":"\"\"&INDEX(PP_Locale,ROW(),PP_LanguageIndex)","v":"Link to statement of corporate social responsibility"},"Link to statement of corporate social responsibility",null,null,"Link til redegørelse for samfundsansvar",null,null,null,null,null,null,null,null,null,null,null,null,null,null,null,null,null,null,null,null,null,null,null,null,null,null,null,null,null,null,null,null,null,null,null,null,null,null,null,null,null,null,null,null,null,null,null,null,null,null,null,null,null,null,null,null,null,null,null,null,null,null,null,null,null,null,null,null,null,null,null,null,null,null,null,null,null,null,"&allowhtml=false&merge=false",{"$f":"\"pp://General Data/\"&INDEX(PP_Locale,ROW(),1)&\"?taxonomy=\"&PP_TaxonomyId&\"&labellanguage=en&period=1\"&IF(PP_Consolidated,\"_Consolidated\",\"\")&CT66","v":"pp://General Data/Link to statement of corporate social responsibility?taxonomy=DKGAAP&labellanguage=en&period=1_Consolidated&allowhtml=false&merge=false"}]
[{"$f":"\"\"&INDEX(PP_Locale,ROW(),PP_LanguageIndex)","v":"Link to statement of diversity policies"},null,null,null,null,"PP_LinkToStatementOfDiversityPolicies",null,null,null,null,"",null,null,null,{"$f":"\"\"&INDEX(PP_Locale,ROW(),PP_LanguageIndex)","v":"Link to statement of diversity policies"},"Link to statement of diversity policies",null,null,"Link til redegørelse for politikker om mangfoldighed",null,null,null,null,null,null,null,null,null,null,null,null,null,null,null,null,null,null,null,null,null,null,null,null,null,null,null,null,null,null,null,null,null,null,null,null,null,null,null,null,null,null,null,null,null,null,null,null,null,null,null,null,null,null,null,null,null,null,null,null,null,null,null,null,null,null,null,null,null,null,null,null,null,null,null,null,null,null,"&allowhtml=false&merge=false",{"$f":"\"pp://General Data/\"&INDEX(PP_Locale,ROW(),1)&\"?taxonomy=\"&PP_TaxonomyId&\"&labellanguage=en&period=1\"&IF(PP_Consolidated,\"_Consolidated\",\"\")&CT67","v":"pp://General Data/Link to statement of diversity policies?taxonomy=DKGAAP&labellanguage=en&period=1_Consolidated&allowhtml=false&merge=false"}]
[{"$f":"\"\"&INDEX(PP_Locale,ROW(),PP_LanguageIndex)","v":"Link to statement of target figures and policies for the underrepresented gender"},null,null,null,null,"PP_LinkToStatementOfTargetFiguresAndPoliciesForTheUnderrepresentedGender",null,null,null,null,"",null,null,null,{"$f":"\"\"&INDEX(PP_Locale,ROW(),PP_LanguageIndex)","v":"Link to statement of target figures and policies for the underrepresented gender"},"Link to statement of target figures and policies for the underrepresented gender",null,null,"Link til redegørelse for måltal og politikker vedrørende det underrepræsenterede køn",null,null,null,null,null,null,null,null,null,null,null,null,null,null,null,null,null,null,null,null,null,null,null,null,null,null,null,null,null,null,null,null,null,null,null,null,null,null,null,null,null,null,null,null,null,null,null,null,null,null,null,null,null,null,null,null,null,null,null,null,null,null,null,null,null,null,null,null,null,null,null,null,null,null,null,null,null,null,"&allowhtml=false&merge=false",{"$f":"\"pp://General Data/\"&INDEX(PP_Locale,ROW(),1)&\"?taxonomy=\"&PP_TaxonomyId&\"&labellanguage=en&period=1\"&IF(PP_Consolidated,\"_Consolidated\",\"\")&CT68","v":"pp://General Data/Link to statement of target figures and policies for the underrepresented gender?taxonomy=DKGAAP&labellanguage=en&period=1_Consolidated&allowhtml=false&merge=false"}]
[{"$f":"\"\"&INDEX(PP_Locale,ROW(),PP_LanguageIndex)","v":"Link to statement of policy for data ethics"},null,null,null,null,"PP_LinkToStatementOfPolicyForDataEthics",null,null,null,null,"",null,null,null,{"$f":"\"\"&INDEX(PP_Locale,ROW(),PP_LanguageIndex)","v":"Link to statement of policy for data ethics"},"Link to statement of policy for data ethics",null,null,"Link til redegørelse for virksomhedens politik for dataetik",null,null,null,null,null,null,null,null,null,null,null,null,null,null,null,null,null,null,null,null,null,null,null,null,null,null,null,null,null,null,null,null,null,null,null,null,null,null,null,null,null,null,null,null,null,null,null,null,null,null,null,null,null,null,null,null,null,null,null,null,null,null,null,null,null,null,null,null,null,null,null,null,null,null,null,null,null,null,"&allowhtml=false&merge=false",{"$f":"\"pp://General Data/\"&INDEX(PP_Locale,ROW(),1)&\"?taxonomy=\"&PP_TaxonomyId&\"&labellanguage=en&period=1\"&IF(PP_Consolidated,\"_Consolidated\",\"\")&CT69","v":"pp://General Data/Link to statement of policy for data ethics?taxonomy=DKGAAP&labellanguage=en&period=1_Consolidated&allowhtml=false&merge=false"}]
[{"$f":"\"\"&INDEX(PP_Locale,ROW(),PP_LanguageIndex)","v":"Link to report on payments to authorities"},null,null,null,null,"PP_LinkToReportOnPaymentsToAuthorities",null,null,null,null,"",null,null,null,{"$f":"\"\"&INDEX(PP_Locale,ROW(),PP_LanguageIndex)","v":"Link to report on payments to authorities"},"Link to report on payments to authorities",null,null,"Link til beretning om betalinger til myndigheder",null,null,null,null,null,null,null,null,null,null,null,null,null,null,null,null,null,null,null,null,null,null,null,null,null,null,null,null,null,null,null,null,null,null,null,null,null,null,null,null,null,null,null,null,null,null,null,null,null,null,null,null,null,null,null,null,null,null,null,null,null,null,null,null,null,null,null,null,null,null,null,null,null,null,null,null,null,null,"&allowhtml=false&merge=false",{"$f":"\"pp://General Data/\"&INDEX(PP_Locale,ROW(),1)&\"?taxonomy=\"&PP_TaxonomyId&\"&labellanguage=en&period=1\"&IF(PP_Consolidated,\"_Consolidated\",\"\")&CT70","v":"pp://General Data/Link to report on payments to authorities?taxonomy=DKGAAP&labellanguage=en&period=1_Consolidated&allowhtml=false&merge=false"}]
[{"$f":"\"\"&INDEX(PP_Locale,ROW(),PP_LanguageIndex)","v":"Link to statement of good management concerning foundation"},null,null,null,null,"PP_LinkToStatementOfGoodManagementConcerningFoundation",null,null,null,null,"",null,null,null,{"$f":"\"\"&INDEX(PP_Locale,ROW(),PP_LanguageIndex)","v":"Link to statement of good management concerning foundation"},"Link to statement of good management concerning foundation",null,null,"Link til redegørelse for god fondsledelse",null,null,null,null,null,null,null,null,null,null,null,null,null,null,null,null,null,null,null,null,null,null,null,null,null,null,null,null,null,null,null,null,null,null,null,null,null,null,null,null,null,null,null,null,null,null,null,null,null,null,null,null,null,null,null,null,null,null,null,null,null,null,null,null,null,null,null,null,null,null,null,null,null,null,null,null,null,null,"&allowhtml=false&merge=false",{"$f":"\"pp://General Data/\"&INDEX(PP_Locale,ROW(),1)&\"?taxonomy=\"&PP_TaxonomyId&\"&labellanguage=en&period=1\"&IF(PP_Consolidated,\"_Consolidated\",\"\")&CT71","v":"pp://General Data/Link to statement of good management concerning foundation?taxonomy=DKGAAP&labellanguage=en&period=1_Consolidated&allowhtml=false&merge=false"}]
[{"$f":"\"\"&INDEX(PP_Locale,ROW(),PP_LanguageIndex)","v":"Link to statement of the foundation's distribution policy"},null,null,null,null,"PP_LinkToStatementOfTheFoundationsDistributionPolicy",null,null,null,null,"",null,null,null,{"$f":"\"\"&INDEX(PP_Locale,ROW(),PP_LanguageIndex)","v":"Link to statement of the foundation's distribution policy"},"Link to statement of the foundation's distribution policy",null,null,"Link til redegørelse for fondens uddelingspolitik",null,null,null,null,null,null,null,null,null,null,null,null,null,null,null,null,null,null,null,null,null,null,null,null,null,null,null,null,null,null,null,null,null,null,null,null,null,null,null,null,null,null,null,null,null,null,null,null,null,null,null,null,null,null,null,null,null,null,null,null,null,null,null,null,null,null,null,null,null,null,null,null,null,null,null,null,null,null,"&allowhtml=false&merge=false",{"$f":"\"pp://General Data/\"&INDEX(PP_Locale,ROW(),1)&\"?taxonomy=\"&PP_TaxonomyId&\"&labellanguage=en&period=1\"&IF(PP_Consolidated,\"_Consolidated\",\"\")&CT72","v":"pp://General Data/Link to statement of the foundation's distribution policy?taxonomy=DKGAAP&labellanguage=en&period=1_Consolidated&allowhtml=false&merge=false"}]
[{"$f":"\"\"&INDEX(PP_Locale,ROW(),PP_LanguageIndex)","v":"Average number of employees"},null,null,null,null,"PP_AverageNumberOfEmployees",null,null,null,null,{"$f":"IF(COUNTBLANK(B73),\"\",B73)","v":""},{"$f":"IF(COUNTBLANK(C73),\"\",C73)","v":""},{"$f":"IF(COUNTBLANK(D73),\"\",D73)","v":""},{"$f":"IF(COUNTBLANK(E73),\"\",E73)","v":""},{"$f":"\"\"&INDEX(PP_Locale,ROW(),PP_LanguageIndex)","v":"Average number of employees"},"Average number of employees",null,null,"Gennemsnitligt antal ansatte"]
[null,null,null,null,null,null,null,null,null,null,null,null,null,null,{"$f":"\"\"&INDEX(PP_Locale,ROW(),PP_LanguageIndex)","v":""}]
[{"$f":"\"\"&INDEX(PP_Locale,ROW(),PP_LanguageIndex)","v":"Dates/locations:"},null,null,null,null,null,null,null,null,null,null,null,null,null,{"$f":"\"\"&INDEX(PP_Locale,ROW(),PP_LanguageIndex)","v":"Dates/locations:"},"Dates/locations:",null,null,"Datoer/lokationer:"]
[{"$f":"\"\"&INDEX(PP_Locale,ROW(),PP_LanguageIndex)","v":"Place of signature of statement by management"},null,null,null,null,"PP_PlaceOfSignatureOfStatement",null,null,null,null,{"$f":"IF(A76=\"\",\"\",\"\"&B76)","v":""},null,null,null,{"$f":"\"\"&INDEX(PP_Locale,ROW(),PP_LanguageIndex)","v":"Place of signature of statement by management"},"Place of signature of statement by management",null,null,"Ledelsespåtegning, sted",null,null,null,null,null,null,null,null,null,null,null,null,null,null,null,null,null,null,null,null,null,null,null,null,null,null,null,null,null,null,null,null,null,null,null,null,null,null,null,null,null,null,null,null,null,null,null,null,null,null,null,null,null,null,null,null,null,null,null,null,null,null,null,null,null,null,null,null,null,null,null,null,null,null,null,null,null,null,"&allowhtml=false&merge=false",{"$f":"\"pp://General Data/\"&INDEX(PP_Locale,ROW(),1)&\"?taxonomy=\"&PP_TaxonomyId&\"&labellanguage=en&period=1\"&IF(PP_Consolidated,\"_Consolidated\",\"\")&CT76","v":"pp://General Data/Place of signature of statement by management?taxonomy=DKGAAP&labellanguage=en&period=1_Consolidated&allowhtml=false&merge=false"}]
[{"$f":"\"\"&INDEX(PP_Locale,ROW(),PP_LanguageIndex)","v":"Date of approval of annual report"},null,null,null,null,"PP_DateOfApprovalOfAnnualReport",null,null,null,null,{"$f":"IF(COUNTBLANK(B77),\"\",TEXT(YEAR(B77),\"0000\")&\"-\"&TEXT(MONTH(B77),\"00\")&\"-\"&TEXT(DAY(B77),\"00\"))","v":""},null,null,null,{"$f":"\"\"&INDEX(PP_Locale,ROW(),PP_LanguageIndex)","v":"Date of approval of annual report"},"Date of approval of annual report",null,null,"Dato for ledelsens godkendelse af årsrapporten",null,null,null,null,null,null,null,null,null,null,null,null,null,null,null,null,null,null,null,null,null,null,null,null,null,null,null,null,null,null,null,null,null,null,null,null,null,null,null,null,null,null,null,null,null,null,null,null,null,null,null,null,null,null,null,null,null,null,null,null,null,null,null,null,null,null,null,null,null,null,null,null,null,null,null,null,null,null,"&allowhtml=false&merge=false",{"$f":"\"pp://General Data/\"&INDEX(PP_Locale,ROW(),1)&\"?taxonomy=\"&PP_TaxonomyId&\"&labellanguage=en&period=1\"&IF(PP_Consolidated,\"_Consolidated\",\"\")&CT77","v":"pp://General Data/Date of approval of annual report?taxonomy=DKGAAP&labellanguage=en&period=1_Consolidated&allowhtml=false&merge=false"}]
[null,null,null,null,null,null,null,null,null,null,null,null,null,null,{"$f":"\"\"&INDEX(PP_Locale,ROW(),PP_LanguageIndex)","v":""}]
[{"$f":"\"\"&INDEX(PP_Locale,ROW(),PP_LanguageIndex)","v":"Executive board:"},null,null,null,null,null,null,null,null,null,null,null,null,null,{"$f":"\"\"&INDEX(PP_Locale,ROW(),PP_LanguageIndex)","v":"Executive board:"},"Executive board:",null,null,"Direktion:"]
[{"$f":"\"\"&INDEX(PP_Locale,ROW(),PP_LanguageIndex)","v":"Name and surname of member of executive board 1"},null,null,null,null,"PP_NameAndSurnameOfMemberOfExecutiveBoard_1",null,null,null,null,{"$f":"\"\"&B80","v":""},null,null,null,{"$f":"\"\"&INDEX(PP_Locale,ROW(),PP_LanguageIndex)","v":"Name and surname of member of executive board 1"},"Name and surname of member of executive board 1",null,null,"Direktionsmedlems navn 1",null,null,null,null,null,null,null,null,null,null,null,null,null,null,null,null,null,null,null,null,null,null,null,null,null,null,null,null,null,null,null,null,null,null,null,null,null,null,null,null,null,null,null,null,null,null,null,null,null,null,null,null,null,null,null,null,null,null,null,null,null,null,null,null,null,null,null,null,null,null,null,null,null,null,null,null,null,null,"&allowhtml=false&merge=false",{"$f":"\"pp://General Data/\"&INDEX(PP_Locale,ROW(),1)&\"?taxonomy=\"&PP_TaxonomyId&\"&labellanguage=en&period=1\"&IF(PP_Consolidated,\"_Consolidated\",\"\")&CT80","v":"pp://General Data/Name and surname of member of executive board 1?taxonomy=DKGAAP&labellanguage=en&period=1_Consolidated&allowhtml=false&merge=false"}]
[{"$f":"\"\"&INDEX(PP_Locale,ROW(),PP_LanguageIndex)","v":"Title of member of executive board 1"},null,null,null,null,"PP_TitleOfMemberOfExecutiveBoard_1",null,null,null,null,"",null,null,null,{"$f":"\"\"&INDEX(PP_Locale,ROW(),PP_LanguageIndex)","v":"Title of member of executive board 1"},"Title of member of executive board 1",null,null,"Direktionsmedlems titel 1",null,null,null,null,null,null,null,null,null,null,null,null,null,null,null,null,null,null,null,null,null,null,null,null,null,null,null,null,null,null,null,null,null,null,null,null,null,null,null,null,null,null,null,null,null,null,null,null,null,null,null,null,null,null,null,null,null,null,null,null,null,null,null,null,null,null,null,null,null,null,null,null,null,null,null,null,null,null,"&allowhtml=false&merge=false",{"$f":"\"pp://General Data/\"&INDEX(PP_Locale,ROW(),1)&\"?taxonomy=\"&PP_TaxonomyId&\"&labellanguage=en&period=1\"&IF(PP_Consolidated,\"_Consolidated\",\"\")&CT81","v":"pp://General Data/Title of member of executive board 1?taxonomy=DKGAAP&labellanguage=en&period=1_Consolidated&allowhtml=false&merge=false"}]
[{"$f":"\"\"&INDEX(PP_Locale,ROW(),PP_LanguageIndex)","v":"Name and surname of member of executive board 2"},null,null,null,null,"PP_NameAndSurnameOfMemberOfExecutiveBoard_2",null,null,null,null,"",null,null,null,{"$f":"\"\"&INDEX(PP_Locale,ROW(),PP_LanguageIndex)","v":"Name and surname of member of executive board 2"},"Name and surname of member of executive board 2",null,null,"Direktionsmedlems navn 2",null,null,null,null,null,null,null,null,null,null,null,null,null,null,null,null,null,null,null,null,null,null,null,null,null,null,null,null,null,null,null,null,null,null,null,null,null,null,null,null,null,null,null,null,null,null,null,null,null,null,null,null,null,null,null,null,null,null,null,null,null,null,null,null,null,null,null,null,null,null,null,null,null,null,null,null,null,null,"&allowhtml=false&merge=false",{"$f":"\"pp://General Data/\"&INDEX(PP_Locale,ROW(),1)&\"?taxonomy=\"&PP_TaxonomyId&\"&labellanguage=en&period=1\"&IF(PP_Consolidated,\"_Consolidated\",\"\")&CT82","v":"pp://General Data/Name and surname of member of executive board 2?taxonomy=DKGAAP&labellanguage=en&period=1_Consolidated&allowhtml=false&merge=false"}]
[{"$f":"\"\"&INDEX(PP_Locale,ROW(),PP_LanguageIndex)","v":"Title of member of executive board 2"},null,null,null,null,"PP_TitleOfMemberOfExecutiveBoard_2",null,null,null,null,"",null,null,null,{"$f":"\"\"&INDEX(PP_Locale,ROW(),PP_LanguageIndex)","v":"Title of member of executive board 2"},"Title of member of executive board 2",null,null,"Direktionsmedlems titel 2",null,null,null,null,null,null,null,null,null,null,null,null,null,null,null,null,null,null,null,null,null,null,null,null,null,null,null,null,null,null,null,null,null,null,null,null,null,null,null,null,null,null,null,null,null,null,null,null,null,null,null,null,null,null,null,null,null,null,null,null,null,null,null,null,null,null,null,null,null,null,null,null,null,null,null,null,null,null,"&allowhtml=false&merge=false",{"$f":"\"pp://General Data/\"&INDEX(PP_Locale,ROW(),1)&\"?taxonomy=\"&PP_TaxonomyId&\"&labellanguage=en&period=1\"&IF(PP_Consolidated,\"_Consolidated\",\"\")&CT83","v":"pp://General Data/Title of member of executive board 2?taxonomy=DKGAAP&labellanguage=en&period=1_Consolidated&allowhtml=false&merge=false"}]
[{"$f":"\"\"&INDEX(PP_Locale,ROW(),PP_LanguageIndex)","v":"Name and surname of member of executive board 3"},null,null,null,null,"PP_NameAndSurnameOfMemberOfExecutiveBoard_3",null,null,null,null,"",null,null,null,{"$f":"\"\"&INDEX(PP_Locale,ROW(),PP_LanguageIndex)","v":"Name and surname of member of executive board 3"},"Name and surname of member of executive board 3",null,null,"Direktionsmedlems navn 3",null,null,null,null,null,null,null,null,null,null,null,null,null,null,null,null,null,null,null,null,null,null,null,null,null,null,null,null,null,null,null,null,null,null,null,null,null,null,null,null,null,null,null,null,null,null,null,null,null,null,null,null,null,null,null,null,null,null,null,null,null,null,null,null,null,null,null,null,null,null,null,null,null,null,null,null,null,null,"&allowhtml=false&merge=false",{"$f":"\"pp://General Data/\"&INDEX(PP_Locale,ROW(),1)&\"?taxonomy=\"&PP_TaxonomyId&\"&labellanguage=en&period=1\"&IF(PP_Consolidated,\"_Consolidated\",\"\")&CT84","v":"pp://General Data/Name and surname of member of executive board 3?taxonomy=DKGAAP&labellanguage=en&period=1_Consolidated&allowhtml=false&merge=false"}]
[{"$f":"\"\"&INDEX(PP_Locale,ROW(),PP_LanguageIndex)","v":"Title of member of executive board 3"},null,null,null,null,"PP_TitleOfMemberOfExecutiveBoard_3",null,null,null,null,"",null,null,null,{"$f":"\"\"&INDEX(PP_Locale,ROW(),PP_LanguageIndex)","v":"Title of member of executive board 3"},"Title of member of executive board 3",null,null,"Direktionsmedlems titel 3",null,null,null,null,null,null,null,null,null,null,null,null,null,null,null,null,null,null,null,null,null,null,null,null,null,null,null,null,null,null,null,null,null,null,null,null,null,null,null,null,null,null,null,null,null,null,null,null,null,null,null,null,null,null,null,null,null,null,null,null,null,null,null,null,null,null,null,null,null,null,null,null,null,null,null,null,null,null,"&allowhtml=false&merge=false",{"$f":"\"pp://General Data/\"&INDEX(PP_Locale,ROW(),1)&\"?taxonomy=\"&PP_TaxonomyId&\"&labellanguage=en&period=1\"&IF(PP_Consolidated,\"_Consolidated\",\"\")&CT85","v":"pp://General Data/Title of member of executive board 3?taxonomy=DKGAAP&labellanguage=en&period=1_Consolidated&allowhtml=false&merge=false"}]
[{"$f":"\"\"&INDEX(PP_Locale,ROW(),PP_LanguageIndex)","v":"Name and surname of member of executive board 4"},null,null,null,null,"PP_NameAndSurnameOfMemberOfExecutiveBoard_4",null,null,null,null,"",null,null,null,{"$f":"\"\"&INDEX(PP_Locale,ROW(),PP_LanguageIndex)","v":"Name and surname of member of executive board 4"},"Name and surname of member of executive board 4",null,null,"Direktionsmedlems navn 4",null,null,null,null,null,null,null,null,null,null,null,null,null,null,null,null,null,null,null,null,null,null,null,null,null,null,null,null,null,null,null,null,null,null,null,null,null,null,null,null,null,null,null,null,null,null,null,null,null,null,null,null,null,null,null,null,null,null,null,null,null,null,null,null,null,null,null,null,null,null,null,null,null,null,null,null,null,null,"&allowhtml=false&merge=false",{"$f":"\"pp://General Data/\"&INDEX(PP_Locale,ROW(),1)&\"?taxonomy=\"&PP_TaxonomyId&\"&labellanguage=en&period=1\"&IF(PP_Consolidated,\"_Consolidated\",\"\")&CT86","v":"pp://General Data/Name and surname of member of executive board 4?taxonomy=DKGAAP&labellanguage=en&period=1_Consolidated&allowhtml=false&merge=false"}]
[{"$f":"\"\"&INDEX(PP_Locale,ROW(),PP_LanguageIndex)","v":"Title of member of executive board 4"},null,null,null,null,"PP_TitleOfMemberOfExecutiveBoard_4",null,null,null,null,"",null,null,null,{"$f":"\"\"&INDEX(PP_Locale,ROW(),PP_LanguageIndex)","v":"Title of member of executive board 4"},"Title of member of executive board 4",null,null,"Direktionsmedlems titel 4",null,null,null,null,null,null,null,null,null,null,null,null,null,null,null,null,null,null,null,null,null,null,null,null,null,null,null,null,null,null,null,null,null,null,null,null,null,null,null,null,null,null,null,null,null,null,null,null,null,null,null,null,null,null,null,null,null,null,null,null,null,null,null,null,null,null,null,null,null,null,null,null,null,null,null,null,null,null,"&allowhtml=false&merge=false",{"$f":"\"pp://General Data/\"&INDEX(PP_Locale,ROW(),1)&\"?taxonomy=\"&PP_TaxonomyId&\"&labellanguage=en&period=1\"&IF(PP_Consolidated,\"_Consolidated\",\"\")&CT87","v":"pp://General Data/Title of member of executive board 4?taxonomy=DKGAAP&labellanguage=en&period=1_Consolidated&allowhtml=false&merge=false"}]
[{"$f":"\"\"&INDEX(PP_Locale,ROW(),PP_LanguageIndex)","v":"Name and surname of member of executive board 5"},null,null,null,null,"PP_NameAndSurnameOfMemberOfExecutiveBoard_5",null,null,null,null,"",null,null,null,{"$f":"\"\"&INDEX(PP_Locale,ROW(),PP_LanguageIndex)","v":"Name and surname of member of executive board 5"},"Name and surname of member of executive board 5",null,null,"Direktionsmedlems navn 5",null,null,null,null,null,null,null,null,null,null,null,null,null,null,null,null,null,null,null,null,null,null,null,null,null,null,null,null,null,null,null,null,null,null,null,null,null,null,null,null,null,null,null,null,null,null,null,null,null,null,null,null,null,null,null,null,null,null,null,null,null,null,null,null,null,null,null,null,null,null,null,null,null,null,null,null,null,null,"&allowhtml=false&merge=false",{"$f":"\"pp://General Data/\"&INDEX(PP_Locale,ROW(),1)&\"?taxonomy=\"&PP_TaxonomyId&\"&labellanguage=en&period=1\"&IF(PP_Consolidated,\"_Consolidated\",\"\")&CT88","v":"pp://General Data/Name and surname of member of executive board 5?taxonomy=DKGAAP&labellanguage=en&period=1_Consolidated&allowhtml=false&merge=false"}]
[{"$f":"\"\"&INDEX(PP_Locale,ROW(),PP_LanguageIndex)","v":"Title of member of executive board 5"},null,null,null,null,"PP_TitleOfMemberOfExecutiveBoard_5",null,null,null,null,"",null,null,null,{"$f":"\"\"&INDEX(PP_Locale,ROW(),PP_LanguageIndex)","v":"Title of member of executive board 5"},"Title of member of executive board 5",null,null,"Direktionsmedlems titel 5",null,null,null,null,null,null,null,null,null,null,null,null,null,null,null,null,null,null,null,null,null,null,null,null,null,null,null,null,null,null,null,null,null,null,null,null,null,null,null,null,null,null,null,null,null,null,null,null,null,null,null,null,null,null,null,null,null,null,null,null,null,null,null,null,null,null,null,null,null,null,null,null,null,null,null,null,null,null,"&allowhtml=false&merge=false",{"$f":"\"pp://General Data/\"&INDEX(PP_Locale,ROW(),1)&\"?taxonomy=\"&PP_TaxonomyId&\"&labellanguage=en&period=1\"&IF(PP_Consolidated,\"_Consolidated\",\"\")&CT89","v":"pp://General Data/Title of member of executive board 5?taxonomy=DKGAAP&labellanguage=en&period=1_Consolidated&allowhtml=false&merge=false"}]
[{"$f":"\"\"&INDEX(PP_Locale,ROW(),PP_LanguageIndex)","v":"Name and surname of member of executive board 6"},null,null,null,null,"PP_NameAndSurnameOfMemberOfExecutiveBoard_6",null,null,null,null,"",null,null,null,{"$f":"\"\"&INDEX(PP_Locale,ROW(),PP_LanguageIndex)","v":"Name and surname of member of executive board 6"},"Name and surname of member of executive board 6",null,null,"Direktionsmedlems navn 6",null,null,null,null,null,null,null,null,null,null,null,null,null,null,null,null,null,null,null,null,null,null,null,null,null,null,null,null,null,null,null,null,null,null,null,null,null,null,null,null,null,null,null,null,null,null,null,null,null,null,null,null,null,null,null,null,null,null,null,null,null,null,null,null,null,null,null,null,null,null,null,null,null,null,null,null,null,null,"&allowhtml=false&merge=false",{"$f":"\"pp://General Data/\"&INDEX(PP_Locale,ROW(),1)&\"?taxonomy=\"&PP_TaxonomyId&\"&labellanguage=en&period=1\"&IF(PP_Consolidated,\"_Consolidated\",\"\")&CT90","v":"pp://General Data/Name and surname of member of executive board 6?taxonomy=DKGAAP&labellanguage=en&period=1_Consolidated&allowhtml=false&merge=false"}]
[{"$f":"\"\"&INDEX(PP_Locale,ROW(),PP_LanguageIndex)","v":"Title of member of executive board 6"},null,null,null,null,"PP_TitleOfMemberOfExecutiveBoard_6",null,null,null,null,"",null,null,null,{"$f":"\"\"&INDEX(PP_Locale,ROW(),PP_LanguageIndex)","v":"Title of member of executive board 6"},"Title of member of executive board 6",null,null,"Direktionsmedlems titel 6",null,null,null,null,null,null,null,null,null,null,null,null,null,null,null,null,null,null,null,null,null,null,null,null,null,null,null,null,null,null,null,null,null,null,null,null,null,null,null,null,null,null,null,null,null,null,null,null,null,null,null,null,null,null,null,null,null,null,null,null,null,null,null,null,null,null,null,null,null,null,null,null,null,null,null,null,null,null,"&allowhtml=false&merge=false",{"$f":"\"pp://General Data/\"&INDEX(PP_Locale,ROW(),1)&\"?taxonomy=\"&PP_TaxonomyId&\"&labellanguage=en&period=1\"&IF(PP_Consolidated,\"_Consolidated\",\"\")&CT91","v":"pp://General Data/Title of member of executive board 6?taxonomy=DKGAAP&labellanguage=en&period=1_Consolidated&allowhtml=false&merge=false"}]
[null,null,null,null,null,null,null,null,null,null,null,null,null,null,{"$f":"\"\"&INDEX(PP_Locale,ROW(),PP_LanguageIndex)","v":""}]
[{"$f":"\"\"&INDEX(PP_Locale,ROW(),PP_LanguageIndex)","v":"Supervisory board:"},null,null,null,null,null,null,null,null,null,null,null,null,null,{"$f":"\"\"&INDEX(PP_Locale,ROW(),PP_LanguageIndex)","v":"Supervisory board:"},"Supervisory board:",null,null,"Bestyrelse:"]
[{"$f":"\"\"&INDEX(PP_Locale,ROW(),PP_LanguageIndex)","v":"Name and surname of member of supervisory board 1"},null,null,null,null,"PP_NameAndSurnameOfMemberOfSupervisoryBoard_1",null,null,null,null,{"$f":"\"\"&B94","v":""},null,null,null,{"$f":"\"\"&INDEX(PP_Locale,ROW(),PP_LanguageIndex)","v":"Name and surname of member of supervisory board 1"},"Name and surname of member of supervisory board 1",null,null,"Bestyrelsesmedlems navn 1",null,null,null,null,null,null,null,null,null,null,null,null,null,null,null,null,null,null,null,null,null,null,null,null,null,null,null,null,null,null,null,null,null,null,null,null,null,null,null,null,null,null,null,null,null,null,null,null,null,null,null,null,null,null,null,null,null,null,null,null,null,null,null,null,null,null,null,null,null,null,null,null,null,null,null,null,null,null,"&allowhtml=false&merge=false",{"$f":"\"pp://General Data/\"&INDEX(PP_Locale,ROW(),1)&\"?taxonomy=\"&PP_TaxonomyId&\"&labellanguage=en&period=1\"&IF(PP_Consolidated,\"_Consolidated\",\"\")&CT94","v":"pp://General Data/Name and surname of member of supervisory board 1?taxonomy=DKGAAP&labellanguage=en&period=1_Consolidated&allowhtml=false&merge=false"}]
[{"$f":"\"\"&INDEX(PP_Locale,ROW(),PP_LanguageIndex)","v":"Title of member of supervisory board 1"},null,null,null,null,"PP_TitleOfMemberOfSupervisoryBoard_1",null,null,null,null,"",null,null,null,{"$f":"\"\"&INDEX(PP_Locale,ROW(),PP_LanguageIndex)","v":"Title of member of supervisory board 1"},"Title of member of supervisory board 1",null,null,"Bestyrelsesmedlems titel 1",null,null,null,null,null,null,null,null,null,null,null,null,null,null,null,null,null,null,null,null,null,null,null,null,null,null,null,null,null,null,null,null,null,null,null,null,null,null,null,null,null,null,null,null,null,null,null,null,null,null,null,null,null,null,null,null,null,null,null,null,null,null,null,null,null,null,null,null,null,null,null,null,null,null,null,null,null,null,"&allowhtml=false&merge=false",{"$f":"\"pp://General Data/\"&INDEX(PP_Locale,ROW(),1)&\"?taxonomy=\"&PP_TaxonomyId&\"&labellanguage=en&period=1\"&IF(PP_Consolidated,\"_Consolidated\",\"\")&CT95","v":"pp://General Data/Title of member of supervisory board 1?taxonomy=DKGAAP&labellanguage=en&period=1_Consolidated&allowhtml=false&merge=false"}]
[{"$f":"\"\"&INDEX(PP_Locale,ROW(),PP_LanguageIndex)","v":"Name and surname of member of supervisory board 2"},null,null,null,null,"PP_NameAndSurnameOfMemberOfSupervisoryBoard_2",null,null,null,null,"",null,null,null,{"$f":"\"\"&INDEX(PP_Locale,ROW(),PP_LanguageIndex)","v":"Name and surname of member of supervisory board 2"},"Name and surname of member of supervisory board 2",null,null,"Bestyrelsesmedlems navn 2",null,null,null,null,null,null,null,null,null,null,null,null,null,null,null,null,null,null,null,null,null,null,null,null,null,null,null,null,null,null,null,null,null,null,null,null,null,null,null,null,null,null,null,null,null,null,null,null,null,null,null,null,null,null,null,null,null,null,null,null,null,null,null,null,null,null,null,null,null,null,null,null,null,null,null,null,null,null,"&allowhtml=false&merge=false",{"$f":"\"pp://General Data/\"&INDEX(PP_Locale,ROW(),1)&\"?taxonomy=\"&PP_TaxonomyId&\"&labellanguage=en&period=1\"&IF(PP_Consolidated,\"_Consolidated\",\"\")&CT96","v":"pp://General Data/Name and surname of member of supervisory board 2?taxonomy=DKGAAP&labellanguage=en&period=1_Consolidated&allowhtml=false&merge=false"}]
[{"$f":"\"\"&INDEX(PP_Locale,ROW(),PP_LanguageIndex)","v":"Title of member of supervisory board 2"},null,null,null,null,"PP_TitleOfMemberOfSupervisoryBoard_2",null,null,null,null,"",null,null,null,{"$f":"\"\"&INDEX(PP_Locale,ROW(),PP_LanguageIndex)","v":"Title of member of supervisory board 2"},"Title of member of supervisory board 2",null,null,"Bestyrelsesmedlems titel 2",null,null,null,null,null,null,null,null,null,null,null,null,null,null,null,null,null,null,null,null,null,null,null,null,null,null,null,null,null,null,null,null,null,null,null,null,null,null,null,null,null,null,null,null,null,null,null,null,null,null,null,null,null,null,null,null,null,null,null,null,null,null,null,null,null,null,null,null,null,null,null,null,null,null,null,null,null,null,"&allowhtml=false&merge=false",{"$f":"\"pp://General Data/\"&INDEX(PP_Locale,ROW(),1)&\"?taxonomy=\"&PP_TaxonomyId&\"&labellanguage=en&period=1\"&IF(PP_Consolidated,\"_Consolidated\",\"\")&CT97","v":"pp://General Data/Title of member of supervisory board 2?taxonomy=DKGAAP&labellanguage=en&period=1_Consolidated&allowhtml=false&merge=false"}]
[{"$f":"\"\"&INDEX(PP_Locale,ROW(),PP_LanguageIndex)","v":"Name and surname of member of supervisory board 3"},null,null,null,null,"PP_NameAndSurnameOfMemberOfSupervisoryBoard_3",null,null,null,null,"",null,null,null,{"$f":"\"\"&INDEX(PP_Locale,ROW(),PP_LanguageIndex)","v":"Name and surname of member of supervisory board 3"},"Name and surname of member of supervisory board 3",null,null,"Bestyrelsesmedlems navn 3",null,null,null,null,null,null,null,null,null,null,null,null,null,null,null,null,null,null,null,null,null,null,null,null,null,null,null,null,null,null,null,null,null,null,null,null,null,null,null,null,null,null,null,null,null,null,null,null,null,null,null,null,null,null,null,null,null,null,null,null,null,null,null,null,null,null,null,null,null,null,null,null,null,null,null,null,null,null,"&allowhtml=false&merge=false",{"$f":"\"pp://General Data/\"&INDEX(PP_Locale,ROW(),1)&\"?taxonomy=\"&PP_TaxonomyId&\"&labellanguage=en&period=1\"&IF(PP_Consolidated,\"_Consolidated\",\"\")&CT98","v":"pp://General Data/Name and surname of member of supervisory board 3?taxonomy=DKGAAP&labellanguage=en&period=1_Consolidated&allowhtml=false&merge=false"}]
[{"$f":"\"\"&INDEX(PP_Locale,ROW(),PP_LanguageIndex)","v":"Title of member of supervisory board 3"},null,null,null,null,"PP_TitleOfMemberOfSupervisoryBoard_3",null,null,null,null,"",null,null,null,{"$f":"\"\"&INDEX(PP_Locale,ROW(),PP_LanguageIndex)","v":"Title of member of supervisory board 3"},"Title of member of supervisory board 3",null,null,"Bestyrelsesmedlems titel 3",null,null,null,null,null,null,null,null,null,null,null,null,null,null,null,null,null,null,null,null,null,null,null,null,null,null,null,null,null,null,null,null,null,null,null,null,null,null,null,null,null,null,null,null,null,null,null,null,null,null,null,null,null,null,null,null,null,null,null,null,null,null,null,null,null,null,null,null,null,null,null,null,null,null,null,null,null,null,"&allowhtml=false&merge=false",{"$f":"\"pp://General Data/\"&INDEX(PP_Locale,ROW(),1)&\"?taxonomy=\"&PP_TaxonomyId&\"&labellanguage=en&period=1\"&IF(PP_Consolidated,\"_Consolidated\",\"\")&CT99","v":"pp://General Data/Title of member of supervisory board 3?taxonomy=DKGAAP&labellanguage=en&period=1_Consolidated&allowhtml=false&merge=false"}]
[{"$f":"\"\"&INDEX(PP_Locale,ROW(),PP_LanguageIndex)","v":"Name and surname of member of supervisory board 4"},null,null,null,null,"PP_NameAndSurnameOfMemberOfSupervisoryBoard_4",null,null,null,null,"",null,null,null,{"$f":"\"\"&INDEX(PP_Locale,ROW(),PP_LanguageIndex)","v":"Name and surname of member of supervisory board 4"},"Name and surname of member of supervisory board 4",null,null,"Bestyrelsesmedlems navn 4",null,null,null,null,null,null,null,null,null,null,null,null,null,null,null,null,null,null,null,null,null,null,null,null,null,null,null,null,null,null,null,null,null,null,null,null,null,null,null,null,null,null,null,null,null,null,null,null,null,null,null,null,null,null,null,null,null,null,null,null,null,null,null,null,null,null,null,null,null,null,null,null,null,null,null,null,null,null,"&allowhtml=false&merge=false",{"$f":"\"pp://General Data/\"&INDEX(PP_Locale,ROW(),1)&\"?taxonomy=\"&PP_TaxonomyId&\"&labellanguage=en&period=1\"&IF(PP_Consolidated,\"_Consolidated\",\"\")&CT100","v":"pp://General Data/Name and surname of member of supervisory board 4?taxonomy=DKGAAP&labellanguage=en&period=1_Consolidated&allowhtml=false&merge=false"}]
[{"$f":"\"\"&INDEX(PP_Locale,ROW(),PP_LanguageIndex)","v":"Title of member of supervisory board 4"},null,null,null,null,"PP_TitleOfMemberOfSupervisoryBoard_4",null,null,null,null,"",null,null,null,{"$f":"\"\"&INDEX(PP_Locale,ROW(),PP_LanguageIndex)","v":"Title of member of supervisory board 4"},"Title of member of supervisory board 4",null,null,"Bestyrelsesmedlems titel 4",null,null,null,null,null,null,null,null,null,null,null,null,null,null,null,null,null,null,null,null,null,null,null,null,null,null,null,null,null,null,null,null,null,null,null,null,null,null,null,null,null,null,null,null,null,null,null,null,null,null,null,null,null,null,null,null,null,null,null,null,null,null,null,null,null,null,null,null,null,null,null,null,null,null,null,null,null,null,"&allowhtml=false&merge=false",{"$f":"\"pp://General Data/\"&INDEX(PP_Locale,ROW(),1)&\"?taxonomy=\"&PP_TaxonomyId&\"&labellanguage=en&period=1\"&IF(PP_Consolidated,\"_Consolidated\",\"\")&CT101","v":"pp://General Data/Title of member of supervisory board 4?taxonomy=DKGAAP&labellanguage=en&period=1_Consolidated&allowhtml=false&merge=false"}]
[{"$f":"\"\"&INDEX(PP_Locale,ROW(),PP_LanguageIndex)","v":"Name and surname of member of supervisory board 5"},null,null,null,null,"PP_NameAndSurnameOfMemberOfSupervisoryBoard_5",null,null,null,null,"",null,null,null,{"$f":"\"\"&INDEX(PP_Locale,ROW(),PP_LanguageIndex)","v":"Name and surname of member of supervisory board 5"},"Name and surname of member of supervisory board 5",null,null,"Bestyrelsesmedlems navn 5",null,null,null,null,null,null,null,null,null,null,null,null,null,null,null,null,null,null,null,null,null,null,null,null,null,null,null,null,null,null,null,null,null,null,null,null,null,null,null,null,null,null,null,null,null,null,null,null,null,null,null,null,null,null,null,null,null,null,null,null,null,null,null,null,null,null,null,null,null,null,null,null,null,null,null,null,null,null,"&allowhtml=false&merge=false",{"$f":"\"pp://General Data/\"&INDEX(PP_Locale,ROW(),1)&\"?taxonomy=\"&PP_TaxonomyId&\"&labellanguage=en&period=1\"&IF(PP_Consolidated,\"_Consolidated\",\"\")&CT102","v":"pp://General Data/Name and surname of member of supervisory board 5?taxonomy=DKGAAP&labellanguage=en&period=1_Consolidated&allowhtml=false&merge=false"}]
[{"$f":"\"\"&INDEX(PP_Locale,ROW(),PP_LanguageIndex)","v":"Title of member of supervisory board 5"},null,null,null,null,"PP_TitleOfMemberOfSupervisoryBoard_5",null,null,null,null,"",null,null,null,{"$f":"\"\"&INDEX(PP_Locale,ROW(),PP_LanguageIndex)","v":"Title of member of supervisory board 5"},"Title of member of supervisory board 5",null,null,"Bestyrelsesmedlems titel 5",null,null,null,null,null,null,null,null,null,null,null,null,null,null,null,null,null,null,null,null,null,null,null,null,null,null,null,null,null,null,null,null,null,null,null,null,null,null,null,null,null,null,null,null,null,null,null,null,null,null,null,null,null,null,null,null,null,null,null,null,null,null,null,null,null,null,null,null,null,null,null,null,null,null,null,null,null,null,"&allowhtml=false&merge=false",{"$f":"\"pp://General Data/\"&INDEX(PP_Locale,ROW(),1)&\"?taxonomy=\"&PP_TaxonomyId&\"&labellanguage=en&period=1\"&IF(PP_Consolidated,\"_Consolidated\",\"\")&CT103","v":"pp://General Data/Title of member of supervisory board 5?taxonomy=DKGAAP&labellanguage=en&period=1_Consolidated&allowhtml=false&merge=false"}]
[{"$f":"\"\"&INDEX(PP_Locale,ROW(),PP_LanguageIndex)","v":"Name and surname of member of supervisory board 6"},null,null,null,null,"PP_NameAndSurnameOfMemberOfSupervisoryBoard_6",null,null,null,null,"",null,null,null,{"$f":"\"\"&INDEX(PP_Locale,ROW(),PP_LanguageIndex)","v":"Name and surname of member of supervisory board 6"},"Name and surname of member of supervisory board 6",null,null,"Bestyrelsesmedlems navn 6",null,null,null,null,null,null,null,null,null,null,null,null,null,null,null,null,null,null,null,null,null,null,null,null,null,null,null,null,null,null,null,null,null,null,null,null,null,null,null,null,null,null,null,null,null,null,null,null,null,null,null,null,null,null,null,null,null,null,null,null,null,null,null,null,null,null,null,null,null,null,null,null,null,null,null,null,null,null,"&allowhtml=false&merge=false",{"$f":"\"pp://General Data/\"&INDEX(PP_Locale,ROW(),1)&\"?taxonomy=\"&PP_TaxonomyId&\"&labellanguage=en&period=1\"&IF(PP_Consolidated,\"_Consolidated\",\"\")&CT104","v":"pp://General Data/Name and surname of member of supervisory board 6?taxonomy=DKGAAP&labellanguage=en&period=1_Consolidated&allowhtml=false&merge=false"}]
[{"$f":"\"\"&INDEX(PP_Locale,ROW(),PP_LanguageIndex)","v":"Title of member of supervisory board 6"},null,null,null,null,"PP_TitleOfMemberOfSupervisoryBoard_6",null,null,null,null,"",null,null,null,{"$f":"\"\"&INDEX(PP_Locale,ROW(),PP_LanguageIndex)","v":"Title of member of supervisory board 6"},"Title of member of supervisory board 6",null,null,"Bestyrelsesmedlems titel 6",null,null,null,null,null,null,null,null,null,null,null,null,null,null,null,null,null,null,null,null,null,null,null,null,null,null,null,null,null,null,null,null,null,null,null,null,null,null,null,null,null,null,null,null,null,null,null,null,null,null,null,null,null,null,null,null,null,null,null,null,null,null,null,null,null,null,null,null,null,null,null,null,null,null,null,null,null,null,"&allowhtml=false&merge=false",{"$f":"\"pp://General Data/\"&INDEX(PP_Locale,ROW(),1)&\"?taxonomy=\"&PP_TaxonomyId&\"&labellanguage=en&period=1\"&IF(PP_Consolidated,\"_Consolidated\",\"\")&CT105","v":"pp://General Data/Title of member of supervisory board 6?taxonomy=DKGAAP&labellanguage=en&period=1_Consolidated&allowhtml=false&merge=false"}]
[{"$f":"\"\"&INDEX(PP_Locale,ROW(),PP_LanguageIndex)","v":"Name and surname of member of supervisory board 7"},null,null,null,null,"PP_NameAndSurnameOfMemberOfSupervisoryBoard_7",null,null,null,null,"",null,null,null,{"$f":"\"\"&INDEX(PP_Locale,ROW(),PP_LanguageIndex)","v":"Name and surname of member of supervisory board 7"},"Name and surname of member of supervisory board 7",null,null,"Bestyrelsesmedlems navn 7",null,null,null,null,null,null,null,null,null,null,null,null,null,null,null,null,null,null,null,null,null,null,null,null,null,null,null,null,null,null,null,null,null,null,null,null,null,null,null,null,null,null,null,null,null,null,null,null,null,null,null,null,null,null,null,null,null,null,null,null,null,null,null,null,null,null,null,null,null,null,null,null,null,null,null,null,null,null,"&allowhtml=false&merge=false",{"$f":"\"pp://General Data/\"&INDEX(PP_Locale,ROW(),1)&\"?taxonomy=\"&PP_TaxonomyId&\"&labellanguage=en&period=1\"&IF(PP_Consolidated,\"_Consolidated\",\"\")&CT106","v":"pp://General Data/Name and surname of member of supervisory board 7?taxonomy=DKGAAP&labellanguage=en&period=1_Consolidated&allowhtml=false&merge=false"}]
[{"$f":"\"\"&INDEX(PP_Locale,ROW(),PP_LanguageIndex)","v":"Title of member of supervisory board 7"},null,null,null,null,"PP_TitleOfMemberOfSupervisoryBoard_7",null,null,null,null,"",null,null,null,{"$f":"\"\"&INDEX(PP_Locale,ROW(),PP_LanguageIndex)","v":"Title of member of supervisory board 7"},"Title of member of supervisory board 7",null,null,"Bestyrelsesmedlems titel 7",null,null,null,null,null,null,null,null,null,null,null,null,null,null,null,null,null,null,null,null,null,null,null,null,null,null,null,null,null,null,null,null,null,null,null,null,null,null,null,null,null,null,null,null,null,null,null,null,null,null,null,null,null,null,null,null,null,null,null,null,null,null,null,null,null,null,null,null,null,null,null,null,null,null,null,null,null,null,"&allowhtml=false&merge=false",{"$f":"\"pp://General Data/\"&INDEX(PP_Locale,ROW(),1)&\"?taxonomy=\"&PP_TaxonomyId&\"&labellanguage=en&period=1\"&IF(PP_Consolidated,\"_Consolidated\",\"\")&CT107","v":"pp://General Data/Title of member of supervisory board 7?taxonomy=DKGAAP&labellanguage=en&period=1_Consolidated&allowhtml=false&merge=false"}]
[{"$f":"\"\"&INDEX(PP_Locale,ROW(),PP_LanguageIndex)","v":"Name and surname of member of supervisory board 8"},null,null,null,null,"PP_NameAndSurnameOfMemberOfSupervisoryBoard_8",null,null,null,null,"",null,null,null,{"$f":"\"\"&INDEX(PP_Locale,ROW(),PP_LanguageIndex)","v":"Name and surname of member of supervisory board 8"},"Name and surname of member of supervisory board 8",null,null,"Bestyrelsesmedlems navn 8",null,null,null,null,null,null,null,null,null,null,null,null,null,null,null,null,null,null,null,null,null,null,null,null,null,null,null,null,null,null,null,null,null,null,null,null,null,null,null,null,null,null,null,null,null,null,null,null,null,null,null,null,null,null,null,null,null,null,null,null,null,null,null,null,null,null,null,null,null,null,null,null,null,null,null,null,null,null,"&allowhtml=false&merge=false",{"$f":"\"pp://General Data/\"&INDEX(PP_Locale,ROW(),1)&\"?taxonomy=\"&PP_TaxonomyId&\"&labellanguage=en&period=1\"&IF(PP_Consolidated,\"_Consolidated\",\"\")&CT108","v":"pp://General Data/Name and surname of member of supervisory board 8?taxonomy=DKGAAP&labellanguage=en&period=1_Consolidated&allowhtml=false&merge=false"}]
[{"$f":"\"\"&INDEX(PP_Locale,ROW(),PP_LanguageIndex)","v":"Title of member of supervisory board 8"},null,null,null,null,"PP_TitleOfMemberOfSupervisoryBoard_8",null,null,null,null,"",null,null,null,{"$f":"\"\"&INDEX(PP_Locale,ROW(),PP_LanguageIndex)","v":"Title of member of supervisory board 8"},"Title of member of supervisory board 8",null,null,"Bestyrelsesmedlems titel 8",null,null,null,null,null,null,null,null,null,null,null,null,null,null,null,null,null,null,null,null,null,null,null,null,null,null,null,null,null,null,null,null,null,null,null,null,null,null,null,null,null,null,null,null,null,null,null,null,null,null,null,null,null,null,null,null,null,null,null,null,null,null,null,null,null,null,null,null,null,null,null,null,null,null,null,null,null,null,"&allowhtml=false&merge=false",{"$f":"\"pp://General Data/\"&INDEX(PP_Locale,ROW(),1)&\"?taxonomy=\"&PP_TaxonomyId&\"&labellanguage=en&period=1\"&IF(PP_Consolidated,\"_Consolidated\",\"\")&CT109","v":"pp://General Data/Title of member of supervisory board 8?taxonomy=DKGAAP&labellanguage=en&period=1_Consolidated&allowhtml=false&merge=false"}]
[{"$f":"\"\"&INDEX(PP_Locale,ROW(),PP_LanguageIndex)","v":"Name and surname of member of supervisory board 9"},null,null,null,null,"PP_NameAndSurnameOfMemberOfSupervisoryBoard_9",null,null,null,null,"",null,null,null,{"$f":"\"\"&INDEX(PP_Locale,ROW(),PP_LanguageIndex)","v":"Name and surname of member of supervisory board 9"},"Name and surname of member of supervisory board 9",null,null,"Bestyrelsesmedlems navn 9",null,null,null,null,null,null,null,null,null,null,null,null,null,null,null,null,null,null,null,null,null,null,null,null,null,null,null,null,null,null,null,null,null,null,null,null,null,null,null,null,null,null,null,null,null,null,null,null,null,null,null,null,null,null,null,null,null,null,null,null,null,null,null,null,null,null,null,null,null,null,null,null,null,null,null,null,null,null,"&allowhtml=false&merge=false",{"$f":"\"pp://General Data/\"&INDEX(PP_Locale,ROW(),1)&\"?taxonomy=\"&PP_TaxonomyId&\"&labellanguage=en&period=1\"&IF(PP_Consolidated,\"_Consolidated\",\"\")&CT110","v":"pp://General Data/Name and surname of member of supervisory board 9?taxonomy=DKGAAP&labellanguage=en&period=1_Consolidated&allowhtml=false&merge=false"}]
[{"$f":"\"\"&INDEX(PP_Locale,ROW(),PP_LanguageIndex)","v":"Title of member of supervisory board 9"},null,null,null,null,"PP_TitleOfMemberOfSupervisoryBoard_9",null,null,null,null,"",null,null,null,{"$f":"\"\"&INDEX(PP_Locale,ROW(),PP_LanguageIndex)","v":"Title of member of supervisory board 9"},"Title of member of supervisory board 9",null,null,"Bestyrelsesmedlems titel 9",null,null,null,null,null,null,null,null,null,null,null,null,null,null,null,null,null,null,null,null,null,null,null,null,null,null,null,null,null,null,null,null,null,null,null,null,null,null,null,null,null,null,null,null,null,null,null,null,null,null,null,null,null,null,null,null,null,null,null,null,null,null,null,null,null,null,null,null,null,null,null,null,null,null,null,null,null,null,"&allowhtml=false&merge=false",{"$f":"\"pp://General Data/\"&INDEX(PP_Locale,ROW(),1)&\"?taxonomy=\"&PP_TaxonomyId&\"&labellanguage=en&period=1\"&IF(PP_Consolidated,\"_Consolidated\",\"\")&CT111","v":"pp://General Data/Title of member of supervisory board 9?taxonomy=DKGAAP&labellanguage=en&period=1_Consolidated&allowhtml=false&merge=false"}]
[{"$f":"\"\"&INDEX(PP_Locale,ROW(),PP_LanguageIndex)","v":"Name and surname of member of supervisory board 10"},null,null,null,null,"PP_NameAndSurnameOfMemberOfSupervisoryBoard_10",null,null,null,null,"",null,null,null,{"$f":"\"\"&INDEX(PP_Locale,ROW(),PP_LanguageIndex)","v":"Name and surname of member of supervisory board 10"},"Name and surname of member of supervisory board 10",null,null,"Bestyrelsesmedlems navn 10",null,null,null,null,null,null,null,null,null,null,null,null,null,null,null,null,null,null,null,null,null,null,null,null,null,null,null,null,null,null,null,null,null,null,null,null,null,null,null,null,null,null,null,null,null,null,null,null,null,null,null,null,null,null,null,null,null,null,null,null,null,null,null,null,null,null,null,null,null,null,null,null,null,null,null,null,null,null,"&allowhtml=false&merge=false",{"$f":"\"pp://General Data/\"&INDEX(PP_Locale,ROW(),1)&\"?taxonomy=\"&PP_TaxonomyId&\"&labellanguage=en&period=1\"&IF(PP_Consolidated,\"_Consolidated\",\"\")&CT112","v":"pp://General Data/Name and surname of member of supervisory board 10?taxonomy=DKGAAP&labellanguage=en&period=1_Consolidated&allowhtml=false&merge=false"}]
[{"$f":"\"\"&INDEX(PP_Locale,ROW(),PP_LanguageIndex)","v":"Title of member of supervisory board 10"},null,null,null,null,"PP_TitleOfMemberOfSupervisoryBoard_10",null,null,null,null,"",null,null,null,{"$f":"\"\"&INDEX(PP_Locale,ROW(),PP_LanguageIndex)","v":"Title of member of supervisory board 10"},"Title of member of supervisory board 10",null,null,"Bestyrelsesmedlems titel 10",null,null,null,null,null,null,null,null,null,null,null,null,null,null,null,null,null,null,null,null,null,null,null,null,null,null,null,null,null,null,null,null,null,null,null,null,null,null,null,null,null,null,null,null,null,null,null,null,null,null,null,null,null,null,null,null,null,null,null,null,null,null,null,null,null,null,null,null,null,null,null,null,null,null,null,null,null,null,"&allowhtml=false&merge=false",{"$f":"\"pp://General Data/\"&INDEX(PP_Locale,ROW(),1)&\"?taxonomy=\"&PP_TaxonomyId&\"&labellanguage=en&period=1\"&IF(PP_Consolidated,\"_Consolidated\",\"\")&CT113","v":"pp://General Data/Title of member of supervisory board 10?taxonomy=DKGAAP&labellanguage=en&period=1_Consolidated&allowhtml=false&merge=false"}]
[{"$f":"\"\"&INDEX(PP_Locale,ROW(),PP_LanguageIndex)","v":"Name and surname of member of supervisory board 11"},null,null,null,null,"PP_NameAndSurnameOfMemberOfSupervisoryBoard_11",null,null,null,null,"",null,null,null,{"$f":"\"\"&INDEX(PP_Locale,ROW(),PP_LanguageIndex)","v":"Name and surname of member of supervisory board 11"},"Name and surname of member of supervisory board 11",null,null,"Bestyrelsesmedlems navn 11",null,null,null,null,null,null,null,null,null,null,null,null,null,null,null,null,null,null,null,null,null,null,null,null,null,null,null,null,null,null,null,null,null,null,null,null,null,null,null,null,null,null,null,null,null,null,null,null,null,null,null,null,null,null,null,null,null,null,null,null,null,null,null,null,null,null,null,null,null,null,null,null,null,null,null,null,null,null,"&allowhtml=false&merge=false",{"$f":"\"pp://General Data/\"&INDEX(PP_Locale,ROW(),1)&\"?taxonomy=\"&PP_TaxonomyId&\"&labellanguage=en&period=1\"&IF(PP_Consolidated,\"_Consolidated\",\"\")&CT114","v":"pp://General Data/Name and surname of member of supervisory board 11?taxonomy=DKGAAP&labellanguage=en&period=1_Consolidated&allowhtml=false&merge=false"}]
[{"$f":"\"\"&INDEX(PP_Locale,ROW(),PP_LanguageIndex)","v":"Title of member of supervisory board 11"},null,null,null,null,"PP_TitleOfMemberOfSupervisoryBoard_11",null,null,null,null,"",null,null,null,{"$f":"\"\"&INDEX(PP_Locale,ROW(),PP_LanguageIndex)","v":"Title of member of supervisory board 11"},"Title of member of supervisory board 11",null,null,"Bestyrelsesmedlems titel 11",null,null,null,null,null,null,null,null,null,null,null,null,null,null,null,null,null,null,null,null,null,null,null,null,null,null,null,null,null,null,null,null,null,null,null,null,null,null,null,null,null,null,null,null,null,null,null,null,null,null,null,null,null,null,null,null,null,null,null,null,null,null,null,null,null,null,null,null,null,null,null,null,null,null,null,null,null,null,"&allowhtml=false&merge=false",{"$f":"\"pp://General Data/\"&INDEX(PP_Locale,ROW(),1)&\"?taxonomy=\"&PP_TaxonomyId&\"&labellanguage=en&period=1\"&IF(PP_Consolidated,\"_Consolidated\",\"\")&CT115","v":"pp://General Data/Title of member of supervisory board 11?taxonomy=DKGAAP&labellanguage=en&period=1_Consolidated&allowhtml=false&merge=false"}]
[{"$f":"\"\"&INDEX(PP_Locale,ROW(),PP_LanguageIndex)","v":"Name and surname of member of supervisory board 12"},null,null,null,null,"PP_NameAndSurnameOfMemberOfSupervisoryBoard_12",null,null,null,null,"",null,null,null,{"$f":"\"\"&INDEX(PP_Locale,ROW(),PP_LanguageIndex)","v":"Name and surname of member of supervisory board 12"},"Name and surname of member of supervisory board 12",null,null,"Bestyrelsesmedlems navn 12",null,null,null,null,null,null,null,null,null,null,null,null,null,null,null,null,null,null,null,null,null,null,null,null,null,null,null,null,null,null,null,null,null,null,null,null,null,null,null,null,null,null,null,null,null,null,null,null,null,null,null,null,null,null,null,null,null,null,null,null,null,null,null,null,null,null,null,null,null,null,null,null,null,null,null,null,null,null,"&allowhtml=false&merge=false",{"$f":"\"pp://General Data/\"&INDEX(PP_Locale,ROW(),1)&\"?taxonomy=\"&PP_TaxonomyId&\"&labellanguage=en&period=1\"&IF(PP_Consolidated,\"_Consolidated\",\"\")&CT116","v":"pp://General Data/Name and surname of member of supervisory board 12?taxonomy=DKGAAP&labellanguage=en&period=1_Consolidated&allowhtml=false&merge=false"}]
[{"$f":"\"\"&INDEX(PP_Locale,ROW(),PP_LanguageIndex)","v":"Title of member of supervisory board 12"},null,null,null,null,"PP_TitleOfMemberOfSupervisoryBoard_12",null,null,null,null,"",null,null,null,{"$f":"\"\"&INDEX(PP_Locale,ROW(),PP_LanguageIndex)","v":"Title of member of supervisory board 12"},"Title of member of supervisory board 12",null,null,"Bestyrelsesmedlems titel 12",null,null,null,null,null,null,null,null,null,null,null,null,null,null,null,null,null,null,null,null,null,null,null,null,null,null,null,null,null,null,null,null,null,null,null,null,null,null,null,null,null,null,null,null,null,null,null,null,null,null,null,null,null,null,null,null,null,null,null,null,null,null,null,null,null,null,null,null,null,null,null,null,null,null,null,null,null,null,"&allowhtml=false&merge=false",{"$f":"\"pp://General Data/\"&INDEX(PP_Locale,ROW(),1)&\"?taxonomy=\"&PP_TaxonomyId&\"&labellanguage=en&period=1\"&IF(PP_Consolidated,\"_Consolidated\",\"\")&CT117","v":"pp://General Data/Title of member of supervisory board 12?taxonomy=DKGAAP&labellanguage=en&period=1_Consolidated&allowhtml=false&merge=false"}]
[{"$f":"\"\"&INDEX(PP_Locale,ROW(),PP_LanguageIndex)","v":"Name and surname of member of supervisory board 13"},null,null,null,null,"PP_NameAndSurnameOfMemberOfSupervisoryBoard_13",null,null,null,null,"",null,null,null,{"$f":"\"\"&INDEX(PP_Locale,ROW(),PP_LanguageIndex)","v":"Name and surname of member of supervisory board 13"},"Name and surname of member of supervisory board 13",null,null,"Bestyrelsesmedlems navn 13",null,null,null,null,null,null,null,null,null,null,null,null,null,null,null,null,null,null,null,null,null,null,null,null,null,null,null,null,null,null,null,null,null,null,null,null,null,null,null,null,null,null,null,null,null,null,null,null,null,null,null,null,null,null,null,null,null,null,null,null,null,null,null,null,null,null,null,null,null,null,null,null,null,null,null,null,null,null,"&allowhtml=false&merge=false",{"$f":"\"pp://General Data/\"&INDEX(PP_Locale,ROW(),1)&\"?taxonomy=\"&PP_TaxonomyId&\"&labellanguage=en&period=1\"&IF(PP_Consolidated,\"_Consolidated\",\"\")&CT118","v":"pp://General Data/Name and surname of member of supervisory board 13?taxonomy=DKGAAP&labellanguage=en&period=1_Consolidated&allowhtml=false&merge=false"}]
[{"$f":"\"\"&INDEX(PP_Locale,ROW(),PP_LanguageIndex)","v":"Title of member of supervisory board 13"},null,null,null,null,"PP_TitleOfMemberOfSupervisoryBoard_13",null,null,null,null,"",null,null,null,{"$f":"\"\"&INDEX(PP_Locale,ROW(),PP_LanguageIndex)","v":"Title of member of supervisory board 13"},"Title of member of supervisory board 13",null,null,"Bestyrelsesmedlems titel 13",null,null,null,null,null,null,null,null,null,null,null,null,null,null,null,null,null,null,null,null,null,null,null,null,null,null,null,null,null,null,null,null,null,null,null,null,null,null,null,null,null,null,null,null,null,null,null,null,null,null,null,null,null,null,null,null,null,null,null,null,null,null,null,null,null,null,null,null,null,null,null,null,null,null,null,null,null,null,"&allowhtml=false&merge=false",{"$f":"\"pp://General Data/\"&INDEX(PP_Locale,ROW(),1)&\"?taxonomy=\"&PP_TaxonomyId&\"&labellanguage=en&period=1\"&IF(PP_Consolidated,\"_Consolidated\",\"\")&CT119","v":"pp://General Data/Title of member of supervisory board 13?taxonomy=DKGAAP&labellanguage=en&period=1_Consolidated&allowhtml=false&merge=false"}]
[{"$f":"\"\"&INDEX(PP_Locale,ROW(),PP_LanguageIndex)","v":"Name and surname of member of supervisory board 14"},null,null,null,null,"PP_NameAndSurnameOfMemberOfSupervisoryBoard_14",null,null,null,null,"",null,null,null,{"$f":"\"\"&INDEX(PP_Locale,ROW(),PP_LanguageIndex)","v":"Name and surname of member of supervisory board 14"},"Name and surname of member of supervisory board 14",null,null,"Bestyrelsesmedlems navn 14",null,null,null,null,null,null,null,null,null,null,null,null,null,null,null,null,null,null,null,null,null,null,null,null,null,null,null,null,null,null,null,null,null,null,null,null,null,null,null,null,null,null,null,null,null,null,null,null,null,null,null,null,null,null,null,null,null,null,null,null,null,null,null,null,null,null,null,null,null,null,null,null,null,null,null,null,null,null,"&allowhtml=false&merge=false",{"$f":"\"pp://General Data/\"&INDEX(PP_Locale,ROW(),1)&\"?taxonomy=\"&PP_TaxonomyId&\"&labellanguage=en&period=1\"&IF(PP_Consolidated,\"_Consolidated\",\"\")&CT120","v":"pp://General Data/Name and surname of member of supervisory board 14?taxonomy=DKGAAP&labellanguage=en&period=1_Consolidated&allowhtml=false&merge=false"}]
[{"$f":"\"\"&INDEX(PP_Locale,ROW(),PP_LanguageIndex)","v":"Title of member of supervisory board 14"},null,null,null,null,"PP_TitleOfMemberOfSupervisoryBoard_14",null,null,null,null,"",null,null,null,{"$f":"\"\"&INDEX(PP_Locale,ROW(),PP_LanguageIndex)","v":"Title of member of supervisory board 14"},"Title of member of supervisory board 14",null,null,"Bestyrelsesmedlems titel 14",null,null,null,null,null,null,null,null,null,null,null,null,null,null,null,null,null,null,null,null,null,null,null,null,null,null,null,null,null,null,null,null,null,null,null,null,null,null,null,null,null,null,null,null,null,null,null,null,null,null,null,null,null,null,null,null,null,null,null,null,null,null,null,null,null,null,null,null,null,null,null,null,null,null,null,null,null,null,"&allowhtml=false&merge=false",{"$f":"\"pp://General Data/\"&INDEX(PP_Locale,ROW(),1)&\"?taxonomy=\"&PP_TaxonomyId&\"&labellanguage=en&period=1\"&IF(PP_Consolidated,\"_Consolidated\",\"\")&CT121","v":"pp://General Data/Title of member of supervisory board 14?taxonomy=DKGAAP&labellanguage=en&period=1_Consolidated&allowhtml=false&merge=false"}]
[{"$f":"\"\"&INDEX(PP_Locale,ROW(),PP_LanguageIndex)","v":"Name and surname of member of supervisory board 15"},null,null,null,null,"PP_NameAndSurnameOfMemberOfSupervisoryBoard_15",null,null,null,null,"",null,null,null,{"$f":"\"\"&INDEX(PP_Locale,ROW(),PP_LanguageIndex)","v":"Name and surname of member of supervisory board 15"},"Name and surname of member of supervisory board 15",null,null,"Bestyrelsesmedlems navn 15",null,null,null,null,null,null,null,null,null,null,null,null,null,null,null,null,null,null,null,null,null,null,null,null,null,null,null,null,null,null,null,null,null,null,null,null,null,null,null,null,null,null,null,null,null,null,null,null,null,null,null,null,null,null,null,null,null,null,null,null,null,null,null,null,null,null,null,null,null,null,null,null,null,null,null,null,null,null,"&allowhtml=false&merge=false",{"$f":"\"pp://General Data/\"&INDEX(PP_Locale,ROW(),1)&\"?taxonomy=\"&PP_TaxonomyId&\"&labellanguage=en&period=1\"&IF(PP_Consolidated,\"_Consolidated\",\"\")&CT122","v":"pp://General Data/Name and surname of member of supervisory board 15?taxonomy=DKGAAP&labellanguage=en&period=1_Consolidated&allowhtml=false&merge=false"}]
[{"$f":"\"\"&INDEX(PP_Locale,ROW(),PP_LanguageIndex)","v":"Title of member of supervisory board 15"},null,null,null,null,"PP_TitleOfMemberOfSupervisoryBoard_15",null,null,null,null,"",null,null,null,{"$f":"\"\"&INDEX(PP_Locale,ROW(),PP_LanguageIndex)","v":"Title of member of supervisory board 15"},"Title of member of supervisory board 15",null,null,"Bestyrelsesmedlems titel 15",null,null,null,null,null,null,null,null,null,null,null,null,null,null,null,null,null,null,null,null,null,null,null,null,null,null,null,null,null,null,null,null,null,null,null,null,null,null,null,null,null,null,null,null,null,null,null,null,null,null,null,null,null,null,null,null,null,null,null,null,null,null,null,null,null,null,null,null,null,null,null,null,null,null,null,null,null,null,"&allowhtml=false&merge=false",{"$f":"\"pp://General Data/\"&INDEX(PP_Locale,ROW(),1)&\"?taxonomy=\"&PP_TaxonomyId&\"&labellanguage=en&period=1\"&IF(PP_Consolidated,\"_Consolidated\",\"\")&CT123","v":"pp://General Data/Title of member of supervisory board 15?taxonomy=DKGAAP&labellanguage=en&period=1_Consolidated&allowhtml=false&merge=false"}]
[{"$f":"\"\"&INDEX(PP_Locale,ROW(),PP_LanguageIndex)","v":"Name and surname of member of supervisory board 16"},null,null,null,null,"PP_NameAndSurnameOfMemberOfSupervisoryBoard_16",null,null,null,null,"",null,null,null,{"$f":"\"\"&INDEX(PP_Locale,ROW(),PP_LanguageIndex)","v":"Name and surname of member of supervisory board 16"},"Name and surname of member of supervisory board 16",null,null,"Bestyrelsesmedlems navn 16",null,null,null,null,null,null,null,null,null,null,null,null,null,null,null,null,null,null,null,null,null,null,null,null,null,null,null,null,null,null,null,null,null,null,null,null,null,null,null,null,null,null,null,null,null,null,null,null,null,null,null,null,null,null,null,null,null,null,null,null,null,null,null,null,null,null,null,null,null,null,null,null,null,null,null,null,null,null,"&allowhtml=false&merge=false",{"$f":"\"pp://General Data/\"&INDEX(PP_Locale,ROW(),1)&\"?taxonomy=\"&PP_TaxonomyId&\"&labellanguage=en&period=1\"&IF(PP_Consolidated,\"_Consolidated\",\"\")&CT124","v":"pp://General Data/Name and surname of member of supervisory board 16?taxonomy=DKGAAP&labellanguage=en&period=1_Consolidated&allowhtml=false&merge=false"}]
[{"$f":"\"\"&INDEX(PP_Locale,ROW(),PP_LanguageIndex)","v":"Title of member of supervisory board 16"},null,null,null,null,"PP_TitleOfMemberOfSupervisoryBoard_16",null,null,null,null,"",null,null,null,{"$f":"\"\"&INDEX(PP_Locale,ROW(),PP_LanguageIndex)","v":"Title of member of supervisory board 16"},"Title of member of supervisory board 16",null,null,"Bestyrelsesmedlems titel 16",null,null,null,null,null,null,null,null,null,null,null,null,null,null,null,null,null,null,null,null,null,null,null,null,null,null,null,null,null,null,null,null,null,null,null,null,null,null,null,null,null,null,null,null,null,null,null,null,null,null,null,null,null,null,null,null,null,null,null,null,null,null,null,null,null,null,null,null,null,null,null,null,null,null,null,null,null,null,"&allowhtml=false&merge=false",{"$f":"\"pp://General Data/\"&INDEX(PP_Locale,ROW(),1)&\"?taxonomy=\"&PP_TaxonomyId&\"&labellanguage=en&period=1\"&IF(PP_Consolidated,\"_Consolidated\",\"\")&CT125","v":"pp://General Data/Title of member of supervisory board 16?taxonomy=DKGAAP&labellanguage=en&period=1_Consolidated&allowhtml=false&merge=false"}]
[{"$f":"\"\"&INDEX(PP_Locale,ROW(),PP_LanguageIndex)","v":"Name and surname of member of supervisory board 17"},null,null,null,null,"PP_NameAndSurnameOfMemberOfSupervisoryBoard_17",null,null,null,null,"",null,null,null,{"$f":"\"\"&INDEX(PP_Locale,ROW(),PP_LanguageIndex)","v":"Name and surname of member of supervisory board 17"},"Name and surname of member of supervisory board 17",null,null,"Bestyrelsesmedlems navn 17",null,null,null,null,null,null,null,null,null,null,null,null,null,null,null,null,null,null,null,null,null,null,null,null,null,null,null,null,null,null,null,null,null,null,null,null,null,null,null,null,null,null,null,null,null,null,null,null,null,null,null,null,null,null,null,null,null,null,null,null,null,null,null,null,null,null,null,null,null,null,null,null,null,null,null,null,null,null,"&allowhtml=false&merge=false",{"$f":"\"pp://General Data/\"&INDEX(PP_Locale,ROW(),1)&\"?taxonomy=\"&PP_TaxonomyId&\"&labellanguage=en&period=1\"&IF(PP_Consolidated,\"_Consolidated\",\"\")&CT126","v":"pp://General Data/Name and surname of member of supervisory board 17?taxonomy=DKGAAP&labellanguage=en&period=1_Consolidated&allowhtml=false&merge=false"}]
[{"$f":"\"\"&INDEX(PP_Locale,ROW(),PP_LanguageIndex)","v":"Title of member of supervisory board 17"},null,null,null,null,"PP_TitleOfMemberOfSupervisoryBoard_17",null,null,null,null,"",null,null,null,{"$f":"\"\"&INDEX(PP_Locale,ROW(),PP_LanguageIndex)","v":"Title of member of supervisory board 17"},"Title of member of supervisory board 17",null,null,"Bestyrelsesmedlems titel 17",null,null,null,null,null,null,null,null,null,null,null,null,null,null,null,null,null,null,null,null,null,null,null,null,null,null,null,null,null,null,null,null,null,null,null,null,null,null,null,null,null,null,null,null,null,null,null,null,null,null,null,null,null,null,null,null,null,null,null,null,null,null,null,null,null,null,null,null,null,null,null,null,null,null,null,null,null,null,"&allowhtml=false&merge=false",{"$f":"\"pp://General Data/\"&INDEX(PP_Locale,ROW(),1)&\"?taxonomy=\"&PP_TaxonomyId&\"&labellanguage=en&period=1\"&IF(PP_Consolidated,\"_Consolidated\",\"\")&CT127","v":"pp://General Data/Title of member of supervisory board 17?taxonomy=DKGAAP&labellanguage=en&period=1_Consolidated&allowhtml=false&merge=false"}]
[{"$f":"\"\"&INDEX(PP_Locale,ROW(),PP_LanguageIndex)","v":"Name and surname of member of supervisory board 18"},null,null,null,null,"PP_NameAndSurnameOfMemberOfSupervisoryBoard_18",null,null,null,null,"",null,null,null,{"$f":"\"\"&INDEX(PP_Locale,ROW(),PP_LanguageIndex)","v":"Name and surname of member of supervisory board 18"},"Name and surname of member of supervisory board 18",null,null,"Bestyrelsesmedlems navn 18",null,null,null,null,null,null,null,null,null,null,null,null,null,null,null,null,null,null,null,null,null,null,null,null,null,null,null,null,null,null,null,null,null,null,null,null,null,null,null,null,null,null,null,null,null,null,null,null,null,null,null,null,null,null,null,null,null,null,null,null,null,null,null,null,null,null,null,null,null,null,null,null,null,null,null,null,null,null,"&allowhtml=false&merge=false",{"$f":"\"pp://General Data/\"&INDEX(PP_Locale,ROW(),1)&\"?taxonomy=\"&PP_TaxonomyId&\"&labellanguage=en&period=1\"&IF(PP_Consolidated,\"_Consolidated\",\"\")&CT128","v":"pp://General Data/Name and surname of member of supervisory board 18?taxonomy=DKGAAP&labellanguage=en&period=1_Consolidated&allowhtml=false&merge=false"}]
[{"$f":"\"\"&INDEX(PP_Locale,ROW(),PP_LanguageIndex)","v":"Title of member of supervisory board 18"},null,null,null,null,"PP_TitleOfMemberOfSupervisoryBoard_18",null,null,null,null,"",null,null,null,{"$f":"\"\"&INDEX(PP_Locale,ROW(),PP_LanguageIndex)","v":"Title of member of supervisory board 18"},"Title of member of supervisory board 18",null,null,"Bestyrelsesmedlems titel 18",null,null,null,null,null,null,null,null,null,null,null,null,null,null,null,null,null,null,null,null,null,null,null,null,null,null,null,null,null,null,null,null,null,null,null,null,null,null,null,null,null,null,null,null,null,null,null,null,null,null,null,null,null,null,null,null,null,null,null,null,null,null,null,null,null,null,null,null,null,null,null,null,null,null,null,null,null,null,"&allowhtml=false&merge=false",{"$f":"\"pp://General Data/\"&INDEX(PP_Locale,ROW(),1)&\"?taxonomy=\"&PP_TaxonomyId&\"&labellanguage=en&period=1\"&IF(PP_Consolidated,\"_Consolidated\",\"\")&CT129","v":"pp://General Data/Title of member of supervisory board 18?taxonomy=DKGAAP&labellanguage=en&period=1_Consolidated&allowhtml=false&merge=false"}]
[{"$f":"\"\"&INDEX(PP_Locale,ROW(),PP_LanguageIndex)","v":"Name and surname of member of supervisory board 19"},null,null,null,null,"PP_NameAndSurnameOfMemberOfSupervisoryBoard_19",null,null,null,null,"",null,null,null,{"$f":"\"\"&INDEX(PP_Locale,ROW(),PP_LanguageIndex)","v":"Name and surname of member of supervisory board 19"},"Name and surname of member of supervisory board 19",null,null,"Bestyrelsesmedlems navn 19",null,null,null,null,null,null,null,null,null,null,null,null,null,null,null,null,null,null,null,null,null,null,null,null,null,null,null,null,null,null,null,null,null,null,null,null,null,null,null,null,null,null,null,null,null,null,null,null,null,null,null,null,null,null,null,null,null,null,null,null,null,null,null,null,null,null,null,null,null,null,null,null,null,null,null,null,null,null,"&allowhtml=false&merge=false",{"$f":"\"pp://General Data/\"&INDEX(PP_Locale,ROW(),1)&\"?taxonomy=\"&PP_TaxonomyId&\"&labellanguage=en&period=1\"&IF(PP_Consolidated,\"_Consolidated\",\"\")&CT130","v":"pp://General Data/Name and surname of member of supervisory board 19?taxonomy=DKGAAP&labellanguage=en&period=1_Consolidated&allowhtml=false&merge=false"}]
[{"$f":"\"\"&INDEX(PP_Locale,ROW(),PP_LanguageIndex)","v":"Title of member of supervisory board 19"},null,null,null,null,"PP_TitleOfMemberOfSupervisoryBoard_19",null,null,null,null,"",null,null,null,{"$f":"\"\"&INDEX(PP_Locale,ROW(),PP_LanguageIndex)","v":"Title of member of supervisory board 19"},"Title of member of supervisory board 19",null,null,"Bestyrelsesmedlems titel 19",null,null,null,null,null,null,null,null,null,null,null,null,null,null,null,null,null,null,null,null,null,null,null,null,null,null,null,null,null,null,null,null,null,null,null,null,null,null,null,null,null,null,null,null,null,null,null,null,null,null,null,null,null,null,null,null,null,null,null,null,null,null,null,null,null,null,null,null,null,null,null,null,null,null,null,null,null,null,"&allowhtml=false&merge=false",{"$f":"\"pp://General Data/\"&INDEX(PP_Locale,ROW(),1)&\"?taxonomy=\"&PP_TaxonomyId&\"&labellanguage=en&period=1\"&IF(PP_Consolidated,\"_Consolidated\",\"\")&CT131","v":"pp://General Data/Title of member of supervisory board 19?taxonomy=DKGAAP&labellanguage=en&period=1_Consolidated&allowhtml=false&merge=false"}]
[{"$f":"\"\"&INDEX(PP_Locale,ROW(),PP_LanguageIndex)","v":"Name and surname of member of supervisory board 20"},null,null,null,null,"PP_NameAndSurnameOfMemberOfSupervisoryBoard_20",null,null,null,null,"",null,null,null,{"$f":"\"\"&INDEX(PP_Locale,ROW(),PP_LanguageIndex)","v":"Name and surname of member of supervisory board 20"},"Name and surname of member of supervisory board 20",null,null,"Bestyrelsesmedlems navn 20",null,null,null,null,null,null,null,null,null,null,null,null,null,null,null,null,null,null,null,null,null,null,null,null,null,null,null,null,null,null,null,null,null,null,null,null,null,null,null,null,null,null,null,null,null,null,null,null,null,null,null,null,null,null,null,null,null,null,null,null,null,null,null,null,null,null,null,null,null,null,null,null,null,null,null,null,null,null,"&allowhtml=false&merge=false",{"$f":"\"pp://General Data/\"&INDEX(PP_Locale,ROW(),1)&\"?taxonomy=\"&PP_TaxonomyId&\"&labellanguage=en&period=1\"&IF(PP_Consolidated,\"_Consolidated\",\"\")&CT132","v":"pp://General Data/Name and surname of member of supervisory board 20?taxonomy=DKGAAP&labellanguage=en&period=1_Consolidated&allowhtml=false&merge=false"}]
[{"$f":"\"\"&INDEX(PP_Locale,ROW(),PP_LanguageIndex)","v":"Title of member of supervisory board 20"},null,null,null,null,"PP_TitleOfMemberOfSupervisoryBoard_20",null,null,null,null,"",null,null,null,{"$f":"\"\"&INDEX(PP_Locale,ROW(),PP_LanguageIndex)","v":"Title of member of supervisory board 20"},"Title of member of supervisory board 20",null,null,"Bestyrelsesmedlems titel 20",null,null,null,null,null,null,null,null,null,null,null,null,null,null,null,null,null,null,null,null,null,null,null,null,null,null,null,null,null,null,null,null,null,null,null,null,null,null,null,null,null,null,null,null,null,null,null,null,null,null,null,null,null,null,null,null,null,null,null,null,null,null,null,null,null,null,null,null,null,null,null,null,null,null,null,null,null,null,"&allowhtml=false&merge=false",{"$f":"\"pp://General Data/\"&INDEX(PP_Locale,ROW(),1)&\"?taxonomy=\"&PP_TaxonomyId&\"&labellanguage=en&period=1\"&IF(PP_Consolidated,\"_Consolidated\",\"\")&CT133","v":"pp://General Data/Title of member of supervisory board 20?taxonomy=DKGAAP&labellanguage=en&period=1_Consolidated&allowhtml=false&merge=false"}]
[null,null,null,null,null,null,null,null,null,null,null,null,null,null,{"$f":"\"\"&INDEX(PP_Locale,ROW(),PP_LanguageIndex)","v":""}]
[{"$f":"\"\"&INDEX(PP_Locale,ROW(),PP_LanguageIndex)","v":"Submitting enterprise:"},null,null,null,null,null,null,null,null,null,null,null,null,null,{"$f":"\"\"&INDEX(PP_Locale,ROW(),PP_LanguageIndex)","v":"Submitting enterprise:"},"Submitting enterprise:",null,null,"Indsender:"]
[{"$f":"\"\"&INDEX(PP_Locale,ROW(),PP_LanguageIndex)","v":"Legal Entity Identifier [LEI] of submitting enterprise"},{"$f":"\"\"&PP_LegalEntityIdentifierOfReportingEntity","v":"12345NOTVALID1234503"},null,null,null,"PP_LegalEntityIdentifierOfSubmittingEnterprise",{"$f":"\"\"&PP_LegalEntityIdentifierOfReportingEntity","v":"12345NOTVALID1234503"},null,null,null,{"$f":"\"\"&B136","v":"12345NOTVALID1234503"},null,null,null,{"$f":"\"\"&INDEX(PP_Locale,ROW(),PP_LanguageIndex)","v":"Legal Entity Identifier [LEI] of submitting enterprise"},"Legal Entity Identifier [LEI] of submitting enterprise",null,null,"Indsendende virksomheds LEI-kode"]
[{"$f":"\"\"&INDEX(PP_Locale,ROW(),PP_LanguageIndex)","v":"Identification number [CVR] of submitting enterprise"},{"$f":"\"\"&PP_IdentificationNumberCvrOfReportingEntity","v":"12345678"},null,null,null,"PP_IdentificationNumberCvrOfSubmittingEnterprise",{"$f":"\"\"&PP_IdentificationNumberCvrOfReportingEntity","v":"12345678"},null,null,null,{"$f":"\"\"&SUBSTITUTE(B137,\" \",\"\")","v":"12345678"},null,null,null,{"$f":"\"\"&INDEX(PP_Locale,ROW(),PP_LanguageIndex)","v":"Identification number [CVR] of submitting enterprise"},"Identification number [CVR] of submitting enterprise",null,null,"Indsendende virksomheds CVR-nr."]
[{"$f":"\"\"&INDEX(PP_Locale,ROW(),PP_LanguageIndex)","v":"Name of submitting enterprise"},{"$f":"\"\"&PP_NameOfReportingEntity","v":"Test customer"},null,null,null,"PP_NameOfSubmittingEnterprise",{"$f":"\"\"&PP_NameOfReportingEntity","v":"Test customer"},null,null,null,{"$f":"\"\"&B138","v":"Test customer"},null,null,null,{"$f":"\"\"&INDEX(PP_Locale,ROW(),PP_LanguageIndex)","v":"Name of submitting enterprise"},"Name of submitting enterprise",null,null,"Indsendende virksomheds navn"]
[{"$f":"\"\"&INDEX(PP_Locale,ROW(),PP_LanguageIndex)","v":"Address of submitting enterprise, street and number"},{"$f":"\"\"&PP_AddressOfReportingEntityStreetName&\" \"&PP_AddressOfReportingEntityStreetBuildingIdentifier","v":"UNKNOWN UNKNOWN"},null,null,null,"PP_AddressOfSubmittingEnterpriseStreetAndNumber",{"$f":"\"\"&PP_AddressOfReportingEntityStreetName&\" \"&PP_AddressOfReportingEntityStreetBuildingIdentifier","v":"UNKNOWN UNKNOWN"},null,null,null,{"$f":"\"\"&B139","v":"UNKNOWN UNKNOWN"},null,null,null,{"$f":"\"\"&INDEX(PP_Locale,ROW(),PP_LanguageIndex)","v":"Address of submitting enterprise, street and number"},"Address of submitting enterprise, street and number",null,null,"Indsendende virksomheds adresse, vej og nummer"]
[{"$f":"\"\"&INDEX(PP_Locale,ROW(),PP_LanguageIndex)","v":"Address of submitting enterprise, postcode and town"},{"$f":"\"\"&PP_AddressOfReportingEntityPostCodeIdentifier&\" \"&PP_AddressOfReportingEntityDistrictName","v":"UNKNOWN UNKNOWN"},null,null,null,"PP_AddressOfSubmittingEnterprisePostcodeAndTown",{"$f":"\"\"&PP_AddressOfReportingEntityPostCodeIdentifier&\" \"&PP_AddressOfReportingEntityDistrictName","v":"UNKNOWN UNKNOWN"},null,null,null,{"$f":"\"\"&B140","v":"UNKNOWN UNKNOWN"},null,null,null,{"$f":"\"\"&INDEX(PP_Locale,ROW(),PP_LanguageIndex)","v":"Address of submitting enterprise, postcode and town"},"Address of submitting enterprise, postcode and town",null,null,"Indsendende virksomheds adresse, postnummer og by"]
[null,null,null,null,null,null,null,null,null,null,null,null,null,null,{"$f":"\"\"&INDEX(PP_Locale,ROW(),PP_LanguageIndex)","v":""}]
[{"$f":"IF(A143=\"\",\"\",\"\"&INDEX(PP_Locale,ROW(),PP_LanguageIndex))","v":"Opinion:"},null,null,null,null,null,null,null,null,null,null,null,null,null,{"$f":"\"\"&INDEX(PP_Locale,ROW(),PP_LanguageIndex)","v":"Opinion:"},"Opinion:",null,null,"Konklusion:"]
[{"$f":"IFERROR(INDEX(P$280:S$282,MATCH(PP_TypeOfAuditorAssistance,INDEX(P$254:S$259,,PP_LanguageIndex),0),PP_LanguageIndex),\"\")","v":"Type of opinion on audited financial statements (Audit)"},{"$f":"IFERROR(VLOOKUP(\"Opinion\",PP_Locale,PP_LanguageIndex,FALSE),\"Opinion\")","v":"Opinion"},{"$f":"IFERROR(VLOOKUP(\"Opinion\",PP_Locale,PP_LanguageIndex,FALSE),\"Opinion\")","v":"Opinion"},{"$f":"IFERROR(VLOOKUP(\"Opinion\",PP_Locale,PP_LanguageIndex,FALSE),\"Opinion\")","v":"Opinion"},{"$f":"IFERROR(VLOOKUP(\"Opinion\",PP_Locale,PP_LanguageIndex,FALSE),\"Opinion\")","v":"Opinion"},"PP_TypeOfModifiedOpinion",{"$f":"IFERROR(VLOOKUP(\"Opinion\",PP_Locale,PP_LanguageIndex,FALSE),\"Opinion\")","v":"Opinion"},null,null,null,{"$f":"\"\"&B143","v":"Opinion"},null,null,null,{"$f":"\"\"&INDEX(PP_Locale,ROW(),PP_LanguageIndex)","v":""},{"$f":"IFERROR(INDEX(P$280:S$282,MATCH(\"Michael\",INDEX(P$254:S$259,,PP_LanguageIndex),0),PP_LanguageIndex),\"\")","v":""},null,null,null,null,null,null,null,null,null,null,null,null,null,null,null,null,null,null,null,null,null,null,null,null,null,null,null,null,null,null,null,null,null,null,null,null,null,null,null,null,null,null,null,null,null,null,null,null,null,null,null,null,null,null,null,null,null,null,{"$f":"IFERROR(VLOOKUP(\"Opinion\",PP_Locale,PP_LanguageIndex,FALSE),\"Opinion\")","v":"Opinion"},{"$f":"IFERROR(VLOOKUP(\"Qualified Opinion\",PP_Locale,PP_LanguageIndex,FALSE),\"Qualified Opinion\")","v":"Qualified Opinion"},{"$f":"IFERROR(VLOOKUP(\"Adverse Opinion\",PP_Locale,PP_LanguageIndex,FALSE),\"Adverse Opinion\")","v":"Adverse Opinion"},{"$f":"IFERROR(VLOOKUP(\"Disclaimer of Opinion\",PP_Locale,PP_LanguageIndex,FALSE),\"Disclaimer of Opinion\")","v":"Disclaimer of Opinion"}]
[{"$f":"IFERROR(INDEX(P$277:S$279,MATCH(PP_TypeOfAuditorAssistance,INDEX(P$254:S$259,,PP_LanguageIndex),0),PP_LanguageIndex),\"\")","v":"Type of basis for opinion on audited financial statements (audit)"},{"$f":"IFERROR(VLOOKUP(\"Basis for Opinion\",PP_Locale,PP_LanguageIndex,FALSE),\"Basis for Opinion\")","v":"Basis for Opinion"},{"$f":"IFERROR(VLOOKUP(\"Opinion\",PP_Locale,PP_LanguageIndex,FALSE),\"Opinion\")","v":"Opinion"},{"$f":"IFERROR(VLOOKUP(\"Opinion\",PP_Locale,PP_LanguageIndex,FALSE),\"Opinion\")","v":"Opinion"},{"$f":"IFERROR(VLOOKUP(\"Opinion\",PP_Locale,PP_LanguageIndex,FALSE),\"Opinion\")","v":"Opinion"},"PP_TypeOfBasisForModifiedOpinion",{"$f":"IFERROR(VLOOKUP(\"Basis for Opinion\",PP_Locale,PP_LanguageIndex,FALSE),\"Basis for Opinion\")","v":"Basis for Opinion"},null,null,null,{"$f":"\"\"&B144","v":"Basis for Opinion"},null,null,null,{"$f":"\"\"&INDEX(PP_Locale,ROW(),PP_LanguageIndex)","v":""},null,null,null,null,null,null,null,null,null,null,null,null,null,null,null,null,null,null,null,null,null,null,null,null,null,null,null,null,null,null,null,null,null,null,null,null,null,null,null,null,null,null,null,null,null,null,null,null,null,null,null,null,null,null,null,null,null,null,null,{"$f":"IFERROR(VLOOKUP(\"Basis for Opinion\",PP_Locale,PP_LanguageIndex,FALSE),\"Basis for Opinion\")","v":"Basis for Opinion"},{"$f":"IFERROR(VLOOKUP(\"Basis for Qualified Opinion\",PP_Locale,PP_LanguageIndex,FALSE),\"Basis for Qualified Opinion\")","v":"Basis for Qualified Opinion"},{"$f":"IFERROR(VLOOKUP(\"Basis for Adverse Opinion\",PP_Locale,PP_LanguageIndex,FALSE),\"Basis for Adverse Opinion\")","v":"Basis for Adverse Opinion"},{"$f":"IFERROR(VLOOKUP(\"Basis for Disclaimer of Opinion\",PP_Locale,PP_LanguageIndex,FALSE),\"Basis for Disclaimer of Opinion\")","v":"Basis for Disclaimer of Opinion"}]
[null,null,null,null,null,null,null,null,null,null,null,null,null,null,{"$f":"\"\"&INDEX(PP_Locale,ROW(),PP_LanguageIndex)","v":""}]
[{"$f":"IF(A147=\"\",\"\",\"\"&INDEX(PP_Locale,ROW(),PP_LanguageIndex))","v":"Reporting responsibilities according to the Danish executive order on approved auditors' reports:"},null,null,null,null,null,null,null,null,null,null,null,null,null,{"$f":"\"\"&INDEX(PP_Locale,ROW(),PP_LanguageIndex)","v":"Reporting responsibilities according to the Danish executive order on approved auditors' reports:"},"Reporting responsibilities according to the Danish executive order on approved auditors' reports:",null,null,"Erklæringsforpligtelser i henhold til erklæringsbekendtgørelsen:"]
[{"$f":"IFERROR(INDEX(P$283:S$284,MATCH(PP_TypeOfAuditorAssistance,INDEX(P$254:S$259,,PP_LanguageIndex),0),PP_LanguageIndex),\"\")","v":"Reporting responsibilities according to the Danish executive order on approved auditors' reports especially the criminal code and Fiscal-, tax- and subsidy legislation (Audit)"},null,null,null,null,"PP_ReportingResponsibilitiesAccordingToTheDanishExecutiveOrderOnApprovedAuditorsReportsEspeciallyTheCriminalCodeAndFiscalTaxAndSubsidyLegislation",null,null,null,null,{"$f":"IF(B147=Yes,\"true\",IF(B147=No,\"false\",\"\"))","v":""},null,null,null,{"$f":"\"\"&INDEX(PP_Locale,ROW(),PP_LanguageIndex)","v":""},null,null,null,null,null,null,null,null,null,null,null,null,null,null,null,null,null,null,null,null,null,null,null,null,null,null,null,null,null,null,null,null,null,null,null,null,null,null,null,null,null,null,null,null,null,null,null,null,null,null,null,null,null,null,null,null,null,null,null,{"$f":"Yes","v":"Yes"},{"$f":"No","v":"No"}]
[{"$f":"IFERROR(INDEX(P$285:S$286,MATCH(PP_TypeOfAuditorAssistance,INDEX(P$254:S$259,,PP_LanguageIndex),0),PP_LanguageIndex),\"\")","v":"Reporting responsibilities according to the Danish executive order on approved auditors' reports especially the companies act or equivalent legislation, that the company is subject to (Audit)"},null,null,null,null,"PP_ReportingResponsibilitiesAccordingToTheDanishExecutiveOrderOnApprovedAuditorsReportsEspeciallyTheCompaniesActOrEquivalentLegislationThatTheCompanyIsSubjectTo",null,null,null,null,{"$f":"IF(B148=Yes,\"true\",IF(B148=No,\"false\",\"\"))","v":""},null,null,null,{"$f":"\"\"&INDEX(PP_Locale,ROW(),PP_LanguageIndex)","v":""},null,null,null,null,null,null,null,null,null,null,null,null,null,null,null,null,null,null,null,null,null,null,null,null,null,null,null,null,null,null,null,null,null,null,null,null,null,null,null,null,null,null,null,null,null,null,null,null,null,null,null,null,null,null,null,null,null,null,null,{"$f":"Yes","v":"Yes"},{"$f":"No","v":"No"}]
[{"$f":"IFERROR(INDEX(P$287:S$288,MATCH(PP_TypeOfAuditorAssistance,INDEX(P$254:S$259,,PP_LanguageIndex),0),PP_LanguageIndex),\"\")","v":"Reporting responsibilities according to the Danish executive order on approved auditors' reports especially legislation on financial reporting, including accounting and storage of accounting records (Audit)"},null,null,null,null,"PP_ReportingResponsibilitiesAccordingToTheDanishExecutiveOrderOnApprovedAuditorsReportsEspeciallyLegislationOnFinancialReportingIncludingAccountingAndStorageOfAccountingRecords",null,null,null,null,{"$f":"IF(B149=Yes,\"true\",IF(B149=No,\"false\",\"\"))","v":""},null,null,null,{"$f":"\"\"&INDEX(PP_Locale,ROW(),PP_LanguageIndex)","v":""},null,null,null,null,null,null,null,null,null,null,null,null,null,null,null,null,null,null,null,null,null,null,null,null,null,null,null,null,null,null,null,null,null,null,null,null,null,null,null,null,null,null,null,null,null,null,null,null,null,null,null,null,null,null,null,null,null,null,null,{"$f":"Yes","v":"Yes"},{"$f":"No","v":"No"}]
[{"$f":"IFERROR(INDEX(P$289:S$290,MATCH(PP_TypeOfAuditorAssistance,INDEX(P$254:S$259,,PP_LanguageIndex),0),PP_LanguageIndex),\"\")","v":"Reporting responsibilities according to the Danish executive order on approved auditors' reports especially other matters (Audit)"},null,null,null,null,"PP_ReportingResponsibilitiesAccordingToTheDanishExecutiveOrderOnApprovedAuditorsReportsEspeciallyOtherMatters",null,null,null,null,{"$f":"IF(B150=Yes,\"true\",IF(B150=No,\"false\",\"\"))","v":""},null,null,null,{"$f":"\"\"&INDEX(PP_Locale,ROW(),PP_LanguageIndex)","v":""},null,null,null,null,null,null,null,null,null,null,null,null,null,null,null,null,null,null,null,null,null,null,null,null,null,null,null,null,null,null,null,null,null,null,null,null,null,null,null,null,null,null,null,null,null,null,null,null,null,null,null,null,null,null,null,null,null,null,null,{"$f":"Yes","v":"Yes"},{"$f":"No","v":"No"}]
[null,null,null,null,null,null,null,null,null,null,null,null,null,null,{"$f":"\"\"&INDEX(PP_Locale,ROW(),PP_LanguageIndex)","v":""}]
[{"$f":"IF(PP_TypeOfAuditorAssistance=NoAuditAssistance,\"\",\"\"&INDEX(PP_Locale,ROW(),PP_LanguageIndex))","v":"Dates/locations:"},null,null,null,null,null,null,null,null,null,null,null,null,null,{"$f":"\"\"&INDEX(PP_Locale,ROW(),PP_LanguageIndex)","v":"Dates/locations:"},"Dates/locations:",null,null,"Datoer/lokationer:"]
[{"$f":"IF(PP_TypeOfAuditorAssistance=NoAuditAssistance,\"\",\"\"&INDEX(PP_Locale,ROW(),PP_LanguageIndex))","v":"Signature of auditors, place"},null,null,null,null,"PP_SignatureOfAuditorsPlace",null,null,null,null,{"$f":"IF(A153=\"\",\"\",\"\"&B153)","v":""},null,null,null,{"$f":"\"\"&INDEX(PP_Locale,ROW(),PP_LanguageIndex)","v":"Signature of auditors, place"},"Signature of auditors, place",null,null,"Revisors underskrift, sted",null,null,null,null,null,null,null,null,null,null,null,null,null,null,null,null,null,null,null,null,null,null,null,null,null,null,null,null,null,null,null,null,null,null,null,null,null,null,null,null,null,null,null,null,null,null,null,null,null,null,null,null,null,null,null,null,null,null,null,null,null,null,null,null,null,null,null,null,null,null,null,null,null,null,null,null,null,null,"&allowhtml=false&merge=false",{"$f":"\"pp://General Data/\"&INDEX(PP_Locale,ROW(),1)&\"?taxonomy=\"&PP_TaxonomyId&\"&labellanguage=en&period=1\"&IF(PP_Consolidated,\"_Consolidated\",\"\")&CT153","v":"pp://General Data/Signature of auditors, place?taxonomy=DKGAAP&labellanguage=en&period=1_Consolidated&allowhtml=false&merge=false"}]
[{"$f":"IF(PP_TypeOfAuditorAssistance=NoAuditAssistance,\"\",\"\"&INDEX(PP_Locale,ROW(),PP_LanguageIndex))","v":"Signature of auditors, date"},null,null,null,null,"PP_SignatureOfAuditorsDate",null,null,null,null,{"$f":"IF(COUNTBLANK(B154),\"\",TEXT(YEAR(B154),\"0000\")&\"-\"&TEXT(MONTH(B154),\"00\")&\"-\"&TEXT(DAY(B154),\"00\"))","v":""},null,null,null,{"$f":"\"\"&INDEX(PP_Locale,ROW(),PP_LanguageIndex)","v":"Signature of auditors, date"},"Signature of auditors, date",null,null,"Revisors underskrift, dato",null,null,null,null,null,null,null,null,null,null,null,null,null,null,null,null,null,null,null,null,null,null,null,null,null,null,null,null,null,null,null,null,null,null,null,null,null,null,null,null,null,null,null,null,null,null,null,null,null,null,null,null,null,null,null,null,null,null,null,null,null,null,null,null,null,null,null,null,null,null,null,null,null,null,null,null,null,null,"&allowhtml=false&merge=false",{"$f":"\"pp://General Data/\"&INDEX(PP_Locale,ROW(),1)&\"?taxonomy=\"&PP_TaxonomyId&\"&labellanguage=en&period=1\"&IF(PP_Consolidated,\"_Consolidated\",\"\")&CT154","v":"pp://General Data/Signature of auditors, date?taxonomy=DKGAAP&labellanguage=en&period=1_Consolidated&allowhtml=false&merge=false"}]
[null,null,null,null,null,null,null,null,null,null,null,null,null,null,{"$f":"\"\"&INDEX(PP_Locale,ROW(),PP_LanguageIndex)","v":""}]
[{"$f":"IF(PP_TypeOfAuditorAssistance=NoAuditAssistance,\"\",\"\"&INDEX(PP_Locale,ROW(),PP_LanguageIndex))","v":"Auditor 1:"},null,null,null,null,null,null,null,null,null,null,null,null,null,{"$f":"\"\"&INDEX(PP_Locale,ROW(),PP_LanguageIndex)","v":"Auditor 1:"},"Auditor 1:",null,null,"Revisor 1:"]
[{"$f":"IF(PP_TypeOfAuditorAssistance=NoAuditAssistance,\"\",\"\"&INDEX(PP_Locale,ROW(),PP_LanguageIndex))","v":"Name and surname of auditor 1"},null,null,null,null,"PP_NameAndSurnameOfAuditor_1",null,null,null,null,{"$f":"IF(A157=\"\",\"\",\"\"&B157)","v":""},null,null,null,{"$f":"\"\"&INDEX(PP_Locale,ROW(),PP_LanguageIndex)","v":"Name and surname of auditor 1"},"Name and surname of auditor 1",null,null,"Revisors navn 1",null,null,null,null,null,null,null,null,null,null,null,null,null,null,null,null,null,null,null,null,null,null,null,null,null,null,null,null,null,null,null,null,null,null,null,null,null,null,null,null,null,null,null,null,null,null,null,null,null,null,null,null,null,null,null,null,null,null,null,null,null,null,null,null,null,null,null,null,null,null,null,null,null,null,null,null,null,null,"&allowhtml=false&merge=false",{"$f":"\"pp://General Data/\"&INDEX(PP_Locale,ROW(),1)&\"?taxonomy=\"&PP_TaxonomyId&\"&labellanguage=en&period=1\"&IF(PP_Consolidated,\"_Consolidated\",\"\")&CT157","v":"pp://General Data/Name and surname of auditor 1?taxonomy=DKGAAP&labellanguage=en&period=1_Consolidated&allowhtml=false&merge=false"}]
[{"$f":"IF(PP_TypeOfAuditorAssistance=NoAuditAssistance,\"\",\"\"&INDEX(PP_Locale,ROW(),PP_LanguageIndex))","v":"Description of auditor 1"},null,null,null,null,"PP_DescriptionOfAuditor_1",null,null,null,null,{"$f":"IF(A158=\"\",\"\",\"\"&B158)","v":""},null,null,null,{"$f":"\"\"&INDEX(PP_Locale,ROW(),PP_LanguageIndex)","v":"Description of auditor 1"},"Description of auditor 1",null,null,"Revisors titel 1",null,null,null,null,null,null,null,null,null,null,null,null,null,null,null,null,null,null,null,null,null,null,null,null,null,null,null,null,null,null,null,null,null,null,null,null,null,null,null,null,null,null,null,null,null,null,null,null,null,null,null,null,null,null,null,null,null,null,null,null,null,null,null,null,null,null,null,null,null,null,null,null,null,null,null,null,null,null,"&allowhtml=false&merge=false",{"$f":"\"pp://General Data/\"&INDEX(PP_Locale,ROW(),1)&\"?taxonomy=\"&PP_TaxonomyId&\"&labellanguage=en&period=1\"&IF(PP_Consolidated,\"_Consolidated\",\"\")&CT158","v":"pp://General Data/Description of auditor 1?taxonomy=DKGAAP&labellanguage=en&period=1_Consolidated&allowhtml=false&merge=false"}]
[{"$f":"IF(PP_TypeOfAuditorAssistance=NoAuditAssistance,\"\",\"\"&INDEX(PP_Locale,ROW(),PP_LanguageIndex))","v":"Identification number of auditor 1"},null,null,null,null,"PP_IdentificationNumberOfAuditor_1",null,null,null,null,{"$f":"IF(A159=\"\",\"\",\"\"&B159)","v":""},null,null,null,{"$f":"\"\"&INDEX(PP_Locale,ROW(),PP_LanguageIndex)","v":"Identification number of auditor 1"},"Identification number of auditor 1",null,null,"Revisors MNE-nr. 1",null,null,null,null,null,null,null,null,null,null,null,null,null,null,null,null,null,null,null,null,null,null,null,null,null,null,null,null,null,null,null,null,null,null,null,null,null,null,null,null,null,null,null,null,null,null,null,null,null,null,null,null,null,null,null,null,null,null,null,null,null,null,null,null,null,null,null,null,null,null,null,null,null,null,null,null,null,null,"&allowhtml=false&merge=false",{"$f":"\"pp://General Data/\"&INDEX(PP_Locale,ROW(),1)&\"?taxonomy=\"&PP_TaxonomyId&\"&labellanguage=en&period=1\"&IF(PP_Consolidated,\"_Consolidated\",\"\")&CT159","v":"pp://General Data/Identification number of auditor 1?taxonomy=DKGAAP&labellanguage=en&period=1_Consolidated&allowhtml=false&merge=false"}]
[{"$f":"IF(PP_TypeOfAuditorAssistance=NoAuditAssistance,\"\",\"\"&INDEX(PP_Locale,ROW(),PP_LanguageIndex))","v":"Legal Entity Identifier [LEI] of audit firm 1"},null,null,null,null,"PP_LegalEntityIdentifierOfAuditFirm_1",null,null,null,null,{"$f":"\"\"&B160","v":""},null,null,null,{"$f":"\"\"&INDEX(PP_Locale,ROW(),PP_LanguageIndex)","v":"Legal Entity Identifier [LEI] of audit firm 1"},"Legal Entity Identifier [LEI] of audit firm 1",null,null,"Revisionsvirksomhedens LEI-kode 1",null,null,null,null,null,null,null,null,null,null,null,null,null,null,null,null,null,null,null,null,null,null,null,null,null,null,null,null,null,null,null,null,null,null,null,null,null,null,null,null,null,null,null,null,null,null,null,null,null,null,null,null,null,null,null,null,null,null,null,null,null,null,null,null,null,null,null,null,null,null,null,null,null,null,null,null,null,null,"&allowhtml=false&merge=false&skipspace=true",{"$f":"\"pp://General Data/\"&INDEX(PP_Locale,ROW(),1)&\"?taxonomy=\"&PP_TaxonomyId&\"&labellanguage=en&period=1\"&IF(PP_Consolidated,\"_Consolidated\",\"\")&CT160","v":"pp://General Data/Legal Entity Identifier [LEI] of audit firm 1?taxonomy=DKGAAP&labellanguage=en&period=1_Consolidated&allowhtml=false&merge=false&skipspace=true"}]
[{"$f":"IF(PP_TypeOfAuditorAssistance=NoAuditAssistance,\"\",\"\"&INDEX(PP_Locale,ROW(),PP_LanguageIndex))","v":"Identification number [CVR] of audit firm 1"},null,null,null,null,"PP_IdentificationNumberCvrOfAuditFirm_1",null,null,null,null,{"$f":"\"\"&SUBSTITUTE(B161,\" \",\"\")","v":""},null,null,null,{"$f":"\"\"&INDEX(PP_Locale,ROW(),PP_LanguageIndex)","v":"Identification number [CVR] of audit firm 1"},"Identification number [CVR] of audit firm 1",null,null,"Revisionsvirksomhedens CVR-nr. 1",null,null,null,null,null,null,null,null,null,null,null,null,null,null,null,null,null,null,null,null,null,null,null,null,null,null,null,null,null,null,null,null,null,null,null,null,null,null,null,null,null,null,null,null,null,null,null,null,null,null,null,null,null,null,null,null,null,null,null,null,null,null,null,null,null,null,null,null,null,null,null,null,null,null,null,null,null,null,"&allowhtml=false&merge=false&skipspace=true",{"$f":"\"pp://General Data/\"&INDEX(PP_Locale,ROW(),1)&\"?taxonomy=\"&PP_TaxonomyId&\"&labellanguage=en&period=1\"&IF(PP_Consolidated,\"_Consolidated\",\"\")&CT161","v":"pp://General Data/Identification number [CVR] of audit firm 1?taxonomy=DKGAAP&labellanguage=en&period=1_Consolidated&allowhtml=false&merge=false&skipspace=true"}]
[{"$f":"IF(PP_TypeOfAuditorAssistance=NoAuditAssistance,\"\",\"\"&INDEX(PP_Locale,ROW(),PP_LanguageIndex))","v":"Identification number [PNR] of audit firm 1"},null,null,null,null,"PP_IdentificationNumberPnrOfAuditFirm_1",null,null,null,null,{"$f":"\"\"&SUBSTITUTE(B162,\"-\",\"\")","v":""},null,null,null,{"$f":"\"\"&INDEX(PP_Locale,ROW(),PP_LanguageIndex)","v":"Identification number [PNR] of audit firm 1"},"Identification number [PNR] of audit firm 1",null,null,"Revisionsvirksomhedens P-nr. 1",null,null,null,null,null,null,null,null,null,null,null,null,null,null,null,null,null,null,null,null,null,null,null,null,null,null,null,null,null,null,null,null,null,null,null,null,null,null,null,null,null,null,null,null,null,null,null,null,null,null,null,null,null,null,null,null,null,null,null,null,null,null,null,null,null,null,null,null,null,null,null,null,null,null,null,null,null,null,"&allowhtml=false&merge=false",{"$f":"\"pp://General Data/\"&INDEX(PP_Locale,ROW(),1)&\"?taxonomy=\"&PP_TaxonomyId&\"&labellanguage=en&period=1\"&IF(PP_Consolidated,\"_Consolidated\",\"\")&CT162","v":"pp://General Data/Identification number [PNR] of audit firm 1?taxonomy=DKGAAP&labellanguage=en&period=1_Consolidated&allowhtml=false&merge=false"}]
[{"$f":"IF(PP_TypeOfAuditorAssistance=NoAuditAssistance,\"\",\"\"&INDEX(PP_Locale,ROW(),PP_LanguageIndex))","v":"Name of audit firm 1"},null,null,null,null,"PP_NameOfAuditFirm_1",null,null,null,null,{"$f":"\"\"&B163","v":""},null,null,null,{"$f":"\"\"&INDEX(PP_Locale,ROW(),PP_LanguageIndex)","v":"Name of audit firm 1"},"Name of audit firm 1",null,null,"Revisionsvirksomhedens navn 1",null,null,null,null,null,null,null,null,null,null,null,null,null,null,null,null,null,null,null,null,null,null,null,null,null,null,null,null,null,null,null,null,null,null,null,null,null,null,null,null,null,null,null,null,null,null,null,null,null,null,null,null,null,null,null,null,null,null,null,null,null,null,null,null,null,null,null,null,null,null,null,null,null,null,null,null,null,null,"&allowhtml=false&merge=false",{"$f":"\"pp://General Data/\"&INDEX(PP_Locale,ROW(),1)&\"?taxonomy=\"&PP_TaxonomyId&\"&labellanguage=en&period=1\"&IF(PP_Consolidated,\"_Consolidated\",\"\")&CT163","v":"pp://General Data/Name of audit firm 1?taxonomy=DKGAAP&labellanguage=en&period=1_Consolidated&allowhtml=false&merge=false"}]
[{"$f":"IF(PP_TypeOfAuditorAssistance=NoAuditAssistance,\"\",\"\"&INDEX(PP_Locale,ROW(),PP_LanguageIndex))","v":"Address of auditor, street name 1"},null,null,null,null,"PP_AddressOfAuditorStreetName_1",null,null,null,null,"",null,null,null,{"$f":"\"\"&INDEX(PP_Locale,ROW(),PP_LanguageIndex)","v":"Address of auditor, street name 1"},"Address of auditor, street name 1",null,null,"Revisionsvirksomhedens adresse, vejnavn 1",null,null,null,null,null,null,null,null,null,null,null,null,null,null,null,null,null,null,null,null,null,null,null,null,null,null,null,null,null,null,null,null,null,null,null,null,null,null,null,null,null,null,null,null,null,null,null,null,null,null,null,null,null,null,null,null,null,null,null,null,null,null,null,null,null,null,null,null,null,null,null,null,null,null,null,null,null,null,"&allowhtml=false&merge=false",{"$f":"\"pp://General Data/\"&INDEX(PP_Locale,ROW(),1)&\"?taxonomy=\"&PP_TaxonomyId&\"&labellanguage=en&period=1\"&IF(PP_Consolidated,\"_Consolidated\",\"\")&CT164","v":"pp://General Data/Address of auditor, street name 1?taxonomy=DKGAAP&labellanguage=en&period=1_Consolidated&allowhtml=false&merge=false"}]
[{"$f":"IF(PP_TypeOfAuditorAssistance=NoAuditAssistance,\"\",\"\"&INDEX(PP_Locale,ROW(),PP_LanguageIndex))","v":"Address of auditor, street building identifier 1"},null,null,null,null,"PP_AddressOfAuditorStreetBuildingIdentifier_1",null,null,null,null,"",null,null,null,{"$f":"\"\"&INDEX(PP_Locale,ROW(),PP_LanguageIndex)","v":"Address of auditor, street building identifier 1"},"Address of auditor, street building identifier 1",null,null,"Revisionsvirksomhedens adresse, vejnr og etage 1",null,null,null,null,null,null,null,null,null,null,null,null,null,null,null,null,null,null,null,null,null,null,null,null,null,null,null,null,null,null,null,null,null,null,null,null,null,null,null,null,null,null,null,null,null,null,null,null,null,null,null,null,null,null,null,null,null,null,null,null,null,null,null,null,null,null,null,null,null,null,null,null,null,null,null,null,null,null,"&allowhtml=false&merge=false",{"$f":"\"pp://General Data/\"&INDEX(PP_Locale,ROW(),1)&\"?taxonomy=\"&PP_TaxonomyId&\"&labellanguage=en&period=1\"&IF(PP_Consolidated,\"_Consolidated\",\"\")&CT165","v":"pp://General Data/Address of auditor, street building identifier 1?taxonomy=DKGAAP&labellanguage=en&period=1_Consolidated&allowhtml=false&merge=false"}]
[{"$f":"IF(PP_TypeOfAuditorAssistance=NoAuditAssistance,\"\",\"\"&INDEX(PP_Locale,ROW(),PP_LanguageIndex))","v":"Address of auditor, post code identifier 1"},null,null,null,null,"PP_AddressOfAuditorPostCodeIdentifier_1",null,null,null,null,"",null,null,null,{"$f":"\"\"&INDEX(PP_Locale,ROW(),PP_LanguageIndex)","v":"Address of auditor, post code identifier 1"},"Address of auditor, post code identifier 1",null,null,"Revisionsvirksomhedens adresse, postnummer 1",null,null,null,null,null,null,null,null,null,null,null,null,null,null,null,null,null,null,null,null,null,null,null,null,null,null,null,null,null,null,null,null,null,null,null,null,null,null,null,null,null,null,null,null,null,null,null,null,null,null,null,null,null,null,null,null,null,null,null,null,null,null,null,null,null,null,null,null,null,null,null,null,null,null,null,null,null,null,"&allowhtml=false&merge=false",{"$f":"\"pp://General Data/\"&INDEX(PP_Locale,ROW(),1)&\"?taxonomy=\"&PP_TaxonomyId&\"&labellanguage=en&period=1\"&IF(PP_Consolidated,\"_Consolidated\",\"\")&CT166","v":"pp://General Data/Address of auditor, post code identifier 1?taxonomy=DKGAAP&labellanguage=en&period=1_Consolidated&allowhtml=false&merge=false"}]
[{"$f":"IF(PP_TypeOfAuditorAssistance=NoAuditAssistance,\"\",\"\"&INDEX(PP_Locale,ROW(),PP_LanguageIndex))","v":"Address of auditor, district name 1"},null,null,null,null,"PP_AddressOfAuditorDistrictName_1",null,null,null,null,"",null,null,null,{"$f":"\"\"&INDEX(PP_Locale,ROW(),PP_LanguageIndex)","v":"Address of auditor, district name 1"},"Address of auditor, district name 1",null,null,"Revisionsvirksomhedens adresse, by 1",null,null,null,null,null,null,null,null,null,null,null,null,null,null,null,null,null,null,null,null,null,null,null,null,null,null,null,null,null,null,null,null,null,null,null,null,null,null,null,null,null,null,null,null,null,null,null,null,null,null,null,null,null,null,null,null,null,null,null,null,null,null,null,null,null,null,null,null,null,null,null,null,null,null,null,null,null,null,"&allowhtml=false&merge=false",{"$f":"\"pp://General Data/\"&INDEX(PP_Locale,ROW(),1)&\"?taxonomy=\"&PP_TaxonomyId&\"&labellanguage=en&period=1\"&IF(PP_Consolidated,\"_Consolidated\",\"\")&CT167","v":"pp://General Data/Address of auditor, district name 1?taxonomy=DKGAAP&labellanguage=en&period=1_Consolidated&allowhtml=false&merge=false"}]
[{"$f":"IF(PP_TypeOfAuditorAssistance=NoAuditAssistance,\"\",\"\"&INDEX(PP_Locale,ROW(),PP_LanguageIndex))","v":"Address of auditor, country 1"},null,null,null,null,"PP_AddressOfAuditorCountry_1",null,null,null,null,"",null,null,null,{"$f":"\"\"&INDEX(PP_Locale,ROW(),PP_LanguageIndex)","v":"Address of auditor, country 1"},"Address of auditor, country 1",null,null,"Revisionsvirksomhedens adresse, land 1",null,null,null,null,null,null,null,null,null,null,null,null,null,null,null,null,null,null,null,null,null,null,null,null,null,null,null,null,null,null,null,null,null,null,null,null,null,null,null,null,null,null,null,null,null,null,null,null,null,null,null,null,null,null,null,null,null,null,null,null,null,null,null,null,null,null,null,null,null,null,null,null,null,null,null,null,null,null,"&allowhtml=false&merge=false",{"$f":"\"pp://General Data/\"&INDEX(PP_Locale,ROW(),1)&\"?taxonomy=\"&PP_TaxonomyId&\"&labellanguage=en&period=1\"&IF(PP_Consolidated,\"_Consolidated\",\"\")&CT168","v":"pp://General Data/Address of auditor, country 1?taxonomy=DKGAAP&labellanguage=en&period=1_Consolidated&allowhtml=false&merge=false"}]
[{"$f":"IF(PP_TypeOfAuditorAssistance=NoAuditAssistance,\"\",\"\"&INDEX(PP_Locale,ROW(),PP_LanguageIndex))","v":"Address of auditor, country identification code 1"},null,null,null,null,"PP_AddressOfAuditorCountryIdentificationCode_1",null,null,null,null,"",null,null,null,{"$f":"\"\"&INDEX(PP_Locale,ROW(),PP_LanguageIndex)","v":"Address of auditor, country identification code 1"},"Address of auditor, country identification code 1",null,null,"Revisionsvirksomhedens adresse, landekode 1",null,null,null,null,null,null,null,null,null,null,null,null,null,null,null,null,null,null,null,null,null,null,null,null,null,null,null,null,null,null,null,null,null,null,null,null,null,null,null,null,null,null,null,null,null,null,null,null,null,null,null,null,null,null,null,null,null,null,null,null,null,null,null,null,null,null,null,null,null,null,null,null,null,null,null,null,null,null,"&allowhtml=false&merge=false",{"$f":"\"pp://General Data/\"&INDEX(PP_Locale,ROW(),1)&\"?taxonomy=\"&PP_TaxonomyId&\"&labellanguage=en&period=1\"&IF(PP_Consolidated,\"_Consolidated\",\"\")&CT169","v":"pp://General Data/Address of auditor, country identification code 1?taxonomy=DKGAAP&labellanguage=en&period=1_Consolidated&allowhtml=false&merge=false"}]
[{"$f":"IF(PP_TypeOfAuditorAssistance=NoAuditAssistance,\"\",\"\"&INDEX(PP_Locale,ROW(),PP_LanguageIndex))","v":"Telephone number of auditor 1"},null,null,null,null,"PP_TelephoneNumberOfAuditor_1",null,null,null,null,{"$f":"\"\"&SUBSTITUTE(B170,\" \",\"\")","v":""},null,null,null,{"$f":"\"\"&INDEX(PP_Locale,ROW(),PP_LanguageIndex)","v":"Telephone number of auditor 1"},"Telephone number of auditor 1",null,null,"Revisionsvirksomhedens telefonnummer 1",null,null,null,null,null,null,null,null,null,null,null,null,null,null,null,null,null,null,null,null,null,null,null,null,null,null,null,null,null,null,null,null,null,null,null,null,null,null,null,null,null,null,null,null,null,null,null,null,null,null,null,null,null,null,null,null,null,null,null,null,null,null,null,null,null,null,null,null,null,null,null,null,null,null,null,null,null,null,"&allowhtml=false&merge=false",{"$f":"\"pp://General Data/\"&INDEX(PP_Locale,ROW(),1)&\"?taxonomy=\"&PP_TaxonomyId&\"&labellanguage=en&period=1\"&IF(PP_Consolidated,\"_Consolidated\",\"\")&CT170","v":"pp://General Data/Telephone number of auditor 1?taxonomy=DKGAAP&labellanguage=en&period=1_Consolidated&allowhtml=false&merge=false"}]
[{"$f":"IF(PP_TypeOfAuditorAssistance=NoAuditAssistance,\"\",\"\"&INDEX(PP_Locale,ROW(),PP_LanguageIndex))","v":"E-mail of auditor 1"},null,null,null,null,"PP_EmailOfAuditor_1",null,null,null,null,{"$f":"\"\"&B171","v":""},null,null,null,{"$f":"\"\"&INDEX(PP_Locale,ROW(),PP_LanguageIndex)","v":"E-mail of auditor 1"},"E-mail of auditor 1",null,null,"Revisionsvirksomhedens e-mail 1",null,null,null,null,null,null,null,null,null,null,null,null,null,null,null,null,null,null,null,null,null,null,null,null,null,null,null,null,null,null,null,null,null,null,null,null,null,null,null,null,null,null,null,null,null,null,null,null,null,null,null,null,null,null,null,null,null,null,null,null,null,null,null,null,null,null,null,null,null,null,null,null,null,null,null,null,null,null,"&allowhtml=false&merge=false",{"$f":"\"pp://General Data/\"&INDEX(PP_Locale,ROW(),1)&\"?taxonomy=\"&PP_TaxonomyId&\"&labellanguage=en&period=1\"&IF(PP_Consolidated,\"_Consolidated\",\"\")&CT171","v":"pp://General Data/E-mail of auditor 1?taxonomy=DKGAAP&labellanguage=en&period=1_Consolidated&allowhtml=false&merge=false"}]
[null,null,null,null,null,null,null,null,null,null,null,null,null,null,{"$f":"\"\"&INDEX(PP_Locale,ROW(),PP_LanguageIndex)","v":""}]
[{"$f":"IF(PP_TypeOfAuditorAssistance=NoAuditAssistance,\"\",\"\"&INDEX(PP_Locale,ROW(),PP_LanguageIndex))","v":"Auditor 2:"},null,null,null,null,null,null,null,null,null,null,null,null,null,{"$f":"\"\"&INDEX(PP_Locale,ROW(),PP_LanguageIndex)","v":"Auditor 2:"},"Auditor 2:",null,null,"Revisor 2:"]
[{"$f":"IF(PP_TypeOfAuditorAssistance=NoAuditAssistance,\"\",\"\"&INDEX(PP_Locale,ROW(),PP_LanguageIndex))","v":"Name and surname of auditor 2"},null,null,null,null,"PP_NameAndSurnameOfAuditor_2",null,null,null,null,{"$f":"IF(A174=\"\",\"\",\"\"&B174)","v":""},null,null,null,{"$f":"\"\"&INDEX(PP_Locale,ROW(),PP_LanguageIndex)","v":"Name and surname of auditor 2"},"Name and surname of auditor 2",null,null,"Revisors navn 2",null,null,null,null,null,null,null,null,null,null,null,null,null,null,null,null,null,null,null,null,null,null,null,null,null,null,null,null,null,null,null,null,null,null,null,null,null,null,null,null,null,null,null,null,null,null,null,null,null,null,null,null,null,null,null,null,null,null,null,null,null,null,null,null,null,null,null,null,null,null,null,null,null,null,null,null,null,null,"&allowhtml=false&merge=false",{"$f":"\"pp://General Data/\"&INDEX(PP_Locale,ROW(),1)&\"?taxonomy=\"&PP_TaxonomyId&\"&labellanguage=en&period=1\"&IF(PP_Consolidated,\"_Consolidated\",\"\")&CT174","v":"pp://General Data/Name and surname of auditor 2?taxonomy=DKGAAP&labellanguage=en&period=1_Consolidated&allowhtml=false&merge=false"}]
[{"$f":"IF(PP_TypeOfAuditorAssistance=NoAuditAssistance,\"\",\"\"&INDEX(PP_Locale,ROW(),PP_LanguageIndex))","v":"Description of auditor 2"},null,null,null,null,"PP_DescriptionOfAuditor_2",null,null,null,null,{"$f":"IF(A175=\"\",\"\",\"\"&B175)","v":""},null,null,null,{"$f":"\"\"&INDEX(PP_Locale,ROW(),PP_LanguageIndex)","v":"Description of auditor 2"},"Description of auditor 2",null,null,"Revisors titel 2",null,null,null,null,null,null,null,null,null,null,null,null,null,null,null,null,null,null,null,null,null,null,null,null,null,null,null,null,null,null,null,null,null,null,null,null,null,null,null,null,null,null,null,null,null,null,null,null,null,null,null,null,null,null,null,null,null,null,null,null,null,null,null,null,null,null,null,null,null,null,null,null,null,null,null,null,null,null,"&allowhtml=false&merge=false",{"$f":"\"pp://General Data/\"&INDEX(PP_Locale,ROW(),1)&\"?taxonomy=\"&PP_TaxonomyId&\"&labellanguage=en&period=1\"&IF(PP_Consolidated,\"_Consolidated\",\"\")&CT175","v":"pp://General Data/Description of auditor 2?taxonomy=DKGAAP&labellanguage=en&period=1_Consolidated&allowhtml=false&merge=false"}]
[{"$f":"IF(PP_TypeOfAuditorAssistance=NoAuditAssistance,\"\",\"\"&INDEX(PP_Locale,ROW(),PP_LanguageIndex))","v":"Identification number of auditor 2"},null,null,null,null,"PP_IdentificationNumberOfAuditor_2",null,null,null,null,{"$f":"IF(A176=\"\",\"\",\"\"&B176)","v":""},null,null,null,{"$f":"\"\"&INDEX(PP_Locale,ROW(),PP_LanguageIndex)","v":"Identification number of auditor 2"},"Identification number of auditor 2",null,null,"Revisors MNE-nr. 2",null,null,null,null,null,null,null,null,null,null,null,null,null,null,null,null,null,null,null,null,null,null,null,null,null,null,null,null,null,null,null,null,null,null,null,null,null,null,null,null,null,null,null,null,null,null,null,null,null,null,null,null,null,null,null,null,null,null,null,null,null,null,null,null,null,null,null,null,null,null,null,null,null,null,null,null,null,null,"&allowhtml=false&merge=false",{"$f":"\"pp://General Data/\"&INDEX(PP_Locale,ROW(),1)&\"?taxonomy=\"&PP_TaxonomyId&\"&labellanguage=en&period=1\"&IF(PP_Consolidated,\"_Consolidated\",\"\")&CT176","v":"pp://General Data/Identification number of auditor 2?taxonomy=DKGAAP&labellanguage=en&period=1_Consolidated&allowhtml=false&merge=false"}]
[{"$f":"IF(PP_TypeOfAuditorAssistance=NoAuditAssistance,\"\",\"\"&INDEX(PP_Locale,ROW(),PP_LanguageIndex))","v":"Legal Entity Identifier [LEI] of audit firm 2"},{"$f":"\"\"&IF(COUNTBLANK(PP_NameAndSurnameOfAuditor_2),,PP_LegalEntityIdentifierOfAuditFirm_1)","v":""},null,null,null,"PP_LegalEntityIdentifierOfAuditFirm_2",null,null,null,null,{"$f":"\"\"&SUBSTITUTE(B177,\" \",\"\")","v":""},null,null,null,{"$f":"\"\"&INDEX(PP_Locale,ROW(),PP_LanguageIndex)","v":"Legal Entity Identifier [LEI] of audit firm 2"},"Legal Entity Identifier [LEI] of audit firm 2",null,null,"Revisionsvirksomhedens LEI-kode 2",null,null,null,null,null,null,null,null,null,null,null,null,null,null,null,null,null,null,null,null,null,null,null,null,null,null,null,null,null,null,null,null,null,null,null,null,null,null,null,null,null,null,null,null,null,null,null,null,null,null,null,null,null,null,null,null,null,null,null,null,null,null,null,null,null,null,null,null,null,null,null,null,null,null,null,null,null,null,"&allowhtml=false&merge=false&skipspace=true",{"$f":"\"pp://General Data/\"&INDEX(PP_Locale,ROW(),1)&\"?taxonomy=\"&PP_TaxonomyId&\"&labellanguage=en&period=1\"&IF(PP_Consolidated,\"_Consolidated\",\"\")&CT177","v":"pp://General Data/Legal Entity Identifier [LEI] of audit firm 2?taxonomy=DKGAAP&labellanguage=en&period=1_Consolidated&allowhtml=false&merge=false&skipspace=true"}]
[{"$f":"IF(PP_TypeOfAuditorAssistance=NoAuditAssistance,\"\",\"\"&INDEX(PP_Locale,ROW(),PP_LanguageIndex))","v":"Identification number [CVR] of audit firm 2"},{"$f":"\"\"&IF(COUNTBLANK(PP_NameAndSurnameOfAuditor_2),,PP_IdentificationNumberCvrOfAuditFirm_1)","v":""},null,null,null,"PP_IdentificationNumberCvrOfAuditFirm_2",null,null,null,null,{"$f":"\"\"&SUBSTITUTE(B178,\" \",\"\")","v":""},null,null,null,{"$f":"\"\"&INDEX(PP_Locale,ROW(),PP_LanguageIndex)","v":"Identification number [CVR] of audit firm 2"},"Identification number [CVR] of audit firm 2",null,null,"Revisionsvirksomhedens CVR-nr. 2",null,null,null,null,null,null,null,null,null,null,null,null,null,null,null,null,null,null,null,null,null,null,null,null,null,null,null,null,null,null,null,null,null,null,null,null,null,null,null,null,null,null,null,null,null,null,null,null,null,null,null,null,null,null,null,null,null,null,null,null,null,null,null,null,null,null,null,null,null,null,null,null,null,null,null,null,null,null,"&allowhtml=false&merge=false&skipspace=true",{"$f":"\"pp://General Data/\"&INDEX(PP_Locale,ROW(),1)&\"?taxonomy=\"&PP_TaxonomyId&\"&labellanguage=en&period=1\"&IF(PP_Consolidated,\"_Consolidated\",\"\")&CT178","v":"pp://General Data/Identification number [CVR] of audit firm 2?taxonomy=DKGAAP&labellanguage=en&period=1_Consolidated&allowhtml=false&merge=false&skipspace=true"}]
[{"$f":"IF(PP_TypeOfAuditorAssistance=NoAuditAssistance,\"\",\"\"&INDEX(PP_Locale,ROW(),PP_LanguageIndex))","v":"Identification number [PNR] of audit firm 2"},{"$f":"\"\"&IF(COUNTBLANK(PP_NameAndSurnameOfAuditor_2),,PP_IdentificationNumberPnrOfAuditFirm_1)","v":""},null,null,null,"PP_IdentificationNumberPnrOfAuditFirm_2",null,null,null,null,{"$f":"\"\"&SUBSTITUTE(B179,\"-\",\"\")","v":""},null,null,null,{"$f":"\"\"&INDEX(PP_Locale,ROW(),PP_LanguageIndex)","v":"Identification number [PNR] of audit firm 2"},"Identification number [PNR] of audit firm 2",null,null,"Revisionsvirksomhedens P-nr. 2",null,null,null,null,null,null,null,null,null,null,null,null,null,null,null,null,null,null,null,null,null,null,null,null,null,null,null,null,null,null,null,null,null,null,null,null,null,null,null,null,null,null,null,null,null,null,null,null,null,null,null,null,null,null,null,null,null,null,null,null,null,null,null,null,null,null,null,null,null,null,null,null,null,null,null,null,null,null,"&allowhtml=false&merge=false",{"$f":"\"pp://General Data/\"&INDEX(PP_Locale,ROW(),1)&\"?taxonomy=\"&PP_TaxonomyId&\"&labellanguage=en&period=1\"&IF(PP_Consolidated,\"_Consolidated\",\"\")&CT179","v":"pp://General Data/Identification number [PNR] of audit firm 2?taxonomy=DKGAAP&labellanguage=en&period=1_Consolidated&allowhtml=false&merge=false"}]
[{"$f":"IF(PP_TypeOfAuditorAssistance=NoAuditAssistance,\"\",\"\"&INDEX(PP_Locale,ROW(),PP_LanguageIndex))","v":"Name of audit firm 2"},{"$f":"\"\"&IF(COUNTBLANK(PP_NameAndSurnameOfAuditor_2),,PP_NameOfAuditFirm_1)","v":""},null,null,null,"PP_NameOfAuditFirm_2",null,null,null,null,{"$f":"\"\"&B180","v":""},null,null,null,{"$f":"\"\"&INDEX(PP_Locale,ROW(),PP_LanguageIndex)","v":"Name of audit firm 2"},"Name of audit firm 2",null,null,"Revisionsvirksomhedens navn 2",null,null,null,null,null,null,null,null,null,null,null,null,null,null,null,null,null,null,null,null,null,null,null,null,null,null,null,null,null,null,null,null,null,null,null,null,null,null,null,null,null,null,null,null,null,null,null,null,null,null,null,null,null,null,null,null,null,null,null,null,null,null,null,null,null,null,null,null,null,null,null,null,null,null,null,null,null,null,"&allowhtml=false&merge=false",{"$f":"\"pp://General Data/\"&INDEX(PP_Locale,ROW(),1)&\"?taxonomy=\"&PP_TaxonomyId&\"&labellanguage=en&period=1\"&IF(PP_Consolidated,\"_Consolidated\",\"\")&CT180","v":"pp://General Data/Name of audit firm 2?taxonomy=DKGAAP&labellanguage=en&period=1_Consolidated&allowhtml=false&merge=false"}]
[{"$f":"IF(PP_TypeOfAuditorAssistance=NoAuditAssistance,\"\",\"\"&INDEX(PP_Locale,ROW(),PP_LanguageIndex))","v":"Address of auditor, street name 2"},{"$f":"\"\"&IF(COUNTBLANK(PP_NameAndSurnameOfAuditor_2),,PP_AddressOfAuditorStreetName_1)","v":""},null,null,null,"PP_AddressOfAuditorStreetName_2",null,null,null,null,"",null,null,null,{"$f":"\"\"&INDEX(PP_Locale,ROW(),PP_LanguageIndex)","v":"Address of auditor, street name 2"},"Address of auditor, street name 2",null,null,"Revisionsvirksomhedens adresse, vejnavn 2",null,null,null,null,null,null,null,null,null,null,null,null,null,null,null,null,null,null,null,null,null,null,null,null,null,null,null,null,null,null,null,null,null,null,null,null,null,null,null,null,null,null,null,null,null,null,null,null,null,null,null,null,null,null,null,null,null,null,null,null,null,null,null,null,null,null,null,null,null,null,null,null,null,null,null,null,null,null,"&allowhtml=false&merge=false",{"$f":"\"pp://General Data/\"&INDEX(PP_Locale,ROW(),1)&\"?taxonomy=\"&PP_TaxonomyId&\"&labellanguage=en&period=1\"&IF(PP_Consolidated,\"_Consolidated\",\"\")&CT181","v":"pp://General Data/Address of auditor, street name 2?taxonomy=DKGAAP&labellanguage=en&period=1_Consolidated&allowhtml=false&merge=false"}]
[{"$f":"IF(PP_TypeOfAuditorAssistance=NoAuditAssistance,\"\",\"\"&INDEX(PP_Locale,ROW(),PP_LanguageIndex))","v":"Address of auditor, street building identifier 2"},{"$f":"\"\"&IF(COUNTBLANK(PP_NameAndSurnameOfAuditor_2),,PP_AddressOfAuditorStreetBuildingIdentifier_1)","v":""},null,null,null,"PP_AddressOfAuditorStreetBuildingIdentifier_2",null,null,null,null,"",null,null,null,{"$f":"\"\"&INDEX(PP_Locale,ROW(),PP_LanguageIndex)","v":"Address of auditor, street building identifier 2"},"Address of auditor, street building identifier 2",null,null,"Revisionsvirksomhedens adresse, vejnr og etage 2",null,null,null,null,null,null,null,null,null,null,null,null,null,null,null,null,null,null,null,null,null,null,null,null,null,null,null,null,null,null,null,null,null,null,null,null,null,null,null,null,null,null,null,null,null,null,null,null,null,null,null,null,null,null,null,null,null,null,null,null,null,null,null,null,null,null,null,null,null,null,null,null,null,null,null,null,null,null,"&allowhtml=false&merge=false",{"$f":"\"pp://General Data/\"&INDEX(PP_Locale,ROW(),1)&\"?taxonomy=\"&PP_TaxonomyId&\"&labellanguage=en&period=1\"&IF(PP_Consolidated,\"_Consolidated\",\"\")&CT182","v":"pp://General Data/Address of auditor, street building identifier 2?taxonomy=DKGAAP&labellanguage=en&period=1_Consolidated&allowhtml=false&merge=false"}]
[{"$f":"IF(PP_TypeOfAuditorAssistance=NoAuditAssistance,\"\",\"\"&INDEX(PP_Locale,ROW(),PP_LanguageIndex))","v":"Address of auditor, post code identifier 2"},{"$f":"\"\"&IF(COUNTBLANK(PP_NameAndSurnameOfAuditor_2),,PP_AddressOfAuditorPostCodeIdentifier_1)","v":""},null,null,null,"PP_AddressOfAuditorPostCodeIdentifier_2",null,null,null,null,"",null,null,null,{"$f":"\"\"&INDEX(PP_Locale,ROW(),PP_LanguageIndex)","v":"Address of auditor, post code identifier 2"},"Address of auditor, post code identifier 2",null,null,"Revisionsvirksomhedens adresse, postnummer 2",null,null,null,null,null,null,null,null,null,null,null,null,null,null,null,null,null,null,null,null,null,null,null,null,null,null,null,null,null,null,null,null,null,null,null,null,null,null,null,null,null,null,null,null,null,null,null,null,null,null,null,null,null,null,null,null,null,null,null,null,null,null,null,null,null,null,null,null,null,null,null,null,null,null,null,null,null,null,"&allowhtml=false&merge=false",{"$f":"\"pp://General Data/\"&INDEX(PP_Locale,ROW(),1)&\"?taxonomy=\"&PP_TaxonomyId&\"&labellanguage=en&period=1\"&IF(PP_Consolidated,\"_Consolidated\",\"\")&CT183","v":"pp://General Data/Address of auditor, post code identifier 2?taxonomy=DKGAAP&labellanguage=en&period=1_Consolidated&allowhtml=false&merge=false"}]
[{"$f":"IF(PP_TypeOfAuditorAssistance=NoAuditAssistance,\"\",\"\"&INDEX(PP_Locale,ROW(),PP_LanguageIndex))","v":"Address of auditor, district name 2"},{"$f":"\"\"&IF(COUNTBLANK(PP_NameAndSurnameOfAuditor_2),,PP_AddressOfAuditorDistrictName_1)","v":""},null,null,null,"PP_AddressOfAuditorDistrictName_2",null,null,null,null,"",null,null,null,{"$f":"\"\"&INDEX(PP_Locale,ROW(),PP_LanguageIndex)","v":"Address of auditor, district name 2"},"Address of auditor, district name 2",null,null,"Revisionsvirksomhedens adresse, by 2",null,null,null,null,null,null,null,null,null,null,null,null,null,null,null,null,null,null,null,null,null,null,null,null,null,null,null,null,null,null,null,null,null,null,null,null,null,null,null,null,null,null,null,null,null,null,null,null,null,null,null,null,null,null,null,null,null,null,null,null,null,null,null,null,null,null,null,null,null,null,null,null,null,null,null,null,null,null,"&allowhtml=false&merge=false",{"$f":"\"pp://General Data/\"&INDEX(PP_Locale,ROW(),1)&\"?taxonomy=\"&PP_TaxonomyId&\"&labellanguage=en&period=1\"&IF(PP_Consolidated,\"_Consolidated\",\"\")&CT184","v":"pp://General Data/Address of auditor, district name 2?taxonomy=DKGAAP&labellanguage=en&period=1_Consolidated&allowhtml=false&merge=false"}]
[{"$f":"IF(PP_TypeOfAuditorAssistance=NoAuditAssistance,\"\",\"\"&INDEX(PP_Locale,ROW(),PP_LanguageIndex))","v":"Address of auditor, country 2"},{"$f":"\"\"&IF(COUNTBLANK(PP_NameAndSurnameOfAuditor_2),,PP_AddressOfAuditorCountry_1)","v":""},null,null,null,"PP_AddressOfAuditorCountry_2",null,null,null,null,"",null,null,null,{"$f":"\"\"&INDEX(PP_Locale,ROW(),PP_LanguageIndex)","v":"Address of auditor, country 2"},"Address of auditor, country 2",null,null,"Revisionsvirksomhedens adresse, land 2",null,null,null,null,null,null,null,null,null,null,null,null,null,null,null,null,null,null,null,null,null,null,null,null,null,null,null,null,null,null,null,null,null,null,null,null,null,null,null,null,null,null,null,null,null,null,null,null,null,null,null,null,null,null,null,null,null,null,null,null,null,null,null,null,null,null,null,null,null,null,null,null,null,null,null,null,null,null,"&allowhtml=false&merge=false",{"$f":"\"pp://General Data/\"&INDEX(PP_Locale,ROW(),1)&\"?taxonomy=\"&PP_TaxonomyId&\"&labellanguage=en&period=1\"&IF(PP_Consolidated,\"_Consolidated\",\"\")&CT185","v":"pp://General Data/Address of auditor, country 2?taxonomy=DKGAAP&labellanguage=en&period=1_Consolidated&allowhtml=false&merge=false"}]
[{"$f":"IF(PP_TypeOfAuditorAssistance=NoAuditAssistance,\"\",\"\"&INDEX(PP_Locale,ROW(),PP_LanguageIndex))","v":"Address of auditor, country identification code 2"},{"$f":"\"\"&IF(COUNTBLANK(PP_NameAndSurnameOfAuditor_2),,PP_AddressOfAuditorCountryIdentificationCode_1)","v":""},null,null,null,"PP_AddressOfAuditorCountryIdentificationCode_2",null,null,null,null,"",null,null,null,{"$f":"\"\"&INDEX(PP_Locale,ROW(),PP_LanguageIndex)","v":"Address of auditor, country identification code 2"},"Address of auditor, country identification code 2",null,null,"Revisionsvirksomhedens adresse, landekode 2",null,null,null,null,null,null,null,null,null,null,null,null,null,null,null,null,null,null,null,null,null,null,null,null,null,null,null,null,null,null,null,null,null,null,null,null,null,null,null,null,null,null,null,null,null,null,null,null,null,null,null,null,null,null,null,null,null,null,null,null,null,null,null,null,null,null,null,null,null,null,null,null,null,null,null,null,null,null,"&allowhtml=false&merge=false",{"$f":"\"pp://General Data/\"&INDEX(PP_Locale,ROW(),1)&\"?taxonomy=\"&PP_TaxonomyId&\"&labellanguage=en&period=1\"&IF(PP_Consolidated,\"_Consolidated\",\"\")&CT186","v":"pp://General Data/Address of auditor, country identification code 2?taxonomy=DKGAAP&labellanguage=en&period=1_Consolidated&allowhtml=false&merge=false"}]
[{"$f":"IF(PP_TypeOfAuditorAssistance=NoAuditAssistance,\"\",\"\"&INDEX(PP_Locale,ROW(),PP_LanguageIndex))","v":"Telephone number of auditor 2"},{"$f":"\"\"&IF(COUNTBLANK(PP_NameAndSurnameOfAuditor_2),,PP_TelephoneNumberOfAuditor_1)","v":""},null,null,null,"PP_TelephoneNumberOfAuditor_2",null,null,null,null,{"$f":"\"\"&SUBSTITUTE(B187,\" \",\"\")","v":""},null,null,null,{"$f":"\"\"&INDEX(PP_Locale,ROW(),PP_LanguageIndex)","v":"Telephone number of auditor 2"},"Telephone number of auditor 2",null,null,"Revisionsvirksomhedens telefonnummer 2",null,null,null,null,null,null,null,null,null,null,null,null,null,null,null,null,null,null,null,null,null,null,null,null,null,null,null,null,null,null,null,null,null,null,null,null,null,null,null,null,null,null,null,null,null,null,null,null,null,null,null,null,null,null,null,null,null,null,null,null,null,null,null,null,null,null,null,null,null,null,null,null,null,null,null,null,null,null,"&allowhtml=false&merge=false",{"$f":"\"pp://General Data/\"&INDEX(PP_Locale,ROW(),1)&\"?taxonomy=\"&PP_TaxonomyId&\"&labellanguage=en&period=1\"&IF(PP_Consolidated,\"_Consolidated\",\"\")&CT187","v":"pp://General Data/Telephone number of auditor 2?taxonomy=DKGAAP&labellanguage=en&period=1_Consolidated&allowhtml=false&merge=false"}]
[{"$f":"IF(PP_TypeOfAuditorAssistance=NoAuditAssistance,\"\",\"\"&INDEX(PP_Locale,ROW(),PP_LanguageIndex))","v":"E-mail of auditor 2"},{"$f":"\"\"&IF(COUNTBLANK(PP_NameAndSurnameOfAuditor_2),,PP_EmailOfAuditor_1)","v":""},null,null,null,"PP_EmailOfAuditor_2",null,null,null,null,{"$f":"\"\"&B188","v":""},null,null,null,{"$f":"\"\"&INDEX(PP_Locale,ROW(),PP_LanguageIndex)","v":"E-mail of auditor 2"},"E-mail of auditor 2",null,null,"Revisionsvirksomhedens e-mail 2",null,null,null,null,null,null,null,null,null,null,null,null,null,null,null,null,null,null,null,null,null,null,null,null,null,null,null,null,null,null,null,null,null,null,null,null,null,null,null,null,null,null,null,null,null,null,null,null,null,null,null,null,null,null,null,null,null,null,null,null,null,null,null,null,null,null,null,null,null,null,null,null,null,null,null,null,null,null,"&allowhtml=false&merge=false",{"$f":"\"pp://General Data/\"&INDEX(PP_Locale,ROW(),1)&\"?taxonomy=\"&PP_TaxonomyId&\"&labellanguage=en&period=1\"&IF(PP_Consolidated,\"_Consolidated\",\"\")&CT188","v":"pp://General Data/E-mail of auditor 2?taxonomy=DKGAAP&labellanguage=en&period=1_Consolidated&allowhtml=false&merge=false"}]
[null,null,null,null,null,null,null,null,null,null,null,null,null,null,{"$f":"\"\"&INDEX(PP_Locale,ROW(),PP_LanguageIndex)","v":""}]
[{"$f":"\"\"&INDEX(PP_Locale,ROW(),PP_LanguageIndex)","v":"Internal audit:"},null,null,null,null,null,null,null,null,null,null,null,null,null,{"$f":"\"\"&INDEX(PP_Locale,ROW(),PP_LanguageIndex)","v":"Internal audit:"},"Internal audit:",null,null,"Intern revision:"]
[{"$f":"\"\"&INDEX(PP_Locale,ROW(),PP_LanguageIndex)","v":"Signature internal audit, place"},null,null,null,null,"PP_SignatureInternalAuditPlace",null,null,null,null,{"$f":"\"\"&B191","v":""},null,null,null,{"$f":"\"\"&INDEX(PP_Locale,ROW(),PP_LanguageIndex)","v":"Signature internal audit, place"},"Signature internal audit, place",null,null,"Intern revision, sted",null,null,null,null,null,null,null,null,null,null,null,null,null,null,null,null,null,null,null,null,null,null,null,null,null,null,null,null,null,null,null,null,null,null,null,null,null,null,null,null,null,null,null,null,null,null,null,null,null,null,null,null,null,null,null,null,null,null,null,null,null,null,null,null,null,null,null,null,null,null,null,null,null,null,null,null,null,null,"&allowhtml=false&merge=false",{"$f":"\"pp://General Data/\"&INDEX(PP_Locale,ROW(),1)&\"?taxonomy=\"&PP_TaxonomyId&\"&labellanguage=en&period=1\"&IF(PP_Consolidated,\"_Consolidated\",\"\")&CT191","v":"pp://General Data/Signature internal audit, place?taxonomy=DKGAAP&labellanguage=en&period=1_Consolidated&allowhtml=false&merge=false"}]
[{"$f":"\"\"&INDEX(PP_Locale,ROW(),PP_LanguageIndex)","v":"Signature internal audit, date"},null,null,null,null,"PP_SignatureInternalAuditDate",null,null,null,null,{"$f":"IF(COUNTBLANK(B192),\"\",TEXT(YEAR(B192),\"0000\")&\"-\"&TEXT(MONTH(B192),\"00\")&\"-\"&TEXT(DAY(B192),\"00\"))","v":""},null,null,null,{"$f":"\"\"&INDEX(PP_Locale,ROW(),PP_LanguageIndex)","v":"Signature internal audit, date"},"Signature internal audit, date",null,null,"Intern revision, dato",null,null,null,null,null,null,null,null,null,null,null,null,null,null,null,null,null,null,null,null,null,null,null,null,null,null,null,null,null,null,null,null,null,null,null,null,null,null,null,null,null,null,null,null,null,null,null,null,null,null,null,null,null,null,null,null,null,null,null,null,null,null,null,null,null,null,null,null,null,null,null,null,null,null,null,null,null,null,"&allowhtml=false&merge=false",{"$f":"\"pp://General Data/\"&INDEX(PP_Locale,ROW(),1)&\"?taxonomy=\"&PP_TaxonomyId&\"&labellanguage=en&period=1\"&IF(PP_Consolidated,\"_Consolidated\",\"\")&CT192","v":"pp://General Data/Signature internal audit, date?taxonomy=DKGAAP&labellanguage=en&period=1_Consolidated&allowhtml=false&merge=false"}]
[{"$f":"\"\"&INDEX(PP_Locale,ROW(),PP_LanguageIndex)","v":"Name and surname of performer of internal audit 1"},null,null,null,null,"PP_NameAndSurnameOfPerformerOfInternalAudit_1",null,null,null,null,{"$f":"IF(A193=\"\",\"\",\"\"&B193)","v":""},null,null,null,{"$f":"\"\"&INDEX(PP_Locale,ROW(),PP_LanguageIndex)","v":"Name and surname of performer of internal audit 1"},"Name and surname of performer of internal audit 1",null,null,"Intern revision navn 1",null,null,null,null,null,null,null,null,null,null,null,null,null,null,null,null,null,null,null,null,null,null,null,null,null,null,null,null,null,null,null,null,null,null,null,null,null,null,null,null,null,null,null,null,null,null,null,null,null,null,null,null,null,null,null,null,null,null,null,null,null,null,null,null,null,null,null,null,null,null,null,null,null,null,null,null,null,null,"&allowhtml=false&merge=false",{"$f":"\"pp://General Data/\"&INDEX(PP_Locale,ROW(),1)&\"?taxonomy=\"&PP_TaxonomyId&\"&labellanguage=en&period=1\"&IF(PP_Consolidated,\"_Consolidated\",\"\")&CT193","v":"pp://General Data/Name and surname of performer of internal audit 1?taxonomy=DKGAAP&labellanguage=en&period=1_Consolidated&allowhtml=false&merge=false"}]
[{"$f":"\"\"&INDEX(PP_Locale,ROW(),PP_LanguageIndex)","v":"Title of performer of internal audit 1"},null,null,null,null,"PP_TitleOfPerformerOfInternalAudit_1",null,null,null,null,{"$f":"IF(A194=\"\",\"\",\"\"&B194)","v":""},null,null,null,{"$f":"\"\"&INDEX(PP_Locale,ROW(),PP_LanguageIndex)","v":"Title of performer of internal audit 1"},"Title of performer of internal audit 1",null,null,"Intern revision titel 1",null,null,null,null,null,null,null,null,null,null,null,null,null,null,null,null,null,null,null,null,null,null,null,null,null,null,null,null,null,null,null,null,null,null,null,null,null,null,null,null,null,null,null,null,null,null,null,null,null,null,null,null,null,null,null,null,null,null,null,null,null,null,null,null,null,null,null,null,null,null,null,null,null,null,null,null,null,null,"&allowhtml=false&merge=false",{"$f":"\"pp://General Data/\"&INDEX(PP_Locale,ROW(),1)&\"?taxonomy=\"&PP_TaxonomyId&\"&labellanguage=en&period=1\"&IF(PP_Consolidated,\"_Consolidated\",\"\")&CT194","v":"pp://General Data/Title of performer of internal audit 1?taxonomy=DKGAAP&labellanguage=en&period=1_Consolidated&allowhtml=false&merge=false"}]
[{"$f":"\"\"&INDEX(PP_Locale,ROW(),PP_LanguageIndex)","v":"Name and surname of performer of internal audit 2"},null,null,null,null,"PP_NameAndSurnameOfPerformerOfInternalAudit_2",null,null,null,null,{"$f":"IF(A195=\"\",\"\",\"\"&B195)","v":""},null,null,null,{"$f":"\"\"&INDEX(PP_Locale,ROW(),PP_LanguageIndex)","v":"Name and surname of performer of internal audit 2"},"Name and surname of performer of internal audit 2",null,null,"Intern revision navn 2",null,null,null,null,null,null,null,null,null,null,null,null,null,null,null,null,null,null,null,null,null,null,null,null,null,null,null,null,null,null,null,null,null,null,null,null,null,null,null,null,null,null,null,null,null,null,null,null,null,null,null,null,null,null,null,null,null,null,null,null,null,null,null,null,null,null,null,null,null,null,null,null,null,null,null,null,null,null,"&allowhtml=false&merge=false",{"$f":"\"pp://General Data/\"&INDEX(PP_Locale,ROW(),1)&\"?taxonomy=\"&PP_TaxonomyId&\"&labellanguage=en&period=1\"&IF(PP_Consolidated,\"_Consolidated\",\"\")&CT195","v":"pp://General Data/Name and surname of performer of internal audit 2?taxonomy=DKGAAP&labellanguage=en&period=1_Consolidated&allowhtml=false&merge=false"}]
[{"$f":"\"\"&INDEX(PP_Locale,ROW(),PP_LanguageIndex)","v":"Title of performer of internal audit 2"},null,null,null,null,"PP_TitleOfPerformerOfInternalAudit_2",null,null,null,null,{"$f":"IF(A196=\"\",\"\",\"\"&B196)","v":""},null,null,null,{"$f":"\"\"&INDEX(PP_Locale,ROW(),PP_LanguageIndex)","v":"Title of performer of internal audit 2"},"Title of performer of internal audit 2",null,null,"Intern revision titel 2",null,null,null,null,null,null,null,null,null,null,null,null,null,null,null,null,null,null,null,null,null,null,null,null,null,null,null,null,null,null,null,null,null,null,null,null,null,null,null,null,null,null,null,null,null,null,null,null,null,null,null,null,null,null,null,null,null,null,null,null,null,null,null,null,null,null,null,null,null,null,null,null,null,null,null,null,null,null,"&allowhtml=false&merge=false",{"$f":"\"pp://General Data/\"&INDEX(PP_Locale,ROW(),1)&\"?taxonomy=\"&PP_TaxonomyId&\"&labellanguage=en&period=1\"&IF(PP_Consolidated,\"_Consolidated\",\"\")&CT196","v":"pp://General Data/Title of performer of internal audit 2?taxonomy=DKGAAP&labellanguage=en&period=1_Consolidated&allowhtml=false&merge=false"}]
[null,null,null,null,null,null,null,null,null,null,null,null,null,null,{"$f":"\"\"&INDEX(PP_Locale,ROW(),PP_LanguageIndex)","v":""}]
[{"$f":"\"\"&INDEX(PP_Locale,ROW(),PP_LanguageIndex)","v":"Other statements:"},null,null,null,null,null,null,null,null,null,null,null,null,null,{"$f":"\"\"&INDEX(PP_Locale,ROW(),PP_LanguageIndex)","v":"Other statements:"},"Other statements:",null,null,"Øvrige erklæringer:"]
[{"$f":"\"\"&INDEX(PP_Locale,ROW(),PP_LanguageIndex)","v":"Signature other statement 1, place"},null,null,null,null,"PP_SignatureOtherStatementsPlace_1",null,null,null,null,{"$f":"\"\"&B199","v":""},null,null,null,{"$f":"\"\"&INDEX(PP_Locale,ROW(),PP_LanguageIndex)","v":"Signature other statement 1, place"},"Signature other statement 1, place",null,null,"Øvrig erklæring 1, sted",null,null,null,null,null,null,null,null,null,null,null,null,null,null,null,null,null,null,null,null,null,null,null,null,null,null,null,null,null,null,null,null,null,null,null,null,null,null,null,null,null,null,null,null,null,null,null,null,null,null,null,null,null,null,null,null,null,null,null,null,null,null,null,null,null,null,null,null,null,null,null,null,null,null,null,null,null,null,"&allowhtml=false&merge=false",{"$f":"\"pp://General Data/\"&INDEX(PP_Locale,ROW(),1)&\"?taxonomy=\"&PP_TaxonomyId&\"&labellanguage=en&period=1\"&IF(PP_Consolidated,\"_Consolidated\",\"\")&CT199","v":"pp://General Data/Signature other statement 1, place?taxonomy=DKGAAP&labellanguage=en&period=1_Consolidated&allowhtml=false&merge=false"}]
[{"$f":"\"\"&INDEX(PP_Locale,ROW(),PP_LanguageIndex)","v":"Signature other statement 1, date"},null,null,null,null,"PP_SignatureOtherStatementsDate_1",null,null,null,null,{"$f":"IF(COUNTBLANK(B200),\"\",TEXT(YEAR(B200),\"0000\")&\"-\"&TEXT(MONTH(B200),\"00\")&\"-\"&TEXT(DAY(B200),\"00\"))","v":""},null,null,null,{"$f":"\"\"&INDEX(PP_Locale,ROW(),PP_LanguageIndex)","v":"Signature other statement 1, date"},"Signature other statement 1, date",null,null,"Øvrig erklæring 1, dato",null,null,null,null,null,null,null,null,null,null,null,null,null,null,null,null,null,null,null,null,null,null,null,null,null,null,null,null,null,null,null,null,null,null,null,null,null,null,null,null,null,null,null,null,null,null,null,null,null,null,null,null,null,null,null,null,null,null,null,null,null,null,null,null,null,null,null,null,null,null,null,null,null,null,null,null,null,null,"&allowhtml=false&merge=false",{"$f":"\"pp://General Data/\"&INDEX(PP_Locale,ROW(),1)&\"?taxonomy=\"&PP_TaxonomyId&\"&labellanguage=en&period=1\"&IF(PP_Consolidated,\"_Consolidated\",\"\")&CT200","v":"pp://General Data/Signature other statement 1, date?taxonomy=DKGAAP&labellanguage=en&period=1_Consolidated&allowhtml=false&merge=false"}]
[{"$f":"\"\"&INDEX(PP_Locale,ROW(),PP_LanguageIndex)","v":"Legal Entity Identifier [LEI] of performer of other statement 1"},null,null,null,null,"PP_LegalEntityIdentifierOfPerformerOfOtherStatement_1",null,null,null,null,{"$f":"\"\"&B201","v":""},null,null,null,{"$f":"\"\"&INDEX(PP_Locale,ROW(),PP_LanguageIndex)","v":"Legal Entity Identifier [LEI] of performer of other statement 1"},"Legal Entity Identifier [LEI] of performer of other statement 1",null,null,"Øvrig erklæring 1, LEI-kode",null,null,null,null,null,null,null,null,null,null,null,null,null,null,null,null,null,null,null,null,null,null,null,null,null,null,null,null,null,null,null,null,null,null,null,null,null,null,null,null,null,null,null,null,null,null,null,null,null,null,null,null,null,null,null,null,null,null,null,null,null,null,null,null,null,null,null,null,null,null,null,null,null,null,null,null,null,null,"&allowhtml=false&merge=false&skipspace=true",{"$f":"\"pp://General Data/\"&INDEX(PP_Locale,ROW(),1)&\"?taxonomy=\"&PP_TaxonomyId&\"&labellanguage=en&period=1\"&IF(PP_Consolidated,\"_Consolidated\",\"\")&CT201","v":"pp://General Data/Legal Entity Identifier [LEI] of performer of other statement 1?taxonomy=DKGAAP&labellanguage=en&period=1_Consolidated&allowhtml=false&merge=false&skipspace=true"}]
[{"$f":"\"\"&INDEX(PP_Locale,ROW(),PP_LanguageIndex)","v":"Identification number [CVR] of performer of other statement 1"},null,null,null,null,"PP_IdentificationNumberCvrOfPerformerOfOtherStatement_1",null,null,null,null,{"$f":"IF(A202=\"\",\"\",\"\"&B202)","v":""},null,null,null,{"$f":"\"\"&INDEX(PP_Locale,ROW(),PP_LanguageIndex)","v":"Identification number [CVR] of performer of other statement 1"},"Identification number [CVR] of performer of other statement 1",null,null,"Øvrig erklæring 1, CVR-nr.",null,null,null,null,null,null,null,null,null,null,null,null,null,null,null,null,null,null,null,null,null,null,null,null,null,null,null,null,null,null,null,null,null,null,null,null,null,null,null,null,null,null,null,null,null,null,null,null,null,null,null,null,null,null,null,null,null,null,null,null,null,null,null,null,null,null,null,null,null,null,null,null,null,null,null,null,null,null,"&allowhtml=false&merge=false&skipspace=true",{"$f":"\"pp://General Data/\"&INDEX(PP_Locale,ROW(),1)&\"?taxonomy=\"&PP_TaxonomyId&\"&labellanguage=en&period=1\"&IF(PP_Consolidated,\"_Consolidated\",\"\")&CT202","v":"pp://General Data/Identification number [CVR] of performer of other statement 1?taxonomy=DKGAAP&labellanguage=en&period=1_Consolidated&allowhtml=false&merge=false&skipspace=true"}]
[{"$f":"\"\"&INDEX(PP_Locale,ROW(),PP_LanguageIndex)","v":"Name of firm performing other statement 1"},null,null,null,null,"PP_NameOfFirmperformingOtherStatement_1",null,null,null,null,{"$f":"IF(A203=\"\",\"\",\"\"&B203)","v":""},null,null,null,{"$f":"\"\"&INDEX(PP_Locale,ROW(),PP_LanguageIndex)","v":"Name of firm performing other statement 1"},"Name of firm performing other statement 1",null,null,"Øvrig erklæring 1, firmanavn",null,null,null,null,null,null,null,null,null,null,null,null,null,null,null,null,null,null,null,null,null,null,null,null,null,null,null,null,null,null,null,null,null,null,null,null,null,null,null,null,null,null,null,null,null,null,null,null,null,null,null,null,null,null,null,null,null,null,null,null,null,null,null,null,null,null,null,null,null,null,null,null,null,null,null,null,null,null,"&allowhtml=false&merge=false",{"$f":"\"pp://General Data/\"&INDEX(PP_Locale,ROW(),1)&\"?taxonomy=\"&PP_TaxonomyId&\"&labellanguage=en&period=1\"&IF(PP_Consolidated,\"_Consolidated\",\"\")&CT203","v":"pp://General Data/Name of firm performing other statement 1?taxonomy=DKGAAP&labellanguage=en&period=1_Consolidated&allowhtml=false&merge=false"}]
[{"$f":"\"\"&INDEX(PP_Locale,ROW(),PP_LanguageIndex)","v":"Name and surname of performer of other statement 1"},null,null,null,null,"PP_NameAndSurnameOfPerformerOfOtherStatement_1",null,null,null,null,{"$f":"IF(A204=\"\",\"\",\"\"&B204)","v":""},null,null,null,{"$f":"\"\"&INDEX(PP_Locale,ROW(),PP_LanguageIndex)","v":"Name and surname of performer of other statement 1"},"Name and surname of performer of other statement 1",null,null,"Øvrig erklæring 1, navn",null,null,null,null,null,null,null,null,null,null,null,null,null,null,null,null,null,null,null,null,null,null,null,null,null,null,null,null,null,null,null,null,null,null,null,null,null,null,null,null,null,null,null,null,null,null,null,null,null,null,null,null,null,null,null,null,null,null,null,null,null,null,null,null,null,null,null,null,null,null,null,null,null,null,null,null,null,null,"&allowhtml=false&merge=false",{"$f":"\"pp://General Data/\"&INDEX(PP_Locale,ROW(),1)&\"?taxonomy=\"&PP_TaxonomyId&\"&labellanguage=en&period=1\"&IF(PP_Consolidated,\"_Consolidated\",\"\")&CT204","v":"pp://General Data/Name and surname of performer of other statement 1?taxonomy=DKGAAP&labellanguage=en&period=1_Consolidated&allowhtml=false&merge=false"}]
[{"$f":"\"\"&INDEX(PP_Locale,ROW(),PP_LanguageIndex)","v":"Title of performer of other statement 1"},null,null,null,null,"PP_TitleOfPerformerOfOtherStatements_1",null,null,null,null,{"$f":"IF(A205=\"\",\"\",\"\"&B205)","v":""},null,null,null,{"$f":"\"\"&INDEX(PP_Locale,ROW(),PP_LanguageIndex)","v":"Title of performer of other statement 1"},"Title of performer of other statement 1",null,null,"Øvrig erklæring 1, titel",null,null,null,null,null,null,null,null,null,null,null,null,null,null,null,null,null,null,null,null,null,null,null,null,null,null,null,null,null,null,null,null,null,null,null,null,null,null,null,null,null,null,null,null,null,null,null,null,null,null,null,null,null,null,null,null,null,null,null,null,null,null,null,null,null,null,null,null,null,null,null,null,null,null,null,null,null,null,"&allowhtml=false&merge=false",{"$f":"\"pp://General Data/\"&INDEX(PP_Locale,ROW(),1)&\"?taxonomy=\"&PP_TaxonomyId&\"&labellanguage=en&period=1\"&IF(PP_Consolidated,\"_Consolidated\",\"\")&CT205","v":"pp://General Data/Title of performer of other statement 1?taxonomy=DKGAAP&labellanguage=en&period=1_Consolidated&allowhtml=false&merge=false"}]
[null,null,null,null,null,null,null,null,null,null,null,null,null,null,{"$f":"\"\"&INDEX(PP_Locale,ROW(),PP_LanguageIndex)","v":""}]
[{"$f":"\"\"&INDEX(PP_Locale,ROW(),PP_LanguageIndex)","v":"Signature other statement 2, place"},null,null,null,null,"PP_SignatureOtherStatementsPlace_2",null,null,null,null,{"$f":"\"\"&B207","v":""},null,null,null,{"$f":"\"\"&INDEX(PP_Locale,ROW(),PP_LanguageIndex)","v":"Signature other statement 2, place"},"Signature other statement 2, place",null,null,"Øvrig erklæring 2, sted",null,null,null,null,null,null,null,null,null,null,null,null,null,null,null,null,null,null,null,null,null,null,null,null,null,null,null,null,null,null,null,null,null,null,null,null,null,null,null,null,null,null,null,null,null,null,null,null,null,null,null,null,null,null,null,null,null,null,null,null,null,null,null,null,null,null,null,null,null,null,null,null,null,null,null,null,null,null,"&allowhtml=false&merge=false",{"$f":"\"pp://General Data/\"&INDEX(PP_Locale,ROW(),1)&\"?taxonomy=\"&PP_TaxonomyId&\"&labellanguage=en&period=1\"&IF(PP_Consolidated,\"_Consolidated\",\"\")&CT207","v":"pp://General Data/Signature other statement 2, place?taxonomy=DKGAAP&labellanguage=en&period=1_Consolidated&allowhtml=false&merge=false"}]
[{"$f":"\"\"&INDEX(PP_Locale,ROW(),PP_LanguageIndex)","v":"Signature other statement 2, date"},null,null,null,null,"PP_SignatureOtherStatementsDate_2",null,null,null,null,{"$f":"IF(COUNTBLANK(B208),\"\",TEXT(YEAR(B208),\"0000\")&\"-\"&TEXT(MONTH(B208),\"00\")&\"-\"&TEXT(DAY(B208),\"00\"))","v":""},null,null,null,{"$f":"\"\"&INDEX(PP_Locale,ROW(),PP_LanguageIndex)","v":"Signature other statement 2, date"},"Signature other statement 2, date",null,null,"Øvrig erklæring 2, dato",null,null,null,null,null,null,null,null,null,null,null,null,null,null,null,null,null,null,null,null,null,null,null,null,null,null,null,null,null,null,null,null,null,null,null,null,null,null,null,null,null,null,null,null,null,null,null,null,null,null,null,null,null,null,null,null,null,null,null,null,null,null,null,null,null,null,null,null,null,null,null,null,null,null,null,null,null,null,"&allowhtml=false&merge=false",{"$f":"\"pp://General Data/\"&INDEX(PP_Locale,ROW(),1)&\"?taxonomy=\"&PP_TaxonomyId&\"&labellanguage=en&period=1\"&IF(PP_Consolidated,\"_Consolidated\",\"\")&CT208","v":"pp://General Data/Signature other statement 2, date?taxonomy=DKGAAP&labellanguage=en&period=1_Consolidated&allowhtml=false&merge=false"}]
[{"$f":"\"\"&INDEX(PP_Locale,ROW(),PP_LanguageIndex)","v":"Legal Entity Identifier [LEI] of performer of other statement 2"},null,null,null,null,"PP_LegalEntityIdentifierOfPerformerOfOtherStatement_2",null,null,null,null,{"$f":"\"\"&B209","v":""},null,null,null,{"$f":"\"\"&INDEX(PP_Locale,ROW(),PP_LanguageIndex)","v":"Legal Entity Identifier [LEI] of performer of other statement 2"},"Legal Entity Identifier [LEI] of performer of other statement 2",null,null,"Øvrig erklæring 2, LEI-kode",null,null,null,null,null,null,null,null,null,null,null,null,null,null,null,null,null,null,null,null,null,null,null,null,null,null,null,null,null,null,null,null,null,null,null,null,null,null,null,null,null,null,null,null,null,null,null,null,null,null,null,null,null,null,null,null,null,null,null,null,null,null,null,null,null,null,null,null,null,null,null,null,null,null,null,null,null,null,"&allowhtml=false&merge=false&skipspace=true",{"$f":"\"pp://General Data/\"&INDEX(PP_Locale,ROW(),1)&\"?taxonomy=\"&PP_TaxonomyId&\"&labellanguage=en&period=1\"&IF(PP_Consolidated,\"_Consolidated\",\"\")&CT209","v":"pp://General Data/Legal Entity Identifier [LEI] of performer of other statement 2?taxonomy=DKGAAP&labellanguage=en&period=1_Consolidated&allowhtml=false&merge=false&skipspace=true"}]
[{"$f":"\"\"&INDEX(PP_Locale,ROW(),PP_LanguageIndex)","v":"Identification number [CVR] of performer of other statement 2"},null,null,null,null,"PP_IdentificationNumberCvrOfPerformerOfOtherStatement_2",null,null,null,null,{"$f":"IF(A210=\"\",\"\",\"\"&B210)","v":""},null,null,null,{"$f":"\"\"&INDEX(PP_Locale,ROW(),PP_LanguageIndex)","v":"Identification number [CVR] of performer of other statement 2"},"Identification number [CVR] of performer of other statement 2",null,null,"Øvrig erklæring 2, CVR-nr.",null,null,null,null,null,null,null,null,null,null,null,null,null,null,null,null,null,null,null,null,null,null,null,null,null,null,null,null,null,null,null,null,null,null,null,null,null,null,null,null,null,null,null,null,null,null,null,null,null,null,null,null,null,null,null,null,null,null,null,null,null,null,null,null,null,null,null,null,null,null,null,null,null,null,null,null,null,null,"&allowhtml=false&merge=false&skipspace=true",{"$f":"\"pp://General Data/\"&INDEX(PP_Locale,ROW(),1)&\"?taxonomy=\"&PP_TaxonomyId&\"&labellanguage=en&period=1\"&IF(PP_Consolidated,\"_Consolidated\",\"\")&CT210","v":"pp://General Data/Identification number [CVR] of performer of other statement 2?taxonomy=DKGAAP&labellanguage=en&period=1_Consolidated&allowhtml=false&merge=false&skipspace=true"}]
[{"$f":"\"\"&INDEX(PP_Locale,ROW(),PP_LanguageIndex)","v":"Name of firm performing other statement 2"},null,null,null,null,"PP_NameOfFirmperformingOtherStatement_2",null,null,null,null,{"$f":"IF(A211=\"\",\"\",\"\"&B211)","v":""},null,null,null,{"$f":"\"\"&INDEX(PP_Locale,ROW(),PP_LanguageIndex)","v":"Name of firm performing other statement 2"},"Name of firm performing other statement 2",null,null,"Øvrig erklæring 2, firmanavn",null,null,null,null,null,null,null,null,null,null,null,null,null,null,null,null,null,null,null,null,null,null,null,null,null,null,null,null,null,null,null,null,null,null,null,null,null,null,null,null,null,null,null,null,null,null,null,null,null,null,null,null,null,null,null,null,null,null,null,null,null,null,null,null,null,null,null,null,null,null,null,null,null,null,null,null,null,null,"&allowhtml=false&merge=false",{"$f":"\"pp://General Data/\"&INDEX(PP_Locale,ROW(),1)&\"?taxonomy=\"&PP_TaxonomyId&\"&labellanguage=en&period=1\"&IF(PP_Consolidated,\"_Consolidated\",\"\")&CT211","v":"pp://General Data/Name of firm performing other statement 2?taxonomy=DKGAAP&labellanguage=en&period=1_Consolidated&allowhtml=false&merge=false"}]
[{"$f":"\"\"&INDEX(PP_Locale,ROW(),PP_LanguageIndex)","v":"Name and surname of performer of other statement 2"},null,null,null,null,"PP_NameAndSurnameOfPerformerOfOtherStatement_2",null,null,null,null,{"$f":"IF(A212=\"\",\"\",\"\"&B212)","v":""},null,null,null,{"$f":"\"\"&INDEX(PP_Locale,ROW(),PP_LanguageIndex)","v":"Name and surname of performer of other statement 2"},"Name and surname of performer of other statement 2",null,null,"Øvrig erklæring 2, navn",null,null,null,null,null,null,null,null,null,null,null,null,null,null,null,null,null,null,null,null,null,null,null,null,null,null,null,null,null,null,null,null,null,null,null,null,null,null,null,null,null,null,null,null,null,null,null,null,null,null,null,null,null,null,null,null,null,null,null,null,null,null,null,null,null,null,null,null,null,null,null,null,null,null,null,null,null,null,"&allowhtml=false&merge=false",{"$f":"\"pp://General Data/\"&INDEX(PP_Locale,ROW(),1)&\"?taxonomy=\"&PP_TaxonomyId&\"&labellanguage=en&period=1\"&IF(PP_Consolidated,\"_Consolidated\",\"\")&CT212","v":"pp://General Data/Name and surname of performer of other statement 2?taxonomy=DKGAAP&labellanguage=en&period=1_Consolidated&allowhtml=false&merge=false"}]
[{"$f":"\"\"&INDEX(PP_Locale,ROW(),PP_LanguageIndex)","v":"Title of performer of other statement 2"},null,null,null,null,"PP_TitleOfPerformerOfOtherStatements_2",null,null,null,null,{"$f":"IF(A213=\"\",\"\",\"\"&B213)","v":""},null,null,null,{"$f":"\"\"&INDEX(PP_Locale,ROW(),PP_LanguageIndex)","v":"Title of performer of other statement 2"},"Title of performer of other statement 2",null,null,"Øvrig erklæring 2, titel",null,null,null,null,null,null,null,null,null,null,null,null,null,null,null,null,null,null,null,null,null,null,null,null,null,null,null,null,null,null,null,null,null,null,null,null,null,null,null,null,null,null,null,null,null,null,null,null,null,null,null,null,null,null,null,null,null,null,null,null,null,null,null,null,null,null,null,null,null,null,null,null,null,null,null,null,null,null,"&allowhtml=false&merge=false",{"$f":"\"pp://General Data/\"&INDEX(PP_Locale,ROW(),1)&\"?taxonomy=\"&PP_TaxonomyId&\"&labellanguage=en&period=1\"&IF(PP_Consolidated,\"_Consolidated\",\"\")&CT213","v":"pp://General Data/Title of performer of other statement 2?taxonomy=DKGAAP&labellanguage=en&period=1_Consolidated&allowhtml=false&merge=false"}]
[null,null,null,null,null,null,null,null,null,null,null,null,null,null,{"$f":"\"\"&INDEX(PP_Locale,ROW(),PP_LanguageIndex)","v":""}]
[{"$f":"\"\"&INDEX(PP_Locale,ROW(),PP_LanguageIndex)","v":"Liquidator:"},null,null,null,null,null,null,null,null,null,null,null,null,null,{"$f":"\"\"&INDEX(PP_Locale,ROW(),PP_LanguageIndex)","v":"Liquidator:"},"Liquidator:",null,null,"Likvidator:"]
[{"$f":"\"\"&INDEX(PP_Locale,ROW(),PP_LanguageIndex)","v":"Name and surname of liquidator"},null,null,null,null,"PP_NameAndSurnameOfLiquidator",null,null,null,null,{"$f":"\"\"&B216","v":""},null,null,null,{"$f":"\"\"&INDEX(PP_Locale,ROW(),PP_LanguageIndex)","v":"Name and surname of liquidator"},"Name and surname of liquidator",null,null,"Likvidators navn",null,null,null,null,null,null,null,null,null,null,null,null,null,null,null,null,null,null,null,null,null,null,null,null,null,null,null,null,null,null,null,null,null,null,null,null,null,null,null,null,null,null,null,null,null,null,null,null,null,null,null,null,null,null,null,null,null,null,null,null,null,null,null,null,null,null,null,null,null,null,null,null,null,null,null,null,null,null,"&allowhtml=false&merge=false",{"$f":"\"pp://General Data/\"&INDEX(PP_Locale,ROW(),1)&\"?taxonomy=\"&PP_TaxonomyId&\"&labellanguage=en&period=1\"&IF(PP_Consolidated,\"_Consolidated\",\"\")&CT216","v":"pp://General Data/Name and surname of liquidator?taxonomy=DKGAAP&labellanguage=en&period=1_Consolidated&allowhtml=false&merge=false"}]
[{"$f":"\"\"&INDEX(PP_Locale,ROW(),PP_LanguageIndex)","v":"Title of liquidator"},null,null,null,null,"PP_TitleOfLiquidator",null,null,null,null,{"$f":"\"\"&B217","v":""},null,null,null,{"$f":"\"\"&INDEX(PP_Locale,ROW(),PP_LanguageIndex)","v":"Title of liquidator"},"Title of liquidator",null,null,"Likvidators titel",null,null,null,null,null,null,null,null,null,null,null,null,null,null,null,null,null,null,null,null,null,null,null,null,null,null,null,null,null,null,null,null,null,null,null,null,null,null,null,null,null,null,null,null,null,null,null,null,null,null,null,null,null,null,null,null,null,null,null,null,null,null,null,null,null,null,null,null,null,null,null,null,null,null,null,null,null,null,"&allowhtml=false&merge=false",{"$f":"\"pp://General Data/\"&INDEX(PP_Locale,ROW(),1)&\"?taxonomy=\"&PP_TaxonomyId&\"&labellanguage=en&period=1\"&IF(PP_Consolidated,\"_Consolidated\",\"\")&CT217","v":"pp://General Data/Title of liquidator?taxonomy=DKGAAP&labellanguage=en&period=1_Consolidated&allowhtml=false&merge=false"}]
[null,null,null,null,null,null,null,null,null,null,null,null,null,null,{"$f":"\"\"&INDEX(PP_Locale,ROW(),PP_LanguageIndex)","v":""}]
[{"$f":"\"\"&INDEX(PP_Locale,ROW(),PP_LanguageIndex)","v":"Financial institution:"},null,null,null,null,null,null,null,null,null,null,null,null,null,{"$f":"\"\"&INDEX(PP_Locale,ROW(),PP_LanguageIndex)","v":"Financial institution:"},"Financial institution:",null,null,"Primær bankforbindelse:"]
[{"$f":"\"\"&INDEX(PP_Locale,ROW(),PP_LanguageIndex)","v":"Legal Entity Identifier [LEI] of financial institution"},null,null,null,null,"PP_LegalEntityIdentifierOfFinancialInstitution",null,null,null,null,{"$f":"\"\"&B220","v":""},null,null,null,{"$f":"\"\"&INDEX(PP_Locale,ROW(),PP_LanguageIndex)","v":"Legal Entity Identifier [LEI] of financial institution"},"Legal Entity Identifier [LEI] of financial institution",null,null,"Bankens LEI-kode",null,null,null,null,null,null,null,null,null,null,null,null,null,null,null,null,null,null,null,null,null,null,null,null,null,null,null,null,null,null,null,null,null,null,null,null,null,null,null,null,null,null,null,null,null,null,null,null,null,null,null,null,null,null,null,null,null,null,null,null,null,null,null,null,null,null,null,null,null,null,null,null,null,null,null,null,null,null,"&allowhtml=false&merge=false&skipspace=true",{"$f":"\"pp://General Data/\"&INDEX(PP_Locale,ROW(),1)&\"?taxonomy=\"&PP_TaxonomyId&\"&labellanguage=en&period=1\"&IF(PP_Consolidated,\"_Consolidated\",\"\")&CT220","v":"pp://General Data/Legal Entity Identifier [LEI] of financial institution?taxonomy=DKGAAP&labellanguage=en&period=1_Consolidated&allowhtml=false&merge=false&skipspace=true"}]
[{"$f":"\"\"&INDEX(PP_Locale,ROW(),PP_LanguageIndex)","v":"Identification number [CVR] of financial institution"},null,null,null,null,"PP_IdentificationNumberCvrOfFinancialInstitution",null,null,null,null,{"$f":"\"\"&SUBSTITUTE(B221,\" \",\"\")","v":""},null,null,null,{"$f":"\"\"&INDEX(PP_Locale,ROW(),PP_LanguageIndex)","v":"Identification number [CVR] of financial institution"},"Identification number [CVR] of financial institution",null,null,"Bankens CVR-nr.",null,null,null,null,null,null,null,null,null,null,null,null,null,null,null,null,null,null,null,null,null,null,null,null,null,null,null,null,null,null,null,null,null,null,null,null,null,null,null,null,null,null,null,null,null,null,null,null,null,null,null,null,null,null,null,null,null,null,null,null,null,null,null,null,null,null,null,null,null,null,null,null,null,null,null,null,null,null,"&allowhtml=false&merge=false&skipspace=true",{"$f":"\"pp://General Data/\"&INDEX(PP_Locale,ROW(),1)&\"?taxonomy=\"&PP_TaxonomyId&\"&labellanguage=en&period=1\"&IF(PP_Consolidated,\"_Consolidated\",\"\")&CT221","v":"pp://General Data/Identification number [CVR] of financial institution?taxonomy=DKGAAP&labellanguage=en&period=1_Consolidated&allowhtml=false&merge=false&skipspace=true"}]
[{"$f":"\"\"&INDEX(PP_Locale,ROW(),PP_LanguageIndex)","v":"Name of financial institution"},null,null,null,null,"PP_NameOfFinancialInstitution",null,null,null,null,{"$f":"\"\"&B222","v":""},null,null,null,{"$f":"\"\"&INDEX(PP_Locale,ROW(),PP_LanguageIndex)","v":"Name of financial institution"},"Name of financial institution",null,null,"Bankens navn",null,null,null,null,null,null,null,null,null,null,null,null,null,null,null,null,null,null,null,null,null,null,null,null,null,null,null,null,null,null,null,null,null,null,null,null,null,null,null,null,null,null,null,null,null,null,null,null,null,null,null,null,null,null,null,null,null,null,null,null,null,null,null,null,null,null,null,null,null,null,null,null,null,null,null,null,null,null,"&allowhtml=false&merge=false",{"$f":"\"pp://General Data/\"&INDEX(PP_Locale,ROW(),1)&\"?taxonomy=\"&PP_TaxonomyId&\"&labellanguage=en&period=1\"&IF(PP_Consolidated,\"_Consolidated\",\"\")&CT222","v":"pp://General Data/Name of financial institution?taxonomy=DKGAAP&labellanguage=en&period=1_Consolidated&allowhtml=false&merge=false"}]
[{"$f":"\"\"&INDEX(PP_Locale,ROW(),PP_LanguageIndex)","v":"Address of financial institution, street name"},null,null,null,null,"PP_AddressOfFinancialStreetName",null,null,null,null,"",null,null,null,{"$f":"\"\"&INDEX(PP_Locale,ROW(),PP_LanguageIndex)","v":"Address of financial institution, street name"},"Address of financial institution, street name",null,null,"Bankens adresse, vejnavn",null,null,null,null,null,null,null,null,null,null,null,null,null,null,null,null,null,null,null,null,null,null,null,null,null,null,null,null,null,null,null,null,null,null,null,null,null,null,null,null,null,null,null,null,null,null,null,null,null,null,null,null,null,null,null,null,null,null,null,null,null,null,null,null,null,null,null,null,null,null,null,null,null,null,null,null,null,null,"&allowhtml=false&merge=false",{"$f":"\"pp://General Data/\"&INDEX(PP_Locale,ROW(),1)&\"?taxonomy=\"&PP_TaxonomyId&\"&labellanguage=en&period=1\"&IF(PP_Consolidated,\"_Consolidated\",\"\")&CT223","v":"pp://General Data/Address of financial institution, street name?taxonomy=DKGAAP&labellanguage=en&period=1_Consolidated&allowhtml=false&merge=false"}]
[{"$f":"\"\"&INDEX(PP_Locale,ROW(),PP_LanguageIndex)","v":"Address of financial institution, street building identifier"},null,null,null,null,"PP_AddressOfFinancialStreetBuildingIdentifier",null,null,null,null,"",null,null,null,{"$f":"\"\"&INDEX(PP_Locale,ROW(),PP_LanguageIndex)","v":"Address of financial institution, street building identifier"},"Address of financial institution, street building identifier",null,null,"Bankens adresse, vejnr og etage",null,null,null,null,null,null,null,null,null,null,null,null,null,null,null,null,null,null,null,null,null,null,null,null,null,null,null,null,null,null,null,null,null,null,null,null,null,null,null,null,null,null,null,null,null,null,null,null,null,null,null,null,null,null,null,null,null,null,null,null,null,null,null,null,null,null,null,null,null,null,null,null,null,null,null,null,null,null,"&allowhtml=false&merge=false",{"$f":"\"pp://General Data/\"&INDEX(PP_Locale,ROW(),1)&\"?taxonomy=\"&PP_TaxonomyId&\"&labellanguage=en&period=1\"&IF(PP_Consolidated,\"_Consolidated\",\"\")&CT224","v":"pp://General Data/Address of financial institution, street building identifier?taxonomy=DKGAAP&labellanguage=en&period=1_Consolidated&allowhtml=false&merge=false"}]
[{"$f":"\"\"&INDEX(PP_Locale,ROW(),PP_LanguageIndex)","v":"Address of financial institution, post code identifier"},null,null,null,null,"PP_AddressOfFinancialPostCodeIdentifier",null,null,null,null,"",null,null,null,{"$f":"\"\"&INDEX(PP_Locale,ROW(),PP_LanguageIndex)","v":"Address of financial institution, post code identifier"},"Address of financial institution, post code identifier",null,null,"Bankens adresse, postnummer",null,null,null,null,null,null,null,null,null,null,null,null,null,null,null,null,null,null,null,null,null,null,null,null,null,null,null,null,null,null,null,null,null,null,null,null,null,null,null,null,null,null,null,null,null,null,null,null,null,null,null,null,null,null,null,null,null,null,null,null,null,null,null,null,null,null,null,null,null,null,null,null,null,null,null,null,null,null,"&allowhtml=false&merge=false",{"$f":"\"pp://General Data/\"&INDEX(PP_Locale,ROW(),1)&\"?taxonomy=\"&PP_TaxonomyId&\"&labellanguage=en&period=1\"&IF(PP_Consolidated,\"_Consolidated\",\"\")&CT225","v":"pp://General Data/Address of financial institution, post code identifier?taxonomy=DKGAAP&labellanguage=en&period=1_Consolidated&allowhtml=false&merge=false"}]
[{"$f":"\"\"&INDEX(PP_Locale,ROW(),PP_LanguageIndex)","v":"Address of financial institution, district name"},null,null,null,null,"PP_AddressOfFinancialDistrictName",null,null,null,null,"",null,null,null,{"$f":"\"\"&INDEX(PP_Locale,ROW(),PP_LanguageIndex)","v":"Address of financial institution, district name"},"Address of financial institution, district name",null,null,"Bankens adresse, by",null,null,null,null,null,null,null,null,null,null,null,null,null,null,null,null,null,null,null,null,null,null,null,null,null,null,null,null,null,null,null,null,null,null,null,null,null,null,null,null,null,null,null,null,null,null,null,null,null,null,null,null,null,null,null,null,null,null,null,null,null,null,null,null,null,null,null,null,null,null,null,null,null,null,null,null,null,null,"&allowhtml=false&merge=false",{"$f":"\"pp://General Data/\"&INDEX(PP_Locale,ROW(),1)&\"?taxonomy=\"&PP_TaxonomyId&\"&labellanguage=en&period=1\"&IF(PP_Consolidated,\"_Consolidated\",\"\")&CT226","v":"pp://General Data/Address of financial institution, district name?taxonomy=DKGAAP&labellanguage=en&period=1_Consolidated&allowhtml=false&merge=false"}]
[{"$f":"\"\"&INDEX(PP_Locale,ROW(),PP_LanguageIndex)","v":"Address of financial institution, country"},null,null,null,null,"PP_AddressOfFinancialCountry",null,null,null,null,"",null,null,null,{"$f":"\"\"&INDEX(PP_Locale,ROW(),PP_LanguageIndex)","v":"Address of financial institution, country"},"Address of financial institution, country",null,null,"Bankens adresse, land",null,null,null,null,null,null,null,null,null,null,null,null,null,null,null,null,null,null,null,null,null,null,null,null,null,null,null,null,null,null,null,null,null,null,null,null,null,null,null,null,null,null,null,null,null,null,null,null,null,null,null,null,null,null,null,null,null,null,null,null,null,null,null,null,null,null,null,null,null,null,null,null,null,null,null,null,null,null,"&allowhtml=false&merge=false",{"$f":"\"pp://General Data/\"&INDEX(PP_Locale,ROW(),1)&\"?taxonomy=\"&PP_TaxonomyId&\"&labellanguage=en&period=1\"&IF(PP_Consolidated,\"_Consolidated\",\"\")&CT227","v":"pp://General Data/Address of financial institution, country?taxonomy=DKGAAP&labellanguage=en&period=1_Consolidated&allowhtml=false&merge=false"}]
[{"$f":"\"\"&INDEX(PP_Locale,ROW(),PP_LanguageIndex)","v":"Address of financial institution, country identification code"},null,null,null,null,"PP_AddressOfFinancialCountryIdentificationCode",null,null,null,null,"",null,null,null,{"$f":"\"\"&INDEX(PP_Locale,ROW(),PP_LanguageIndex)","v":"Address of financial institution, country identification code"},"Address of financial institution, country identification code",null,null,"Bankens adresse, landekode",null,null,null,null,null,null,null,null,null,null,null,null,null,null,null,null,null,null,null,null,null,null,null,null,null,null,null,null,null,null,null,null,null,null,null,null,null,null,null,null,null,null,null,null,null,null,null,null,null,null,null,null,null,null,null,null,null,null,null,null,null,null,null,null,null,null,null,null,null,null,null,null,null,null,null,null,null,null,"&allowhtml=false&merge=false",{"$f":"\"pp://General Data/\"&INDEX(PP_Locale,ROW(),1)&\"?taxonomy=\"&PP_TaxonomyId&\"&labellanguage=en&period=1\"&IF(PP_Consolidated,\"_Consolidated\",\"\")&CT228","v":"pp://General Data/Address of financial institution, country identification code?taxonomy=DKGAAP&labellanguage=en&period=1_Consolidated&allowhtml=false&merge=false"}]
[null,null,null,null,null,null,null,null,null,null,null,null,null,null,{"$f":"\"\"&INDEX(PP_Locale,ROW(),PP_LanguageIndex)","v":""}]
[{"$f":"\"\"&INDEX(PP_Locale,ROW(),PP_LanguageIndex)","v":"Law firm:"},null,null,null,null,null,null,null,null,null,null,null,null,null,{"$f":"\"\"&INDEX(PP_Locale,ROW(),PP_LanguageIndex)","v":"Law firm:"},"Law firm:",null,null,"Advokat:"]
[{"$f":"\"\"&INDEX(PP_Locale,ROW(),PP_LanguageIndex)","v":"Legal Entity Identifier [LEI] of law firm"},null,null,null,null,"PP_LegalEntityIdentifierOfLawFirm",null,null,null,null,{"$f":"\"\"&B231","v":""},null,null,null,{"$f":"\"\"&INDEX(PP_Locale,ROW(),PP_LanguageIndex)","v":"Legal Entity Identifier [LEI] of law firm"},"Legal Entity Identifier [LEI] of law firm",null,null,"Advokatens LEI-kode",null,null,null,null,null,null,null,null,null,null,null,null,null,null,null,null,null,null,null,null,null,null,null,null,null,null,null,null,null,null,null,null,null,null,null,null,null,null,null,null,null,null,null,null,null,null,null,null,null,null,null,null,null,null,null,null,null,null,null,null,null,null,null,null,null,null,null,null,null,null,null,null,null,null,null,null,null,null,"&allowhtml=false&merge=false&skipspace=true",{"$f":"\"pp://General Data/\"&INDEX(PP_Locale,ROW(),1)&\"?taxonomy=\"&PP_TaxonomyId&\"&labellanguage=en&period=1\"&IF(PP_Consolidated,\"_Consolidated\",\"\")&CT231","v":"pp://General Data/Legal Entity Identifier [LEI] of law firm?taxonomy=DKGAAP&labellanguage=en&period=1_Consolidated&allowhtml=false&merge=false&skipspace=true"}]
[{"$f":"\"\"&INDEX(PP_Locale,ROW(),PP_LanguageIndex)","v":"Identification number [CVR] of law firm"},null,null,null,null,"PP_IdentificationNumberCvrOfLawFirm",null,null,null,null,{"$f":"\"\"&SUBSTITUTE(B232,\" \",\"\")","v":""},null,null,null,{"$f":"\"\"&INDEX(PP_Locale,ROW(),PP_LanguageIndex)","v":"Identification number [CVR] of law firm"},"Identification number [CVR] of law firm",null,null,"Advokatens CVR-nr.",null,null,null,null,null,null,null,null,null,null,null,null,null,null,null,null,null,null,null,null,null,null,null,null,null,null,null,null,null,null,null,null,null,null,null,null,null,null,null,null,null,null,null,null,null,null,null,null,null,null,null,null,null,null,null,null,null,null,null,null,null,null,null,null,null,null,null,null,null,null,null,null,null,null,null,null,null,null,"&allowhtml=false&merge=false&skipspace=true",{"$f":"\"pp://General Data/\"&INDEX(PP_Locale,ROW(),1)&\"?taxonomy=\"&PP_TaxonomyId&\"&labellanguage=en&period=1\"&IF(PP_Consolidated,\"_Consolidated\",\"\")&CT232","v":"pp://General Data/Identification number [CVR] of law firm?taxonomy=DKGAAP&labellanguage=en&period=1_Consolidated&allowhtml=false&merge=false&skipspace=true"}]
[{"$f":"\"\"&INDEX(PP_Locale,ROW(),PP_LanguageIndex)","v":"Identification number [PNR] of law firm"},null,null,null,null,"PP_IdentificationNumberPnrOfLawFirm",null,null,null,null,{"$f":"\"\"&SUBSTITUTE(B233,\"-\",\"\")","v":""},null,null,null,{"$f":"\"\"&INDEX(PP_Locale,ROW(),PP_LanguageIndex)","v":"Identification number [PNR] of law firm"},"Identification number [PNR] of law firm",null,null,"Advokatens P-nr.",null,null,null,null,null,null,null,null,null,null,null,null,null,null,null,null,null,null,null,null,null,null,null,null,null,null,null,null,null,null,null,null,null,null,null,null,null,null,null,null,null,null,null,null,null,null,null,null,null,null,null,null,null,null,null,null,null,null,null,null,null,null,null,null,null,null,null,null,null,null,null,null,null,null,null,null,null,null,"&allowhtml=false&merge=false",{"$f":"\"pp://General Data/\"&INDEX(PP_Locale,ROW(),1)&\"?taxonomy=\"&PP_TaxonomyId&\"&labellanguage=en&period=1\"&IF(PP_Consolidated,\"_Consolidated\",\"\")&CT233","v":"pp://General Data/Identification number [PNR] of law firm?taxonomy=DKGAAP&labellanguage=en&period=1_Consolidated&allowhtml=false&merge=false"}]
[{"$f":"\"\"&INDEX(PP_Locale,ROW(),PP_LanguageIndex)","v":"Name of law firm"},null,null,null,null,"PP_NameOfLawFirm",null,null,null,null,{"$f":"\"\"&B234","v":""},null,null,null,{"$f":"\"\"&INDEX(PP_Locale,ROW(),PP_LanguageIndex)","v":"Name of law firm"},"Name of law firm",null,null,"Advokatens navn",null,null,null,null,null,null,null,null,null,null,null,null,null,null,null,null,null,null,null,null,null,null,null,null,null,null,null,null,null,null,null,null,null,null,null,null,null,null,null,null,null,null,null,null,null,null,null,null,null,null,null,null,null,null,null,null,null,null,null,null,null,null,null,null,null,null,null,null,null,null,null,null,null,null,null,null,null,null,"&allowhtml=false&merge=false",{"$f":"\"pp://General Data/\"&INDEX(PP_Locale,ROW(),1)&\"?taxonomy=\"&PP_TaxonomyId&\"&labellanguage=en&period=1\"&IF(PP_Consolidated,\"_Consolidated\",\"\")&CT234","v":"pp://General Data/Name of law firm?taxonomy=DKGAAP&labellanguage=en&period=1_Consolidated&allowhtml=false&merge=false"}]
[{"$f":"\"\"&INDEX(PP_Locale,ROW(),PP_LanguageIndex)","v":"Address of law firm, street name"},null,null,null,null,"PP_AddressOfLawFirmStreetName",null,null,null,null,"",null,null,null,{"$f":"\"\"&INDEX(PP_Locale,ROW(),PP_LanguageIndex)","v":"Address of law firm, street name"},"Address of law firm, street name",null,null,"Advokatens adresse, vejnavn",null,null,null,null,null,null,null,null,null,null,null,null,null,null,null,null,null,null,null,null,null,null,null,null,null,null,null,null,null,null,null,null,null,null,null,null,null,null,null,null,null,null,null,null,null,null,null,null,null,null,null,null,null,null,null,null,null,null,null,null,null,null,null,null,null,null,null,null,null,null,null,null,null,null,null,null,null,null,"&allowhtml=false&merge=false",{"$f":"\"pp://General Data/\"&INDEX(PP_Locale,ROW(),1)&\"?taxonomy=\"&PP_TaxonomyId&\"&labellanguage=en&period=1\"&IF(PP_Consolidated,\"_Consolidated\",\"\")&CT235","v":"pp://General Data/Address of law firm, street name?taxonomy=DKGAAP&labellanguage=en&period=1_Consolidated&allowhtml=false&merge=false"}]
[{"$f":"\"\"&INDEX(PP_Locale,ROW(),PP_LanguageIndex)","v":"Address of law firm, street building identifier"},null,null,null,null,"PP_AddressOfLawFirmStreetBuildingIdentifier",null,null,null,null,"",null,null,null,{"$f":"\"\"&INDEX(PP_Locale,ROW(),PP_LanguageIndex)","v":"Address of law firm, street building identifier"},"Address of law firm, street building identifier",null,null,"Advokatens adresse, vejnr og etage",null,null,null,null,null,null,null,null,null,null,null,null,null,null,null,null,null,null,null,null,null,null,null,null,null,null,null,null,null,null,null,null,null,null,null,null,null,null,null,null,null,null,null,null,null,null,null,null,null,null,null,null,null,null,null,null,null,null,null,null,null,null,null,null,null,null,null,null,null,null,null,null,null,null,null,null,null,null,"&allowhtml=false&merge=false",{"$f":"\"pp://General Data/\"&INDEX(PP_Locale,ROW(),1)&\"?taxonomy=\"&PP_TaxonomyId&\"&labellanguage=en&period=1\"&IF(PP_Consolidated,\"_Consolidated\",\"\")&CT236","v":"pp://General Data/Address of law firm, street building identifier?taxonomy=DKGAAP&labellanguage=en&period=1_Consolidated&allowhtml=false&merge=false"}]
[{"$f":"\"\"&INDEX(PP_Locale,ROW(),PP_LanguageIndex)","v":"Address of law firm, post code identifier"},null,null,null,null,"PP_AddressOfLawFirmPostCodeIdentifier",null,null,null,null,"",null,null,null,{"$f":"\"\"&INDEX(PP_Locale,ROW(),PP_LanguageIndex)","v":"Address of law firm, post code identifier"},"Address of law firm, post code identifier",null,null,"Advokatens adresse, postnummer",null,null,null,null,null,null,null,null,null,null,null,null,null,null,null,null,null,null,null,null,null,null,null,null,null,null,null,null,null,null,null,null,null,null,null,null,null,null,null,null,null,null,null,null,null,null,null,null,null,null,null,null,null,null,null,null,null,null,null,null,null,null,null,null,null,null,null,null,null,null,null,null,null,null,null,null,null,null,"&allowhtml=false&merge=false",{"$f":"\"pp://General Data/\"&INDEX(PP_Locale,ROW(),1)&\"?taxonomy=\"&PP_TaxonomyId&\"&labellanguage=en&period=1\"&IF(PP_Consolidated,\"_Consolidated\",\"\")&CT237","v":"pp://General Data/Address of law firm, post code identifier?taxonomy=DKGAAP&labellanguage=en&period=1_Consolidated&allowhtml=false&merge=false"}]
[{"$f":"\"\"&INDEX(PP_Locale,ROW(),PP_LanguageIndex)","v":"Address of law firm, district name"},null,null,null,null,"PP_AddressOfLawFirmDistrictName",null,null,null,null,"",null,null,null,{"$f":"\"\"&INDEX(PP_Locale,ROW(),PP_LanguageIndex)","v":"Address of law firm, district name"},"Address of law firm, district name",null,null,"Advokatens adresse, by",null,null,null,null,null,null,null,null,null,null,null,null,null,null,null,null,null,null,null,null,null,null,null,null,null,null,null,null,null,null,null,null,null,null,null,null,null,null,null,null,null,null,null,null,null,null,null,null,null,null,null,null,null,null,null,null,null,null,null,null,null,null,null,null,null,null,null,null,null,null,null,null,null,null,null,null,null,null,"&allowhtml=false&merge=false",{"$f":"\"pp://General Data/\"&INDEX(PP_Locale,ROW(),1)&\"?taxonomy=\"&PP_TaxonomyId&\"&labellanguage=en&period=1\"&IF(PP_Consolidated,\"_Consolidated\",\"\")&CT238","v":"pp://General Data/Address of law firm, district name?taxonomy=DKGAAP&labellanguage=en&period=1_Consolidated&allowhtml=false&merge=false"}]
[{"$f":"\"\"&INDEX(PP_Locale,ROW(),PP_LanguageIndex)","v":"Address of law firm, country"},null,null,null,null,"PP_AddressOfLawFirmCountry",null,null,null,null,"",null,null,null,{"$f":"\"\"&INDEX(PP_Locale,ROW(),PP_LanguageIndex)","v":"Address of law firm, country"},"Address of law firm, country",null,null,"Advokatens adresse, land",null,null,null,null,null,null,null,null,null,null,null,null,null,null,null,null,null,null,null,null,null,null,null,null,null,null,null,null,null,null,null,null,null,null,null,null,null,null,null,null,null,null,null,null,null,null,null,null,null,null,null,null,null,null,null,null,null,null,null,null,null,null,null,null,null,null,null,null,null,null,null,null,null,null,null,null,null,null,"&allowhtml=false&merge=false",{"$f":"\"pp://General Data/\"&INDEX(PP_Locale,ROW(),1)&\"?taxonomy=\"&PP_TaxonomyId&\"&labellanguage=en&period=1\"&IF(PP_Consolidated,\"_Consolidated\",\"\")&CT239","v":"pp://General Data/Address of law firm, country?taxonomy=DKGAAP&labellanguage=en&period=1_Consolidated&allowhtml=false&merge=false"}]
[{"$f":"\"\"&INDEX(PP_Locale,ROW(),PP_LanguageIndex)","v":"Address of law firm, country identification code"},null,null,null,null,"PP_AddressOfLawFirmCountryIdentificationCode",null,null,null,null,"",null,null,null,{"$f":"\"\"&INDEX(PP_Locale,ROW(),PP_LanguageIndex)","v":"Address of law firm, country identification code"},"Address of law firm, country identification code",null,null,"Advokatens adresse, landekode",null,null,null,null,null,null,null,null,null,null,null,null,null,null,null,null,null,null,null,null,null,null,null,null,null,null,null,null,null,null,null,null,null,null,null,null,null,null,null,null,null,null,null,null,null,null,null,null,null,null,null,null,null,null,null,null,null,null,null,null,null,null,null,null,null,null,null,null,null,null,null,null,null,null,null,null,null,null,"&allowhtml=false&merge=false",{"$f":"\"pp://General Data/\"&INDEX(PP_Locale,ROW(),1)&\"?taxonomy=\"&PP_TaxonomyId&\"&labellanguage=en&period=1\"&IF(PP_Consolidated,\"_Consolidated\",\"\")&CT240","v":"pp://General Data/Address of law firm, country identification code?taxonomy=DKGAAP&labellanguage=en&period=1_Consolidated&allowhtml=false&merge=false"}]
[null,null,null,null,null,null,null,null,null,null,null,null,null,null,{"$f":"\"\"&IF(ISBLANK(INDEX(PP_Locale,ROW(),PP_LanguageIndex)),INDEX(PP_Locale,ROW(),1),INDEX(PP_Locale,ROW(),PP_LanguageIndex))","v":""}]
[{"$f":"\"\"&INDEX(PP_Locale,ROW(),PP_LanguageIndex)","v":"Technical information:"},null,null,null,null,null,null,null,null,null,null,null,null,null,{"$f":"\"\"&IF(ISBLANK(INDEX(PP_Locale,ROW(),PP_LanguageIndex)),INDEX(PP_Locale,ROW(),1),INDEX(PP_Locale,ROW(),PP_LanguageIndex))","v":"Technical information:"},"Technical information:",null,null,"Teknisk information:","Technische Information:",null,"Información técnica:",null,null,"Informations techniques:",null,null,"Informazioni tecniche:",null,null,null,null,null,"Specyfikacja:"]
[{"$f":"\"\"&INDEX(PP_Locale,ROW(),PP_LanguageIndex)","v":"Taxonomy"},"DK ÅRL",null,null,null,"PP_Taxonomy","DK ÅRL",null,null,null,null,null,null,null,{"$f":"\"\"&INDEX(PP_Locale,ROW(),PP_LanguageIndex)","v":"Taxonomy"},"Taxonomy",null,null,"Taksonomi","Taxonomie",null,"Taxonomía",null,null,"Taxonomie",null,null,"Tassonomia",null,null,null,null,null,"Taksonomia",null,null,null,null,null,null,null,null,null,null,null,null,null,null,null,null,null,null,null,null,null,null,null,null,null,null,null,null,null,null,null,null,null,null,null,null,null,null,null,null,"DK ÅRL","DK ÅRL 20201001","DK ÅRL 20191001","DK ÅRL 20171001"]
[{"$f":"\"\"&INDEX(PP_Locale,ROW(),PP_LanguageIndex)","v":"Taxonomy ID"},"DKGAAP",null,null,null,"PP_TaxonomyId","DKGAAP",null,null,null,null,null,null,null,{"$f":"\"\"&INDEX(PP_Locale,ROW(),PP_LanguageIndex)","v":"Taxonomy ID"},"Taxonomy ID",null,null,"Taksonomi ID"]
[{"$f":"\"\"&INDEX(PP_Locale,ROW(),PP_LanguageIndex)","v":"Taxonomy entrypoint"},{"$f":"IF(ISERROR(INDIRECT(\"'General Data ESEF'!PP_Language\")),\"Balance sheet (\"&IF(IFERROR(COUNTIF(INDIRECT(\"'Balance sheet'!A1:Z99\"),\"*Provisions(*\"),0),\"account form\",\"account by current and longterm form\")&\"), income statement (\"&IF(IFERROR(COUNTIF(INDIRECT(\"'Income statement'!A1:Z99\"),\"*by Function(*\"),0),\"by function\",\"by nature\")&\")\",\"Excluding Balance sheet and Income statement, including managements review and statistics\")","v":"Excluding Balance sheet and Income statement, including managements review and statistics"},null,null,null,"PP_TaxonomyEntrypoint",{"$f":"IF(ISERROR(INDIRECT(\"'General Data ESEF'!PP_Language\")),\"Balance sheet (\"&IF(IFERROR(COUNTIF(INDIRECT(\"'Balance sheet'!A1:Z99\"),\"*Provisions(*\"),0),\"account form\",\"account by current and longterm form\")&\"), income statement (\"&IF(IFERROR(COUNTIF(INDIRECT(\"'Income statement'!A1:Z99\"),\"*by Function(*\"),0),\"by function\",\"by nature\")&\")\",\"Excluding Balance sheet and Income statement, including managements review and statistics\")","v":"Excluding Balance sheet and Income statement, including managements review and statistics"},null,null,null,null,null,null,null,{"$f":"\"\"&INDEX(PP_Locale,ROW(),PP_LanguageIndex)","v":"Taxonomy entrypoint"},"Taxonomy entrypoint",null,null,"Taksonomi entrypoint","Einstiegspunkt",null,"Punto de acceso",null,null,"Point d'accès",null,null,"Punto d'entrata",null,null,null,null,null,"Punkt wejścia",null,null,null,null,null,null,null,null,null,null,null,null,null,null,null,null,null,null,null,null,null,null,null,null,null,null,null,null,null,null,null,null,null,null,null,null,null,null,null,null,{"$f":"IFERROR(VLOOKUP(\"Balance sheet (account form), income statement (by nature)\",PP_Locale,PP_LanguageIndex,FALSE),\"Balance sheet (account form), income statement (by nature)\")","v":"Balance sheet (account form), income statement (by nature)"},{"$f":"IFERROR(VLOOKUP(\"Balance sheet (account form), income statement (by function)\",PP_Locale,PP_LanguageIndex,FALSE),\"Balance sheet (account form), income statement (by function)\")","v":"Balance sheet (account form), income statement (by function)"},{"$f":"IFERROR(VLOOKUP(\"Balance sheet (account form by current and longterm), income statement (by nature)\",PP_Locale,PP_LanguageIndex,FALSE),\"Balance sheet (account form by current and longterm), income statement (by nature)\")","v":"Balance sheet (account form by current and longterm), income statement (by nature)"},{"$f":"IFERROR(VLOOKUP(\"Balance sheet (account form by current and longterm), income statement (by function)\",PP_Locale,PP_LanguageIndex,FALSE),\"Balance sheet (account form by current and longterm), income statement (by function)\")","v":"Balance sheet (account form by current and longterm), income statement (by function)"},{"$f":"IFERROR(VLOOKUP(\"Excluding Balance sheet and Income statement, including managements review and statistics\",PP_Locale,PP_LanguageIndex,FALSE),\"Excluding Balance sheet and Income statement, including managements review and statistics\")","v":"Excluding Balance sheet and Income statement, including managements review and statistics"}]
[{"$f":"\"\"&INDEX(PP_Locale,ROW(),PP_LanguageIndex)","v":"Identifier scheme"},{"$f":"IFERROR(INDIRECT(\"'General Data ESEF'!PP_IdentifierScheme\"),\"http://www.dcca.dk/cvr\")","v":"http://standards.iso.org/iso/17442"},null,null,null,"PP_IdentifierScheme",{"$f":"IFERROR(INDIRECT(\"'General Data ESEF'!PP_IdentifierScheme\"),\"http://www.dcca.dk/cvr\")","v":"http://standards.iso.org/iso/17442"},null,null,null,{"$f":"\"\"&B246","v":"http://standards.iso.org/iso/17442"},null,null,null,{"$f":"\"\"&INDEX(PP_Locale,ROW(),PP_LanguageIndex)","v":"Identifier scheme"},"Identifier scheme",null,null,"Identifier scheme","Identifikationsschema",null,"Esquema de identificación",null,null,"Schéma d'identification",null,null,"Schema identificativo",null,null,null,null,null,"Schemat identyfikacyjny"]
[null,null,null,null,null,null,null,null,null,null,null,null,null,null,{"$f":"\"\"&INDEX(PP_Locale,ROW(),PP_LanguageIndex)","v":""}]
[null,null,null,null,null,null,null,null,null,null,null,null,null,null,{"$f":"\"\"&INDEX(PP_Locale,ROW(),PP_LanguageIndex)","v":"Annual report"},"Annual report",null,null,"Årsrapport"]
[null,null,null,null,null,null,null,null,null,null,null,null,null,null,{"$f":"\"\"&INDEX(PP_Locale,ROW(),PP_LanguageIndex)","v":"Liquidation accounts"},"Liquidation accounts",null,null,"Likvidationsregnskab"]
[null,null,null,null,null,null,null,null,null,null,null,null,null,null,{"$f":"\"\"&INDEX(PP_Locale,ROW(),PP_LanguageIndex)","v":"Interim report (6 months)"},"Interim report (6 months)",null,null,"Halvårsrapport"]
[null,null,null,null,null,null,null,null,null,null,null,null,null,null,{"$f":"\"\"&INDEX(PP_Locale,ROW(),PP_LanguageIndex)","v":"Interim report (other than 6 months)"},"Interim report (other than 6 months)",null,null,"Delårsrapport"]
[null,null,null,null,null,null,null,null,null,null,null,null,null,null,{"$f":"\"\"&INDEX(PP_Locale,ROW(),PP_LanguageIndex)","v":"Erklæring om undtagelse fra aflæggelse årsrapport"},"Erklæring om undtagelse fra aflæggelse årsrapport",null,null,"Erklæring om undtagelse fra aflæggelse årsrapport"]
[null,null,null,null,null,null,null,null,null,null,null,null,null,null,{"$f":"\"\"&INDEX(PP_Locale,ROW(),PP_LanguageIndex)","v":"Erklæring vedr. omsætningsgrænse [Lukkelov]"},"Erklæring vedr. omsætningsgrænse [Lukkelov]",null,null,"Erklæring vedr. omsætningsgrænse [Lukkelov]"]
[null,null,null,null,null,null,null,null,null,null,null,null,null,null,{"$f":"\"\"&INDEX(PP_Locale,ROW(),PP_LanguageIndex)","v":"Auditor's report on audited financial statements"},"Auditor's report on audited financial statements",null,null,"Revisionspåtegning"]
[null,null,null,null,null,null,null,null,null,null,null,null,null,null,{"$f":"\"\"&INDEX(PP_Locale,ROW(),PP_LanguageIndex)","v":"Auditor's report on extended review"},"Auditor's report on extended review",null,null,"Erklæring om udvidet gennemgang"]
[null,null,null,null,null,null,null,null,null,null,null,null,null,null,{"$f":"\"\"&INDEX(PP_Locale,ROW(),PP_LanguageIndex)","v":"The independent auditor's reports (Review)"},"The independent auditor's reports (Review)",null,null,"Den uafhængige revisors erklæringer (review)"]
[null,null,null,null,null,null,null,null,null,null,null,null,null,null,{"$f":"\"\"&INDEX(PP_Locale,ROW(),PP_LanguageIndex)","v":"The independent auditor's reports (Other assurance Reports)"},"The independent auditor's reports (Other assurance Reports)",null,null,"Andre erklæringer med sikkerhed"]
[null,null,null,null,null,null,null,null,null,null,null,null,null,null,{"$f":"\"\"&INDEX(PP_Locale,ROW(),PP_LanguageIndex)","v":"Auditor's reports (Other non-assurance reports)"},"Auditor's reports (Other non-assurance reports)",null,null,"Andre erklæringer uden sikkerhed"]
[null,null,null,null,null,null,null,null,null,null,null,null,null,null,{"$f":"\"\"&INDEX(PP_Locale,ROW(),PP_LanguageIndex)","v":"No audit assistance"},"No audit assistance",null,null,"Ingen bistand"]
[null,null,null,null,null,null,null,null,null,null,null,null,null,null,{"$f":"\"\"&INDEX(PP_Locale,ROW(),PP_LanguageIndex)","v":"Yes"},"Yes",null,null,"Ja"]
[null,null,null,null,null,null,null,null,null,null,null,null,null,null,{"$f":"\"\"&INDEX(PP_Locale,ROW(),PP_LanguageIndex)","v":"No"},"No",null,null,"Nej"]
[null,null,null,null,null,null,null,null,null,null,null,null,null,null,{"$f":"\"\"&INDEX(PP_Locale,ROW(),PP_LanguageIndex)","v":"Basis for Opinion"},"Basis for Opinion",null,null,"Grundlag for konklusion"]
[null,null,null,null,null,null,null,null,null,null,null,null,null,null,{"$f":"\"\"&INDEX(PP_Locale,ROW(),PP_LanguageIndex)","v":"Basis for Qualified Opinion"},"Basis for Qualified Opinion",null,null,"Grundlag for konklusion med forbehold"]
[null,null,null,null,null,null,null,null,null,null,null,null,null,null,{"$f":"\"\"&INDEX(PP_Locale,ROW(),PP_LanguageIndex)","v":"Basis for Adverse Opinion"},"Basis for Adverse Opinion",null,null,"Grundlag for afkræftende konklusion"]
[null,null,null,null,null,null,null,null,null,null,null,null,null,null,{"$f":"\"\"&INDEX(PP_Locale,ROW(),PP_LanguageIndex)","v":"Basis for Disclaimer of Opinion"},"Basis for Disclaimer of Opinion",null,null,"Grundlag for manglende konklusion"]
[null,null,null,null,null,null,null,null,null,null,null,null,null,null,{"$f":"\"\"&INDEX(PP_Locale,ROW(),PP_LanguageIndex)","v":"Opinion"},"Opinion",null,null,"Konklusion"]
[null,null,null,null,null,null,null,null,null,null,null,null,null,null,{"$f":"\"\"&INDEX(PP_Locale,ROW(),PP_LanguageIndex)","v":"Qualified Opinion"},"Qualified Opinion",null,null,"Konklusion med forbehold"]
[null,null,null,null,null,null,null,null,null,null,null,null,null,null,{"$f":"\"\"&INDEX(PP_Locale,ROW(),PP_LanguageIndex)","v":"Adverse Opinion"},"Adverse Opinion",null,null,"Afkræftende konklusion"]
[null,null,null,null,null,null,null,null,null,null,null,null,null,null,{"$f":"\"\"&INDEX(PP_Locale,ROW(),PP_LanguageIndex)","v":"Disclaimer of Opinion"},"Disclaimer of Opinion",null,null,"Manglende konklusion"]
[null,null,null,null,null,null,null,null,null,null,null,null,null,null,{"$f":"\"\"&INDEX(PP_Locale,ROW(),PP_LanguageIndex)","v":"Reporting class A"},"Reporting class A",null,null,"Regnskabsklasse A"]
[null,null,null,null,null,null,null,null,null,null,null,null,null,null,{"$f":"\"\"&INDEX(PP_Locale,ROW(),PP_LanguageIndex)","v":"Reporting class B"},"Reporting class B",null,null,"Regnskabsklasse B"]
[null,null,null,null,null,null,null,null,null,null,null,null,null,null,{"$f":"\"\"&INDEX(PP_Locale,ROW(),PP_LanguageIndex)","v":"Reporting class B / micro-undertaking"},"Reporting class B / micro-undertaking",null,null,"Regnskabsklasse B / mikrovirksomhed"]
[null,null,null,null,null,null,null,null,null,null,null,null,null,null,{"$f":"\"\"&INDEX(PP_Locale,ROW(),PP_LanguageIndex)","v":"Reporting class C / medium-size enterprise"},"Reporting class C / medium-size enterprise",null,null,"Regnskabsklasse C / mellemstor virksomhed"]
[null,null,null,null,null,null,null,null,null,null,null,null,null,null,{"$f":"\"\"&INDEX(PP_Locale,ROW(),PP_LanguageIndex)","v":"Reporting class C / large enterprise"},"Reporting class C / large enterprise",null,null,"Regnskabsklasse C / stor virksomhed"]
[null,null,null,null,null,null,null,null,null,null,null,null,null,null,{"$f":"\"\"&INDEX(PP_Locale,ROW(),PP_LanguageIndex)","v":"Reporting class D"},"Reporting class D",null,null,"Regnskabsklasse D"]
[null,null,null,null,null,null,null,null,null,null,null,null,null,null,{"$f":"\"\"&INDEX(PP_Locale,ROW(),PP_LanguageIndex)","v":"UNKNOWN"},"UNKNOWN",null,null,"UKENDT"]
[null,null,null,null,null,null,null,null,null,null,null,null,null,null,{"$f":"\"\"&INDEX(PP_Locale,ROW(),PP_LanguageIndex)","v":"Type of basis for opinion on audited financial statements (audit)"},"Type of basis for opinion on audited financial statements (audit)",null,null,"Type af grundlag for konklusion (revision)"]
[null,null,null,null,null,null,null,null,null,null,null,null,null,null,{"$f":"\"\"&INDEX(PP_Locale,ROW(),PP_LanguageIndex)","v":"Type of basis for opinion on financial statements (Extended review)"},"Type of basis for opinion on financial statements (Extended review)",null,null,"Type af grundlag for konklusion (udvidet gennemgang)"]
[null,null,null,null,null,null,null,null,null,null,null,null,null,null,{"$f":"\"\"&INDEX(PP_Locale,ROW(),PP_LanguageIndex)","v":"Type of basis for conclusion on financial statements (review)"},"Type of basis for conclusion on financial statements (review)",null,null,"Type af grundlag for konklusion (review)"]
[null,null,null,null,null,null,null,null,null,null,null,null,null,null,{"$f":"\"\"&INDEX(PP_Locale,ROW(),PP_LanguageIndex)","v":"Type of opinion on audited financial statements (Audit)"},"Type of opinion on audited financial statements (Audit)",null,null,"Type af konklusion (revision)"]
[null,null,null,null,null,null,null,null,null,null,null,null,null,null,{"$f":"\"\"&INDEX(PP_Locale,ROW(),PP_LanguageIndex)","v":"Type of opinion on financial statements (Extended Review)"},"Type of opinion on financial statements (Extended Review)",null,null,"Type af konklusion (udvidet gennemgang)"]
[null,null,null,null,null,null,null,null,null,null,null,null,null,null,{"$f":"\"\"&INDEX(PP_Locale,ROW(),PP_LanguageIndex)","v":"Type of conclusion on financial statements (review)"},"Type of conclusion on financial statements (review)",null,null,"Type af konklusion (review)"]
[null,null,null,null,null,null,null,null,null,null,null,null,null,null,{"$f":"\"\"&INDEX(PP_Locale,ROW(),PP_LanguageIndex)","v":"Reporting responsibilities according to the Danish executive order on approved auditors' reports especially the criminal code and Fiscal-, tax- and subsidy legislation (Audit)"},"Reporting responsibilities according to the Danish executive order on approved auditors' reports especially the criminal code and Fiscal-, tax- and subsidy legislation (Audit)",null,null,"Erklæringsforpligtelser i henhold til erklæringsbekendtgørelsen, herunder særligt straffeloven samt skatte-, afgifts- og tilskudslovgivningen (revision)"]
[null,null,null,null,null,null,null,null,null,null,null,null,null,null,{"$f":"\"\"&INDEX(PP_Locale,ROW(),PP_LanguageIndex)","v":"Reporting responsibilities according to the Danish executive order on approved auditors' reports especially the criminal code and Fiscal-, tax- and subsidy legislation (Extended review)"},"Reporting responsibilities according to the Danish executive order on approved auditors' reports especially the criminal code and Fiscal-, tax- and subsidy legislation (Extended review)",null,null,"Erklæringsforpligtelser i henhold til erklæringsbekendtgørelsen, herunder særligt straffeloven samt skatte-, afgifts- og tilskudslovgivningen (udvidet gennemgang)"]
[null,null,null,null,null,null,null,null,null,null,null,null,null,null,{"$f":"\"\"&INDEX(PP_Locale,ROW(),PP_LanguageIndex)","v":"Reporting responsibilities according to the Danish executive order on approved auditors' reports especially the companies act or equivalent legislation, that the company is subject to (Audit)"},"Reporting responsibilities according to the Danish executive order on approved auditors' reports especially the companies act or equivalent legislation, that the company is subject to (Audit)",null,null,"Erklæringsforpligtelser i henhold til erklæringsbekendtgørelsen, herunder særligt den for virksomheden fastsatte selskabsretlige eller tilsvarende lovgivning (revision)"]
[null,null,null,null,null,null,null,null,null,null,null,null,null,null,{"$f":"\"\"&INDEX(PP_Locale,ROW(),PP_LanguageIndex)","v":"Reporting responsibilities according to the Danish executive order on approved auditors' reports especially the companies act or equivalent legislation, that the company is subject to (Extended review)"},"Reporting responsibilities according to the Danish executive order on approved auditors' reports especially the companies act or equivalent legislation, that the company is subject to (Extended review)",null,null,"Erklæringsforpligtelser i henhold til erklæringsbekendtgørelsen, herunder særligt den for virksomheden fastsatte selskabsretlige eller tilsvarende lovgivning (udvidet gennemgang)"]
[null,null,null,null,null,null,null,null,null,null,null,null,null,null,{"$f":"\"\"&INDEX(PP_Locale,ROW(),PP_LanguageIndex)","v":"Reporting responsibilities according to the Danish executive order on approved auditors' reports especially legislation on financial reporting, including accounting and storage of accounting records (Audit)"},"Reporting responsibilities according to the Danish executive order on approved auditors' reports especially legislation on financial reporting, including accounting and storage of accounting records (Audit)",null,null,"Erklæringsforpligtelser i henhold til erklæringsbekendtgørelsen, herunder særligt lovgivningen om regnskabsaflæggelse, herunder om bogføring og bevaring af regnskabsmateriale (revision)"]
[null,null,null,null,null,null,null,null,null,null,null,null,null,null,{"$f":"\"\"&INDEX(PP_Locale,ROW(),PP_LanguageIndex)","v":"Reporting responsibilities according to the Danish executive order on approved auditors' reports especially legislation on financial reporting, including accounting and storage of accounting records (Extended review)"},"Reporting responsibilities according to the Danish executive order on approved auditors' reports especially legislation on financial reporting, including accounting and storage of accounting records (Extended review)",null,null,"Erklæringsforpligtelser i henhold til erklæringsbekendtgørelsen, herunder særligt lovgivningen om regnskabsaflæggelse, herunder om bogføring og bevaring af regnskabsmateriale (udvidet gennemgang)"]
[null,null,null,null,null,null,null,null,null,null,null,null,null,null,{"$f":"\"\"&INDEX(PP_Locale,ROW(),PP_LanguageIndex)","v":"Reporting responsibilities according to the Danish executive order on approved auditors' reports especially other matters (Audit)"},"Reporting responsibilities according to the Danish executive order on approved auditors' reports especially other matters (Audit)",null,null,"Erklæringsforpligtelser i henhold til erklæringsbekendtgørelsen, herunder særligt andre forhold (revision)"]
[null,null,null,null,null,null,null,null,null,null,null,null,null,null,{"$f":"\"\"&INDEX(PP_Locale,ROW(),PP_LanguageIndex)","v":"Reporting responsibilities according to the Danish executive order on approved auditors' reports especially other matters (Extended review)"},"Reporting responsibilities according to the Danish executive order on approved auditors' reports especially other matters (Extended review)",null,null,"Erklæringsforpligtelser i henhold til erklæringsbekendtgørelsen, herunder særligt andre forhold (udvidet gennemgang)"]
[null,null,null,null,null,null,null,null,null,null,null,null,null,null,{"$f":"\"\"&INDEX(PP_Locale,ROW(),PP_LanguageIndex)","v":"Balance sheet (account form), income statement (by nature)"},"Balance sheet (account form), income statement (by nature)",null,null,"Balance (kontoform), resultatopgørelse (artsopdelt)"]
[null,null,null,null,null,null,null,null,null,null,null,null,null,null,{"$f":"\"\"&INDEX(PP_Locale,ROW(),PP_LanguageIndex)","v":"Balance sheet (account form), income statement (by function)"},"Balance sheet (account form), income statement (by function)",null,null,"Balance (kontoform), resultatopgørelse (funktionsopdelt)"]
[null,null,null,null,null,null,null,null,null,null,null,null,null,null,{"$f":"\"\"&INDEX(PP_Locale,ROW(),PP_LanguageIndex)","v":"Balance sheet (account form by current and longterm), income statement (by nature)"},"Balance sheet (account form by current and longterm), income statement (by nature)",null,null,"Balance (kontoform fordelt på kort- og langfristet), resultatopgørelse (artsopdelt)"]
[null,null,null,null,null,null,null,null,null,null,null,null,null,null,{"$f":"\"\"&INDEX(PP_Locale,ROW(),PP_LanguageIndex)","v":"Balance sheet (account form by current and longterm), income statement (by function)"},"Balance sheet (account form by current and longterm), income statement (by function)",null,null,"Balance (kontoform fordelt på kort- og langfristet), resultatopgørelse (funktionsopdelt)"]
[null,null,null,null,null,null,null,null,null,null,null,null,null,null,{"$f":"\"\"&INDEX(PP_Locale,ROW(),PP_LanguageIndex)","v":"Excluding Balance sheet and Income statement, including managements review and statistics"},"Excluding Balance sheet and Income statement, including managements review and statistics",null,null,"Uden Balance og Resultatopgørelse"]
[null,null,null,null,null,null,null,null,null,null,null,null,null,null,{"$f":"\"\"&INDEX(PP_Locale,ROW(),PP_LanguageIndex)","v":"Current period"},"Current period",null,null,"Aktuel periode"]
[null,null,null,null,null,null,null,null,null,null,null,null,null,null,{"$f":"\"\"&INDEX(PP_Locale,ROW(),PP_LanguageIndex)","v":"Previous period"},"Previous period",null,null,"Foregående periode"]
[null,null,null,null,null,null,null,null,null,null,null,null,null,null,{"$f":"\"\"&INDEX(PP_Locale,ROW(),PP_LanguageIndex)","v":"Group"},"Group",null,null,"Koncern"]
[null,null,null,null,null,null,null,null,null,null,null,null,null,null,{"$f":"\"\"&INDEX(PP_Locale,ROW(),PP_LanguageIndex)","v":"Parent"},"Parent",null,null,"Moder"]
[null,null,null,null,null,null,null,null,null,null,null,null,null,null,{"$f":"\"\"&INDEX(PP_Locale,ROW(),PP_LanguageIndex)","v":"Test customer"},"Test customer",null,null,"Test kunde","Kunden testen",null,"Cliente de prueba",null,null,"Test client",null,null,"Cliente di prova",null,null,null,null,null,"Klient testowy"]
[null,null,null,null,null,null,null,null,null,null,null,null,null,null,"Periode","Period",null,null,"Periode","Zeitraum",null,"Periodo",null,null,"Période",null,null,"Periodo",null,null,null,null,null,"Okres"]

{"sheet":"DKGAAP hypertags","index":3,"n_rows":31,"n_cols":5,"rows_kept":31,"cut":false,"hidden":false,"merged":[]}
["Comment","Applies to","Label","Hypertag properties","Hypertag"]
[]
[null,"Managements review - ONLY APPLICABLE FOR HYPERTAGGING IF NO LINK TO FULL REPORT IS SUPPLIED IN GENERAL DATA \"Link to...\" FIELDS"]
["(Årsregnskabsloven paragraph 107b)","Corporate Governance","Other statements/Corporate governance report","&allowhtml=true&merge=true",{"$f":"\"pp://\"&C4&\"?taxonomy=\"&IFERROR(INDIRECT(\"'General data DKGAAP'!PP_TaxonomyId\"),\"DKGAAP\")&\"&labellanguage=en&period=1\"&D4","v":"pp://Other statements/Corporate governance report?taxonomy=DKGAAP&labellanguage=en&period=1&allowhtml=true&merge=true"}]
["(Årsregnskabsloven paragraph 99a)","Corporate Social Responsibility","Other statements/Statement of corporate social responsibility","&allowhtml=true&merge=true",{"$f":"\"pp://\"&C5&\"?taxonomy=\"&IFERROR(INDIRECT(\"'General data DKGAAP'!PP_TaxonomyId\"),\"DKGAAP\")&\"&labellanguage=en&period=1\"&D5","v":"pp://Other statements/Statement of corporate social responsibility?taxonomy=DKGAAP&labellanguage=en&period=1&allowhtml=true&merge=true"}]
["(Årsregnskabsloven paragraph 99b)","Target figures and policies for the underrepresented gender","Other statements/Statement of target figures and policies for the underrepresented gender","&allowhtml=true&merge=true",{"$f":"\"pp://\"&C6&\"?taxonomy=\"&IFERROR(INDIRECT(\"'General data DKGAAP'!PP_TaxonomyId\"),\"DKGAAP\")&\"&labellanguage=en&period=1\"&D6","v":"pp://Other statements/Statement of target figures and policies for the underrepresented gender?taxonomy=DKGAAP&labellanguage=en&period=1&allowhtml=true&merge=true"}]
["(Årsregnskabsloven paragraph 99c)","Payments to authorities","Other statements/Report on payments to authorities","&allowhtml=true&merge=true",{"$f":"\"pp://\"&C7&\"?taxonomy=\"&IFERROR(INDIRECT(\"'General data DKGAAP'!PP_TaxonomyId\"),\"DKGAAP\")&\"&labellanguage=en&period=1\"&D7","v":"pp://Other statements/Report on payments to authorities?taxonomy=DKGAAP&labellanguage=en&period=1&allowhtml=true&merge=true"}]
["(Årsregnskabsloven paragraph 107d)","Diversity policies","Other statements/Statement of the diversity policies","&allowhtml=true&merge=true",{"$f":"\"pp://\"&C8&\"?taxonomy=\"&IFERROR(INDIRECT(\"'General data DKGAAP'!PP_TaxonomyId\"),\"DKGAAP\")&\"&labellanguage=en&period=1\"&D8","v":"pp://Other statements/Statement of the diversity policies?taxonomy=DKGAAP&labellanguage=en&period=1&allowhtml=true&merge=true"}]
[null,"Data ethics","Other statements/Statement of policy for data ethics","&allowhtml=true&merge=true",{"$f":"\"pp://\"&C9&\"?taxonomy=\"&IFERROR(INDIRECT(\"'General data DKGAAP'!PP_TaxonomyId\"),\"DKGAAP\")&\"&labellanguage=en&period=1\"&D9","v":"pp://Other statements/Statement of policy for data ethics?taxonomy=DKGAAP&labellanguage=en&period=1&allowhtml=true&merge=true"}]
[]
[null,"Statement by executive and supervisory boards"]
["(optional - but required by PwC Denmark)","Management statement","Other statements/Statement by executive and supervisory boards","&allowhtml=true&merge=true",{"$f":"\"pp://\"&C12&\"?taxonomy=\"&IFERROR(INDIRECT(\"'General data DKGAAP'!PP_TaxonomyId\"),\"DKGAAP\")&\"&labellanguage=en&period=1\"&D12","v":"pp://Other statements/Statement by executive and supervisory boards?taxonomy=DKGAAP&labellanguage=en&period=1&allowhtml=true&merge=true"}]
[]
[null,"Auditors report"]
[null,"Auditors report - \"To the shareholders of…\"","Auditors report/Addressee","&allowhtml=true&merge=true",{"$f":"\"pp://\"&C15&\"?taxonomy=\"&IFERROR(INDIRECT(\"'General data DKGAAP'!PP_TaxonomyId\"),\"DKGAAP\")&\"&labellanguage=en&period=1\"&D15","v":"pp://Auditors report/Addressee?taxonomy=DKGAAP&labellanguage=en&period=1&allowhtml=true&merge=true"}]
[null,"Auditors report - Opinion","Auditors report/Opinion","&allowhtml=true&merge=true",{"$f":"\"pp://\"&C16&\"?taxonomy=\"&IFERROR(INDIRECT(\"'General data DKGAAP'!PP_TaxonomyId\"),\"DKGAAP\")&\"&labellanguage=en&period=1\"&D16","v":"pp://Auditors report/Opinion?taxonomy=DKGAAP&labellanguage=en&period=1&allowhtml=true&merge=true"}]
["(rarely used)","Auditors report - Statement whether qualifications of audited financial statements are of such decisive importance that annual general meeting should not approve financial statements","Auditors report/Statement whether qualifications of audited financial statements are of such decisive importance that annual general meeting should not approve financial statements","&allowhtml=true&merge=true",{"$f":"\"pp://\"&C17&\"?taxonomy=\"&IFERROR(INDIRECT(\"'General data DKGAAP'!PP_TaxonomyId\"),\"DKGAAP\")&\"&labellanguage=en&period=1\"&D17","v":"pp://Auditors report/Statement whether qualifications of audited financial statements are of such decisive importance that annual general meeting should not approve financial statements?taxonomy=DKGAAP&labellanguage=en&period=1&allowhtml=true&merge=true"}]
[null,"Auditors report - Basis for opinion","Auditors report/Basis for opinion","&allowhtml=true&merge=true",{"$f":"\"pp://\"&C18&\"?taxonomy=\"&IFERROR(INDIRECT(\"'General data DKGAAP'!PP_TaxonomyId\"),\"DKGAAP\")&\"&labellanguage=en&period=1\"&D18","v":"pp://Auditors report/Basis for opinion?taxonomy=DKGAAP&labellanguage=en&period=1&allowhtml=true&merge=true"}]
["(rarely used)","Auditors report - Material uncertainty concerning going concern","Auditors report/Material uncertainty concerning going concern","&allowhtml=true&merge=true",{"$f":"\"pp://\"&C19&\"?taxonomy=\"&IFERROR(INDIRECT(\"'General data DKGAAP'!PP_TaxonomyId\"),\"DKGAAP\")&\"&labellanguage=en&period=1\"&D19","v":"pp://Auditors report/Material uncertainty concerning going concern?taxonomy=DKGAAP&labellanguage=en&period=1&allowhtml=true&merge=true"}]
["(rarely used)","Auditors report - Emphasis of matter","Auditors report/Emphasis of matter","&allowhtml=true&merge=true",{"$f":"\"pp://\"&C20&\"?taxonomy=\"&IFERROR(INDIRECT(\"'General data DKGAAP'!PP_TaxonomyId\"),\"DKGAAP\")&\"&labellanguage=en&period=1\"&D20","v":"pp://Auditors report/Emphasis of matter?taxonomy=DKGAAP&labellanguage=en&period=1&allowhtml=true&merge=true"}]
[null,"Auditors report - Key audit matters","Auditors report/Key audit matters","&allowhtml=true&merge=true",{"$f":"\"pp://\"&C21&\"?taxonomy=\"&IFERROR(INDIRECT(\"'General data DKGAAP'!PP_TaxonomyId\"),\"DKGAAP\")&\"&labellanguage=en&period=1\"&D21","v":"pp://Auditors report/Key audit matters?taxonomy=DKGAAP&labellanguage=en&period=1&allowhtml=true&merge=true"}]
["(rarely used)","Auditors report - Other matter","Auditors report/Other matter","&allowhtml=true&merge=true",{"$f":"\"pp://\"&C22&\"?taxonomy=\"&IFERROR(INDIRECT(\"'General data DKGAAP'!PP_TaxonomyId\"),\"DKGAAP\")&\"&labellanguage=en&period=1\"&D22","v":"pp://Auditors report/Other matter?taxonomy=DKGAAP&labellanguage=en&period=1&allowhtml=true&merge=true"}]
[null,"Auditors report - Statement on management's review","Auditors report/Statement on management's review","&allowhtml=true&merge=true",{"$f":"\"pp://\"&C23&\"?taxonomy=\"&IFERROR(INDIRECT(\"'General data DKGAAP'!PP_TaxonomyId\"),\"DKGAAP\")&\"&labellanguage=en&period=1\"&D23","v":"pp://Auditors report/Statement on management's review?taxonomy=DKGAAP&labellanguage=en&period=1&allowhtml=true&merge=true"}]
["(rarely used)","Auditors report - Statement on other information","Auditors report/Statement on other information","&allowhtml=true&merge=true",{"$f":"\"pp://\"&C24&\"?taxonomy=\"&IFERROR(INDIRECT(\"'General data DKGAAP'!PP_TaxonomyId\"),\"DKGAAP\")&\"&labellanguage=en&period=1\"&D24","v":"pp://Auditors report/Statement on other information?taxonomy=DKGAAP&labellanguage=en&period=1&allowhtml=true&merge=true"}]
[null,"Auditors report - Statement on management's responsibility","Auditors report/Statement of executive and supervisory board's responsibility","&allowhtml=true&merge=true",{"$f":"\"pp://\"&C25&\"?taxonomy=\"&IFERROR(INDIRECT(\"'General data DKGAAP'!PP_TaxonomyId\"),\"DKGAAP\")&\"&labellanguage=en&period=1\"&D25","v":"pp://Auditors report/Statement of executive and supervisory board's responsibility?taxonomy=DKGAAP&labellanguage=en&period=1&allowhtml=true&merge=true"}]
[null,"Auditors report - Statement on auditor's responsibility","Auditors report/Statement of auditor's responsibility","&allowhtml=true&merge=true",{"$f":"\"pp://\"&C26&\"?taxonomy=\"&IFERROR(INDIRECT(\"'General data DKGAAP'!PP_TaxonomyId\"),\"DKGAAP\")&\"&labellanguage=en&period=1\"&D26","v":"pp://Auditors report/Statement of auditor's responsibility?taxonomy=DKGAAP&labellanguage=en&period=1&allowhtml=true&merge=true"}]
[null,"Auditors report - Report on compliance with the ESEF regulation","Auditors report/Auditors report on XBRL-tagging","&allowhtml=true&merge=true",{"$f":"\"pp://\"&C27&\"?taxonomy=\"&IFERROR(INDIRECT(\"'General data DKGAAP'!PP_TaxonomyId\"),\"DKGAAP\")&\"&labellanguage=en&period=1\"&D27","v":"pp://Auditors report/Auditors report on XBRL-tagging?taxonomy=DKGAAP&labellanguage=en&period=1&allowhtml=true&merge=true"}]
[]
[null,"ONLY FOR FOUNDATIONS - ONLY APPLICABLE FOR HYPERTAGGING IF NO LINK TO FULL REPORT IS SUPPLIED IN GENERAL DATA \"Link to...\" FIELDS"]
["(Årsregnskabsloven paragraph 77a)","Good management for foundations","Other statements/Statement of good management concerning foundation","&allowhtml=true&merge=true",{"$f":"\"pp://\"&C30&\"?taxonomy=\"&IFERROR(INDIRECT(\"'General data DKGAAP'!PP_TaxonomyId\"),\"DKGAAP\")&\"&labellanguage=en&period=1\"&D30","v":"pp://Other statements/Statement of good management concerning foundation?taxonomy=DKGAAP&labellanguage=en&period=1&allowhtml=true&merge=true"}]
["(Årsregnskabsloven paragraph 77b)","Distribution policies for foundations","Other statements/Statement of the foundation's distribution policy","&allowhtml=true&merge=true",{"$f":"\"pp://\"&C31&\"?taxonomy=\"&IFERROR(INDIRECT(\"'General data DKGAAP'!PP_TaxonomyId\"),\"DKGAAP\")&\"&labellanguage=en&period=1\"&D31","v":"pp://Other statements/Statement of the foundation's distribution policy?taxonomy=DKGAAP&labellanguage=en&period=1&allowhtml=true&merge=true"}]

{"sheet":"General data DKIFRS","index":4,"n_rows":322,"n_cols":99,"rows_kept":322,"cut":false,"hidden":false,"merged":[[256,1,256,4],[257,1,257,4],[251,1,251,4],[254,1,254,4],[255,1,255,4],[244,1,244,4],[245,1,245,4],[246,1,246,4],[247,1,247,4],[248,1,248,4],[252,1,252,4],[249,1,249,4],[250,1,250,4],[253,1,253,4],[236,1,236,4],[243,1,243,4],[230,1,230,4],[231,1,231,4],[232,1,232,4],[233,1,233,4],[234,1,234,4],[235,1,235,4],[222,1,222,4],[223,1,223,4],[224,1,224,4],[227,1,227,4],[228,1,228,4],[229,1,229,4],[216,1,216,4],[217,1,217,4],[218,1,218,4],[219,1,219,4],[220,1,220,4],[221,1,221,4],[206,1,206,4],[207,1,207,4],[208,1,208,4],[209,1,209,4],[212,1,212,4],[213,1,213,4],[199,1,199,4],[200,1,200,4],[201,1,201,4],[203,1,203,4],[204,1,204,4],[205,1,205,4],[191,1,191,4],[192,1,192,4],[195,1,195,4],[196,1,196,4],[197,1,197,4],[198,1,198,4],[183,1,183,4],[184,1,184,4],[187,1,187,4],[188,1,188,4],[189,1,189,4],[190,1,190,4],[177,1,177,4],[178,1,178,4],[179,1,179,4],[180,1,180,4],[181,1,181,4],[182,1,182,4],[171,1,171,4],[172,1,172,4],[173,1,173,4],[174,1,174,4],[175,1,175,4],[176,1,176,4],[163,1,163,4],[164,1,164,4],[165,1,165,4],[166,1,166,4],[167,1,167,4],[170,1,170,4],[157,1,157,4],[158,1,158,4],[159,1,159,4],[160,1,160,4],[161,1,161,4],[162,1,162,4],[149,1,149,4],[150,1,150,4],[153,1,153,4],[154,1,154,4],[155,1,155,4],[156,1,156,4],[139,1,139,4],[140,1,140,4],[143,1,143,4],[144,1,144,4],[145,1,145,4],[146,1,146,4],[129,1,129,4],[132,1,132,4],[133,1,133,4],[134,1,134,4],[135,1,135,4],[136,1,136,4],[123,1,123,4],[124,1,124,4],[125,1,125,4],[126,1,126,4],[127,1,127,4],[128,1,128,4],[117,1,117,4],[118,1,118,4],[119,1,119,4],[120,1,120,4],[121,1,121,4],[122,1,122,4],[111,1,111,4],[112,1,112,4],[113,1,113,4],[114,1,114,4],[115,1,115,4],[116,1,116,4],[105,1,105,4],[106,1,106,4],[107,1,107,4],[108,1,108,4],[109,1,109,4],[110,1,110,4],[99,1,99,4],[100,1,100,4],[101,1,101,4],[102,1,102,4],[103,1,103,4],[104,1,104,4],[93,1,93,4],[94,1,94,4],[95,1,95,4],[96,1,96,4],[97,1,97,4],[98,1,98,4],[85,1,85,4],[86,1,86,4],[87,1,87,4],[90,1,90,4],[91,1,91,4],[92,1,92,4],[79,1,79,4],[80,1,80,4],[81,1,81,4],[82,1,82,4],[83,1,83,4],[84,1,84,4],[68,1,68,4],[72,1,72,4],[73,1,73,4],[76,1,76,4],[77,1,77,4],[78,1,78,4],[62,1,62,4],[63,1,63,4],[64,1,64,4],[65,1,65,4],[66,1,66,4],[67,1,67,4],[57,1,57,4],[58,1,58,4],[59,1,59,4],[60,1,60,4],[61,1,61,4],[50,1,50,4],[51,1,51,4],[52,1,52,4],[53,1,53,4],[54,1,54,4],[55,1,55,4],[45,1,45,4],[46,1,46,4],[47,1,47,4],[48,1,48,4],[49,1,49,4],[42,1,42,4],[43,1,43,4],[44,1,44,4],[56,1,56,4],[19,1,19,4],[32,1,32,4],[33,1,33,4],[34,1,34,4],[35,1,35,4],[36,1,36,4],[39,1,39,4],[26,1,26,4],[27,1,27,4],[28,1,28,4],[29,1,29,4],[30,1,30,4],[31,1,31,4],[12,1,12,4],[13,1,13,4],[239,1,239,4],[240,1,240,4],[241,1,241,4],[242,1,242,4],[2,1,2,4],[3,1,3,4],[4,1,4,4],[8,1,8,4],[9,1,9,4],[11,1,11,4],[10,1,10,4],[20,1,20,4],[21,1,21,4],[22,1,22,4],[23,1,23,4],[24,1,24,4],[25,1,25,4],[14,1,14,4],[15,1,15,4],[16,1,16,4],[18,1,18,2],[18,3,18,4]]}
[null,null,null,null,null,"Range name","Defaults x4 columns",null,null,null,"Adjusted values x4 columns",null,{"$f":"IFERROR(MATCH(PP_Language,PP_Languages,0),1)","v":1},{"$f":"IF(ISBLANK(INDEX(PP_Locale,2,M1)),1,M1)","v":1},"Current","EN","BG","CS","DA","DE","EL","ES","ET","FI","FR","HR","HU","IT","LT","LV","MT","NL","NO","PL","PT","RO","SK","SL","SV",{"$f":"IFERROR(MATCH(PP_CountryCode,PP_Countries,0),1)","v":9},"EU","AT","BE","BG","CH","CY","CZ","DE","DK","EE","EL","ES","FI","FR","GR","HR","HU","IE","IS","IT","LI","LT","LU","LV","MT","NL","NO","PL","PT","RO","SE","SI","SK","UK","Validation lists"]
[{"$f":"\"\"&INDEX(PP_Locale,ROW(),PP_LanguageIndex)&\" 1.0.2\"","v":"ParsePort DKIFRS general data, version 1.0.2"},null,null,null,null,null,null,null,null,null,null,null,null,null,{"$f":"\"\"&INDEX(PP_Locale,ROW(),PP_LanguageIndex)","v":"ParsePort DKIFRS general data, version"},"ParsePort DKIFRS general data, version",null,null,"ParsePort DKIFRS stamdata, version",null,null,null,null,null,null,null,null,null,null,null,null,null,null,null,null,null,null,null,null,null,null,null,null,null,null,null,null,null,null,null,null,null,null,null,null,null,null,null,null,null,null,null,null,null,null,null,null,null,null,null,null,null,null,null,null,null,null,null,null,null,null,null,null,null,null,null,null,null,null,null,null,null,null,null,null,null,null,"Hypertag properties","Hypertag:"]
[null,{"$f":"\"\"&INDEX($P3:$S3,PP_LanguageIndex)","v":"MANDATORY FIELD"},null,null,null,null,null,null,null,null,null,null,null,null,{"$f":"\"\"&INDEX(PP_Locale,ROW(),PP_LanguageIndex)","v":"MANDATORY FIELD"},"MANDATORY FIELD",null,null,"OBLIGATORISK FELT"]
[null,{"$f":"\"\"&INDEX($P4:$S4,PP_LanguageIndex)","v":"AUTOMATIC FIELD (can be overruled)"},null,null,null,null,null,null,null,null,null,null,null,null,{"$f":"\"\"&INDEX(PP_Locale,ROW(),PP_LanguageIndex)","v":"AUTOMATIC FIELD (can be overruled)"},"AUTOMATIC FIELD (can be overruled)",null,null,"AUTOMATISK FELT (kan overstyres)"]
[null,{"$f":"\"\"&INDEX($P5:$S5,PP_LanguageIndex)","v":"FILL OUT IF INFORMATION IS PRESENT IN REPORT"},null,null,null,null,null,null,null,null,null,null,null,null,{"$f":"\"\"&INDEX(PP_Locale,ROW(),PP_LanguageIndex)","v":"FILL OUT IF INFORMATION IS PRESENT IN REPORT"},"FILL OUT IF INFORMATION IS PRESENT IN REPORT",null,null,"UDFYLDES HVIS INFORMATIONEN FINDES I RAPPORTEN"]
[null,null,null,null,null,null,null,null,null,null,null,null,null,null,{"$f":"\"\"&INDEX(PP_Locale,ROW(),PP_LanguageIndex)","v":""}]
[null,{"$f":"IFERROR(VLOOKUP(\"Period\",PP_Locale,PP_LanguageIndex,FALSE),\"Period\")&\" 1\"&IF(PP_Consolidated,\" \"&IFERROR(VLOOKUP(\"Group\",PP_Locale,PP_LanguageIndex,FALSE),\"Group\"),\"\")","v":"Period 1 Group"},{"$f":"IFERROR(VLOOKUP(\"Period\",PP_Locale,PP_LanguageIndex,FALSE),\"Period\")&\" 2\"&IF(PP_Consolidated,\" \"&IFERROR(VLOOKUP(\"Group\",PP_Locale,PP_LanguageIndex,FALSE),\"Group\"),\"\")","v":"Period 2 Group"},{"$f":"IF(PP_Consolidated,IFERROR(VLOOKUP(\"Period\",PP_Locale,PP_LanguageIndex,FALSE),\"Period\")&\" 1 \"&IFERROR(VLOOKUP(\"Parent\",PP_Locale,PP_LanguageIndex,FALSE),\"Parent\"),\"\")","v":"Period 1 Parent"},{"$f":"IF(PP_Consolidated,IFERROR(VLOOKUP(\"Period\",PP_Locale,PP_LanguageIndex,FALSE),\"Period\")&\" 2 \"&IFERROR(VLOOKUP(\"Parent\",PP_Locale,PP_LanguageIndex,FALSE),\"Parent\"),\"\")","v":"Period 2 Parent"},null,{"$f":"IFERROR(VLOOKUP(\"Period\",PP_Locale,PP_LanguageIndex,FALSE),\"Period\")&\" 1\"&IF(PP_Consolidated,\" \"&IFERROR(VLOOKUP(\"Group\",PP_Locale,PP_LanguageIndex,FALSE),\"Group\"),\"\")","v":"Period 1 Group"},{"$f":"IFERROR(VLOOKUP(\"Period\",PP_Locale,PP_LanguageIndex,FALSE),\"Period\")&\" 2\"&IF(PP_Consolidated,\" \"&IFERROR(VLOOKUP(\"Group\",PP_Locale,PP_LanguageIndex,FALSE),\"Group\"),\"\")","v":"Period 2 Group"},{"$f":"IF(PP_Consolidated,IFERROR(VLOOKUP(\"Period\",PP_Locale,PP_LanguageIndex,FALSE),\"Period\")&\" 1 \"&IFERROR(VLOOKUP(\"Parent\",PP_Locale,PP_LanguageIndex,FALSE),\"Parent\"),\"\")","v":"Period 1 Parent"},{"$f":"IF(PP_Consolidated,IFERROR(VLOOKUP(\"Period\",PP_Locale,PP_LanguageIndex,FALSE),\"Period\")&\" 2 \"&IFERROR(VLOOKUP(\"Parent\",PP_Locale,PP_LanguageIndex,FALSE),\"Parent\"),\"\")","v":"Period 2 Parent"},{"$f":"B7","v":"Period 1 Group"},{"$f":"C7","v":"Period 2 Group"},"Period 1 Parent","Period 2 Parent",{"$f":"\"\"&INDEX(PP_Locale,ROW(),PP_LanguageIndex)","v":""}]
[{"$f":"\"\"&INDEX(PP_Locale,ROW(),PP_LanguageIndex)","v":"General:"},null,null,null,null,null,null,null,null,null,null,null,null,null,{"$f":"\"\"&INDEX(PP_Locale,ROW(),PP_LanguageIndex)","v":"General:"},"General:",null,null,"Generelt:",null,null,null,null,null,null,null,null,null,null,null,null,null,null,null,null,null,null,null,null,null,null,null,null,null,null,null,null,null,null,null,null,null,null,null,null,null,null,null,null,null,null,null,null,null,null,null,null,null,null,null,null,null,null,null,{"$f":"SUBSTITUTE(\"/General data \"&PP_TaxonomyId&\"(headers=\"&CELL(\"address\",$K$7)&\":\"&CELL(\"address\",$N$7)&\"[language=\"&LOWER(INDEX(PP_Languages,0,PP_LanguageIndex))&\"],labels=\"&CELL(\"address\",A8)&\":\"&CELL(\"address\",A259)&\"[language=\"&LOWER(INDEX(PP_Languages,0,PP_LanguageIndex))&\"],values=\"&CELL(\"address\",K8)&\":\"&CELL(\"address\",N259)&\"[language=\"&LOWER(PP_Language)&\"])\",\"$\",\"\")","v":"/General data DKIFRS(headers=K7:N7[language=en],labels=A8:A259[language=en],values=K8:N259[language=en])"}]
[{"$f":"\"\"&INDEX(PP_Locale,ROW(),PP_LanguageIndex)","v":"Report language code"},"EN",null,null,null,"PP_Language","DA",null,null,null,null,null,null,null,{"$f":"\"\"&INDEX(PP_Locale,ROW(),PP_LanguageIndex)","v":"Report language code"},"Report language code",null,null,"Rapport sprogkode","Bericht Sprachcode",null,"Código de lenguaje",null,null,"Code de langue",null,null,"Codice lingua",null,null,null,null,null,"Kod języka"]
[{"$f":"\"\"&INDEX(PP_Locale,ROW(),PP_LanguageIndex)","v":"Label language code"},{"$f":"PP_Language","v":"EN"},{"$f":"PP_Language","v":"EN"},{"$f":"PP_Language","v":"EN"},{"$f":"PP_Language","v":"EN"},"PP_LabelLanguage",{"$f":"PP_Language","v":"EN"},null,null,null,null,null,null,null,{"$f":"\"\"&INDEX(PP_Locale,ROW(),PP_LanguageIndex)","v":"Label language code"},"Label language code",null,null,"Label sprogkode","Tag-Sprachcode",null,"Código de lenguaje de la etiqueta",null,null,"Code de langue de l'étiquette",null,null,"Codice lingua etichetta",null,null,null,null,null,"Kod języka etykiety"]
[{"$f":"\"\"&INDEX(PP_Locale,ROW(),PP_LanguageIndex)","v":"Country code"},"DK",null,null,null,"PP_CountryCode","DK",null,null,null,null,null,null,null,{"$f":"\"\"&INDEX(PP_Locale,ROW(),PP_LanguageIndex)","v":"Country code"},"Country code",null,null,"Landekode","Landesvorwahl",null,"Código de país",null,null,"Code postal",null,null,"Prefisso internazionale",null,null,null,null,null,"Kod pocztowy"]
[{"$f":"\"\"&INDEX(PP_Locale,ROW(),PP_LanguageIndex)","v":"Currency code"},"DKK",null,null,null,"PP_Currency","DKK",null,null,null,{"$f":"\"\"&UPPER(B12)","v":"DKK"},null,null,null,{"$f":"\"\"&INDEX(PP_Locale,ROW(),PP_LanguageIndex)","v":"Currency code"},"Currency code",null,null,"Valutakode","Währungscode",null,"Código de moneda",null,null,"Code devise",null,null,"Codice valuta",null,null,null,null,null,"Kod waluty"]
[{"$f":"\"\"&INDEX(PP_Locale,ROW(),PP_LanguageIndex)","v":"Scale"},0,null,null,null,"PP_MonetaryScaling",0,null,null,null,null,null,null,null,{"$f":"\"\"&INDEX(PP_Locale,ROW(),PP_LanguageIndex)","v":"Scale"},"Scale",null,null,"Skalering","Skalierung",null,"Redondeo",null,null,"Mise à l'échelle",null,null,"Ridimensionamento",null,null,null,null,null,"Skalowanie",null,null,null,null,null,null,null,null,null,null,null,null,null,null,null,null,null,null,null,null,null,null,null,null,null,null,null,null,null,null,null,null,null,null,null,null,null,null,null,null,0,3,6,9]
[{"$f":"\"\"&INDEX(PP_Locale,ROW(),PP_LanguageIndex)","v":"Consolidated"},true,null,null,null,"PP_Consolidated",false,null,null,null,null,null,null,null,{"$f":"\"\"&INDEX(PP_Locale,ROW(),PP_LanguageIndex)","v":"Consolidated"},"Consolidated",null,null,"Koncern",null,null,null,null,null,null,null,null,null,null,null,null,null,null,null,null,null,null,null,null,null,null,null,null,null,null,null,null,null,null,null,null,null,null,null,null,null,null,null,null,null,null,null,null,null,null,null,null,null,null,null,null,null,null,null,false,true]
[{"$f":"\"\"&INDEX(PP_Locale,ROW(),PP_LanguageIndex)","v":"Report type"},{"$f":"IF(OR(EDATE(PP_Period1StartDate,3)-1=PP_Period1EndDate,EDATE(PP_Period1StartDate,9)-1=PP_Period1EndDate),IFERROR(VLOOKUP(\"Interim report (other than 6 months)\",PP_Locale,PP_LanguageIndex,FALSE),\"Interim report (other than 6 months)\"),IF(EDATE(PP_Period1StartDate,6)-1=PP_Period1EndDate,IFERROR(VLOOKUP(\"Interim report (6 months)\",PP_Locale,PP_LanguageIndex,FALSE),\"Interim report (6 months)\"),IFERROR(VLOOKUP(\"Annual report\",PP_Locale,PP_LanguageIndex,FALSE),\"Annual report\")))","v":"Annual report"},null,null,null,"PP_InformationOnTypeOfSubmittedReport",{"$f":"IF(OR(EDATE(PP_Period1StartDate,3)-1=PP_Period1EndDate,EDATE(PP_Period1StartDate,9)-1=PP_Period1EndDate),IFERROR(VLOOKUP(\"Interim report (other than 6 months)\",PP_Locale,PP_LanguageIndex,FALSE),\"Interim report (other than 6 months)\"),IF(EDATE(PP_Period1StartDate,6)-1=PP_Period1EndDate,IFERROR(VLOOKUP(\"Interim report (6 months)\",PP_Locale,PP_LanguageIndex,FALSE),\"Interim report (6 months)\"),IFERROR(VLOOKUP(\"Annual report\",PP_Locale,PP_LanguageIndex,FALSE),\"Annual report\")))","v":"Annual report"},null,null,null,{"$f":"IFERROR(VLOOKUP(PP_InformationOnTypeOfSubmittedReport,PP_Locale,IFERROR(MATCH(\"DA\",PP_Languages,0),1),FALSE),PP_InformationOnTypeOfSubmittedReport)","v":"Årsrapport"},null,null,null,{"$f":"\"\"&INDEX(PP_Locale,ROW(),PP_LanguageIndex)","v":"Report type"},"Report type",null,null,"Rapporttype",null,null,null,null,null,null,null,null,null,null,null,null,null,null,null,null,null,null,null,null,null,null,null,null,null,null,null,null,null,null,null,null,null,null,null,null,null,null,null,null,null,null,null,null,null,null,null,null,null,null,null,null,null,null,null,{"$f":"IFERROR(VLOOKUP(\"Annual report\",PP_Locale,PP_LanguageIndex,FALSE),\"Annual report\")","v":"Annual report"},{"$f":"IFERROR(VLOOKUP(\"Liquidation accounts\",PP_Locale,PP_LanguageIndex,FALSE),\"Liquidation accounts\")","v":"Liquidation accounts"},{"$f":"IFERROR(VLOOKUP(\"Interim report (6 months)\",PP_Locale,PP_LanguageIndex,FALSE),\"Interim report (6 months)\")","v":"Interim report (6 months)"},{"$f":"IFERROR(VLOOKUP(\"Interim report (other than 6 months)\",PP_Locale,PP_LanguageIndex,FALSE),\"Interim report (other than 6 months)\")","v":"Interim report (other than 6 months)"}]
[{"$f":"\"\"&INDEX(PP_Locale,ROW(),PP_LanguageIndex)","v":"Type of auditor assistance"},{"$f":"IF(PP_InformationOnTypeOfSubmittedReport=VLOOKUP(\"Annual report\",PP_Locale,PP_LanguageIndex,FALSE),IFERROR(VLOOKUP(\"Auditor's report on audited financial statements\",PP_Locale,PP_LanguageIndex,FALSE),\"Auditor's report on audited financial statements\"),IFERROR(VLOOKUP(\"No audit assistance\",PP_Locale,PP_LanguageIndex,FALSE),\"No audit assistance\"))","v":"Auditor's report on audited financial statements"},null,null,null,"PP_TypeOfAuditorAssistance",{"$f":"IF(PP_InformationOnTypeOfSubmittedReport=VLOOKUP(\"Annual report\",PP_Locale,PP_LanguageIndex,FALSE),IFERROR(VLOOKUP(\"Auditor's report on audited financial statements\",PP_Locale,PP_LanguageIndex,FALSE),\"Auditor's report on audited financial statements\"),IFERROR(VLOOKUP(\"No audit assistance\",PP_Locale,PP_LanguageIndex,FALSE),\"No audit assistance\"))","v":"Auditor's report on audited financial statements"},null,null,null,{"$f":"\"\"&B16","v":"Auditor's report on audited financial statements"},null,null,null,{"$f":"\"\"&INDEX(PP_Locale,ROW(),PP_LanguageIndex)","v":"Type of auditor assistance"},"Type of auditor assistance",null,null,"Type af revisorbistand",null,null,null,null,null,null,null,null,null,null,null,null,null,null,null,null,null,null,null,null,null,null,null,null,null,null,null,null,null,null,null,null,null,null,null,null,null,null,null,null,null,null,null,null,null,null,null,null,null,null,null,null,null,null,null,{"$f":"IFERROR(VLOOKUP(\"Auditor's report on audited financial statements\",PP_Locale,PP_LanguageIndex,FALSE),\"Auditor's report on audited financial statements\")","v":"Auditor's report on audited financial statements"},{"$f":"IFERROR(VLOOKUP(\"Auditor's report on extended review\",PP_Locale,PP_LanguageIndex,FALSE),\"Auditor's report on extended review\")","v":"Auditor's report on extended review"},{"$f":"IFERROR(VLOOKUP(\"The independent auditor's reports (Review)\",PP_Locale,PP_LanguageIndex,FALSE),\"The independent auditor's reports (Review)\")","v":"The independent auditor's reports (Review)"},{"$f":"IFERROR(VLOOKUP(\"The independent auditor's reports (Other assurance Reports)\",PP_Locale,PP_LanguageIndex,FALSE),\"The independent auditor's reports (Other assurance Reports)\")","v":"The independent auditor's reports (Other assurance Reports)"},{"$f":"IFERROR(VLOOKUP(\"Auditor's reports (Other non-assurance reports)\",PP_Locale,PP_LanguageIndex,FALSE),\"Auditor's reports (Other non-assurance reports)\")","v":"Auditor's reports (Other non-assurance reports)"},{"$f":"IFERROR(VLOOKUP(\"No audit assistance\",PP_Locale,PP_LanguageIndex,FALSE),\"No audit assistance\")","v":"No audit assistance"}]
[{"$f":"\"\"&INDEX(PP_Locale,ROW(),PP_LanguageIndex)","v":"Tool for preparing the XBRL-instance document"},"ParsePort XBRL Converter",{"$f":"\"\"&LOOKUP(PP_Language,{\"DA\";\"EN\"},{\"Balance (kontoform) / resultatopgørelse (artsopdelt)\";\"Balance sheet (account form) / income statement (by nature)\"})","v":"Balance sheet (account form) / income statement (by nature)"},{"$f":"\"\"&LOOKUP(PP_Language,{\"DA\";\"EN\"},{\"Balance (kontoform) / resultatopgørelse (artsopdelt)\";\"Balance sheet (account form) / income statement (by nature)\"})","v":"Balance sheet (account form) / income statement (by nature)"},{"$f":"\"\"&LOOKUP(PP_Language,{\"DA\";\"EN\"},{\"Balance (kontoform) / resultatopgørelse (artsopdelt)\";\"Balance sheet (account form) / income statement (by nature)\"})","v":"Balance sheet (account form) / income statement (by nature)"},"PP_ToolForPreparingTheXBRLInstanceDocument","ParsePort XBRL Converter",null,null,null,{"$f":"\"\"&B17","v":"ParsePort XBRL Converter"},null,null,null,{"$f":"\"\"&INDEX(PP_Locale,ROW(),PP_LanguageIndex)","v":"Tool for preparing the XBRL-instance document"},"Tool for preparing the XBRL-instance document",null,null,"Systemværktøj til udarbejdelse af XBRL-instansen"]
[null,null,null,null,null,null,null,null,null,null,null,null,null,null,{"$f":"\"\"&INDEX(PP_Locale,ROW(),PP_LanguageIndex)","v":""}]
[{"$f":"\"\"&INDEX(PP_Locale,ROW(),PP_LanguageIndex)","v":"Dates:"},null,null,null,null,null,null,null,null,null,null,null,null,null,{"$f":"\"\"&INDEX(PP_Locale,ROW(),PP_LanguageIndex)","v":"Dates:"},"Dates:",null,null,"Datoer:"]
[{"$f":"\"\"&INDEX(PP_Locale,ROW(),PP_LanguageIndex)","v":"Start date of reporting period 1"},{"$f":"DATE(YEAR(TODAY())-1,1,1)","v":"2020-01-01"},null,null,null,"PP_Period1StartDate",{"$f":"DATE(YEAR(TODAY())-1,1,1)","v":"2020-01-01"},null,null,null,{"$f":"IF(COUNTBLANK(B20),\"\",TEXT(YEAR(B20),\"0000\")&\"-\"&TEXT(MONTH(B20),\"00\")&\"-\"&TEXT(DAY(B20),\"00\"))","v":"2020-01-01"},null,null,null,{"$f":"\"\"&INDEX(PP_Locale,ROW(),PP_LanguageIndex)","v":"Start date of reporting period 1"},"Start date of reporting period 1",null,null,"Startdato for periode 1","Startdatum des Berichtszeitraums 1",null,"Fecha de inicio del período del informe 1",null,null,"Date de début de la période de reporting 1",null,null,"Data di inizio del periodo di riferimento 1",null,null,null,null,null,"Data rozpoczęcia okresu sprawozdawczego 1"]
[{"$f":"\"\"&INDEX(PP_Locale,ROW(),PP_LanguageIndex)","v":"End date of reporting period 1"},{"$f":"DATE(YEAR(TODAY())-1,12,31)","v":"2020-12-31"},null,null,null,"PP_Period1EndDate",{"$f":"DATE(YEAR(TODAY())-1,12,31)","v":"2020-12-31"},null,null,null,{"$f":"IF(COUNTBLANK(B21),\"\",TEXT(YEAR(B21),\"0000\")&\"-\"&TEXT(MONTH(B21),\"00\")&\"-\"&TEXT(DAY(B21),\"00\"))","v":"2020-12-31"},null,null,null,{"$f":"\"\"&INDEX(PP_Locale,ROW(),PP_LanguageIndex)","v":"End date of reporting period 1"},"End date of reporting period 1",null,null,"Slutdato for periode 1","Enddatum des Berichtszeitraums 1",null,"Fecha final del período del informe 1",null,null,"Date de fin de la période de reporting 1",null,null,"Data di fine del periodo di riferimento 1",null,null,null,null,null,"Data zakończenia okresu sprawozdawczego 1"]
[{"$f":"\"\"&INDEX(PP_Locale,ROW(),PP_LanguageIndex)","v":"Start date of reporting period 2"},{"$f":"DATE(YEAR(PP_Period1StartDate)-1,MONTH(PP_Period1StartDate),DAY(PP_Period1StartDate))","v":"2019-01-01"},null,null,null,"PP_Period2StartDate",{"$f":"DATE(YEAR(PP_Period1StartDate)-1,MONTH(PP_Period1StartDate),DAY(PP_Period1StartDate))","v":"2019-01-01"},null,null,null,{"$f":"IF(COUNTBLANK(B22),\"\",TEXT(YEAR(B22),\"0000\")&\"-\"&TEXT(MONTH(B22),\"00\")&\"-\"&TEXT(DAY(B22),\"00\"))","v":"2019-01-01"},null,null,null,{"$f":"\"\"&INDEX(PP_Locale,ROW(),PP_LanguageIndex)","v":"Start date of reporting period 2"},"Start date of reporting period 2",null,null,"Startdato for periode 2","Startdatum des Berichtszeitraums 2",null,"Fecha de inicio del período del informe 2",null,null,"Date de début de la période de reporting 2",null,null,"Data di inizio del periodo di riferimento 2",null,null,null,null,null,"Data rozpoczęcia okresu sprawozdawczego 2"]
[{"$f":"\"\"&INDEX(PP_Locale,ROW(),PP_LanguageIndex)","v":"End date of reporting period 2"},{"$f":"IF(COUNTBLANK(PP_Period2StartDate),\"\",PP_Period1StartDate-1)","v":"2019-12-31"},null,null,null,"PP_Period2EndDate",{"$f":"IF(COUNTBLANK(PP_Period2StartDate),\"\",PP_Period1StartDate-1)","v":43830},null,null,null,{"$f":"IF(COUNTBLANK(B23),\"\",TEXT(YEAR(B23),\"0000\")&\"-\"&TEXT(MONTH(B23),\"00\")&\"-\"&TEXT(DAY(B23),\"00\"))","v":"2019-12-31"},null,null,null,{"$f":"\"\"&INDEX(PP_Locale,ROW(),PP_LanguageIndex)","v":"End date of reporting period 2"},"End date of reporting period 2",null,null,"Slutdato for periode 2","Enddatum des Berichtszeitraums 2",null,"Fecha final del período del informe 2",null,null,"Date de fin de la période de reporting 2",null,null,"Data di fine del periodo di riferimento 2",null,null,null,null,null,"Data zakończenia okresu sprawozdawczego 2"]
[{"$f":"\"\"&INDEX(PP_Locale,ROW(),PP_LanguageIndex)","v":"Start date of reporting period 3"},{"$f":"DATE(YEAR(PP_Period1StartDate)-2,MONTH(PP_Period1StartDate),DAY(PP_Period1StartDate))","v":"2018-01-01"},null,null,null,"PP_Period3StartDate",{"$f":"DATE(YEAR(PP_Period1StartDate)-2,MONTH(PP_Period1StartDate),DAY(PP_Period1StartDate))","v":"2018-01-01"},null,null,null,{"$f":"IF(COUNTBLANK(B24),\"\",TEXT(YEAR(B24),\"0000\")&\"-\"&TEXT(MONTH(B24),\"00\")&\"-\"&TEXT(DAY(B24),\"00\"))","v":"2018-01-01"},null,null,null,{"$f":"\"\"&INDEX(PP_Locale,ROW(),PP_LanguageIndex)","v":"Start date of reporting period 3"},"Start date of reporting period 3",null,null,"Startdato for periode 3","Startdatum des Berichtszeitraums 3",null,"Fecha de inicio del período del informe 3",null,null,"Date de début de la période de reporting 3",null,null,"Data di inizio del periodo di riferimento 3",null,null,null,null,null,"Data rozpoczęcia okresu sprawozdawczego 3"]
[{"$f":"\"\"&INDEX(PP_Locale,ROW(),PP_LanguageIndex)","v":"End date of reporting period 3"},{"$f":"IF(COUNTBLANK(PP_Period3StartDate),\"\",PP_Period2StartDate-1)","v":"2018-12-31"},null,null,null,"PP_Period3EndDate",{"$f":"IF(COUNTBLANK(PP_Period3StartDate),\"\",PP_Period2StartDate-1)","v":43465},null,null,null,"2018-12-31",null,null,null,{"$f":"\"\"&INDEX(PP_Locale,ROW(),PP_LanguageIndex)","v":"End date of reporting period 3"},"End date of reporting period 3",null,null,"Slutdato for periode 3","Enddatum des Berichtszeitraums 3",null,"Fecha final del período del informe 3",null,null,"Date de fin de la période de reporting 3",null,null,"Data di fine del periodo di riferimento 3",null,null,null,null,null,"Data zakończenia okresu sprawozdawczego 3"]
[{"$f":"\"\"&INDEX(PP_Locale,ROW(),PP_LanguageIndex)","v":"Start date of reporting period 4"},{"$f":"DATE(YEAR(PP_Period1StartDate)-3,MONTH(PP_Period1StartDate),DAY(PP_Period1StartDate))","v":"2017-01-01"},null,null,null,"PP_Period4StartDate",{"$f":"DATE(YEAR(PP_Period1StartDate)-3,MONTH(PP_Period1StartDate),DAY(PP_Period1StartDate))","v":"2017-01-01"},null,null,null,"2017-01-01",null,null,null,{"$f":"\"\"&INDEX(PP_Locale,ROW(),PP_LanguageIndex)","v":"Start date of reporting period 4"},"Start date of reporting period 4",null,null,"Startdato for periode 4","Startdatum des Berichtszeitraums 4",null,"Fecha de inicio del período del informe 4",null,null,"Date de début de la période de reporting 4",null,null,"Data di inizio del periodo di riferimento 4",null,null,null,null,null,"Data rozpoczęcia okresu sprawozdawczego 4"]
[{"$f":"\"\"&INDEX(PP_Locale,ROW(),PP_LanguageIndex)","v":"End date of reporting period 4"},{"$f":"IF(COUNTBLANK(PP_Period4StartDate),\"\",PP_Period3StartDate-1)","v":"2017-12-31"},null,null,null,"PP_Period4EndDate",{"$f":"IF(COUNTBLANK(PP_Period4StartDate),\"\",PP_Period3StartDate-1)","v":43100},null,null,null,"2017-12-31",null,null,null,{"$f":"\"\"&INDEX(PP_Locale,ROW(),PP_LanguageIndex)","v":"End date of reporting period 4"},"End date of reporting period 4",null,null,"Slutdato for periode 4","Enddatum des Berichtszeitraums 4",null,"Fecha final del período del informe 4",null,null,"Date de fin de la période de reporting 4",null,null,"Data di fine del periodo di riferimento 4",null,null,null,null,null,"Data zakończenia okresu sprawozdawczego 4"]
[{"$f":"\"\"&INDEX(PP_Locale,ROW(),PP_LanguageIndex)","v":"Start date of reporting period 5"},{"$f":"DATE(YEAR(PP_Period1StartDate)-4,MONTH(PP_Period1StartDate),DAY(PP_Period1StartDate))","v":"2016-01-01"},null,null,null,"PP_Period5StartDate",{"$f":"DATE(YEAR(PP_Period1StartDate)-4,MONTH(PP_Period1StartDate),DAY(PP_Period1StartDate))","v":"2016-01-01"},null,null,null,"2016-01-01",null,null,null,{"$f":"\"\"&INDEX(PP_Locale,ROW(),PP_LanguageIndex)","v":"Start date of reporting period 5"},"Start date of reporting period 5",null,null,"Startdato for periode 5","Startdatum des Berichtszeitraums 5",null,"Fecha de inicio del período del informe 5",null,null,"Date de début de la période de reporting 5",null,null,"Data di inizio del periodo di riferimento 5",null,null,null,null,null,"Data rozpoczęcia okresu sprawozdawczego 5"]
[{"$f":"\"\"&INDEX(PP_Locale,ROW(),PP_LanguageIndex)","v":"End date of reporting period 5"},{"$f":"IF(COUNTBLANK(PP_Period5StartDate),\"\",PP_Period4StartDate-1)","v":"2016-12-31"},null,null,null,"PP_Period5EndDate",{"$f":"IF(COUNTBLANK(PP_Period5StartDate),\"\",PP_Period4StartDate-1)","v":42735},null,null,null,"2016-12-31",null,null,null,{"$f":"\"\"&INDEX(PP_Locale,ROW(),PP_LanguageIndex)","v":"End date of reporting period 5"},"End date of reporting period 5",null,null,"Slutdato for periode 5","Enddatum des Berichtszeitraums 5",null,"Fecha final del período del informe 5",null,null,"Date de fin de la période de reporting 5",null,null,"Data di fine del periodo di riferimento 5",null,null,null,null,null,"Data zakończenia okresu sprawozdawczego 5"]
[{"$f":"\"\"&INDEX(PP_Locale,ROW(),PP_LanguageIndex)","v":"Start date of reporting period 6"},{"$f":"DATE(YEAR(PP_Period1StartDate)-5,MONTH(PP_Period1StartDate),DAY(PP_Period1StartDate))","v":"2015-01-01"},null,null,null,"PP_Period6StartDate",{"$f":"DATE(YEAR(PP_Period1StartDate)-5,MONTH(PP_Period1StartDate),DAY(PP_Period1StartDate))","v":"2015-01-01"},null,null,null,"2015-01-01",null,null,null,{"$f":"\"\"&INDEX(PP_Locale,ROW(),PP_LanguageIndex)","v":"Start date of reporting period 6"},"Start date of reporting period 6",null,null,"Startdato for periode 6","Startdatum des Berichtszeitraums 6",null,"Fecha de inicio del período del informe 6",null,null,"Date de début de la période de reporting 6",null,null,"Data di inizio del periodo di riferimento 6",null,null,null,null,null,"Data rozpoczęcia okresu sprawozdawczego 6"]
[{"$f":"\"\"&INDEX(PP_Locale,ROW(),PP_LanguageIndex)","v":"End date of reporting period 6"},{"$f":"IF(COUNTBLANK(PP_Period6StartDate),\"\",PP_Period5StartDate-1)","v":"2015-12-31"},null,null,null,"PP_Period6EndDate",{"$f":"IF(COUNTBLANK(PP_Period6StartDate),\"\",PP_Period5StartDate-1)","v":42369},null,null,null,"2015-12-31",null,null,null,{"$f":"\"\"&INDEX(PP_Locale,ROW(),PP_LanguageIndex)","v":"End date of reporting period 6"},"End date of reporting period 6",null,null,"Slutdato for periode 6","Enddatum des Berichtszeitraums 6",null,"Fecha final del período del informe 6",null,null,"Date de fin de la période de reporting 6",null,null,"Data di fine del periodo di riferimento 6",null,null,null,null,null,"Data zakończenia okresu sprawozdawczego 6"]
[{"$f":"\"\"&INDEX(PP_Locale,ROW(),PP_LanguageIndex)","v":"Start date of reporting period 7"},{"$f":"DATE(YEAR(PP_Period1StartDate)-6,MONTH(PP_Period1StartDate),DAY(PP_Period1StartDate))","v":"2014-01-01"},null,null,null,"PP_Period7StartDate",{"$f":"DATE(YEAR(PP_Period1StartDate)-6,MONTH(PP_Period1StartDate),DAY(PP_Period1StartDate))","v":"2014-01-01"},null,null,null,"2014-01-01",null,null,null,{"$f":"\"\"&INDEX(PP_Locale,ROW(),PP_LanguageIndex)","v":"Start date of reporting period 7"},"Start date of reporting period 7",null,null,"Startdato for periode 7","Startdatum des Berichtszeitraums 7",null,"Fecha de inicio del período del informe 7",null,null,"Date de début de la période de reporting 7",null,null,"Data di inizio del periodo di riferimento 7",null,null,null,null,null,"Data rozpoczęcia okresu sprawozdawczego 7"]
[{"$f":"\"\"&INDEX(PP_Locale,ROW(),PP_LanguageIndex)","v":"End date of reporting period 7"},{"$f":"IF(COUNTBLANK(PP_Period7StartDate),\"\",PP_Period6StartDate-1)","v":"2014-12-31"},null,null,null,"PP_Period7EndDate",{"$f":"IF(COUNTBLANK(PP_Period7StartDate),\"\",PP_Period6StartDate-1)","v":42004},null,null,null,"2014-12-31",null,null,null,{"$f":"\"\"&INDEX(PP_Locale,ROW(),PP_LanguageIndex)","v":"End date of reporting period 7"},"End date of reporting period 7",null,null,"Slutdato for periode 7","Enddatum des Berichtszeitraums 7",null,"Fecha final del período del informe 7",null,null,"Date de fin de la période de reporting 7",null,null,"Data di fine del periodo di riferimento 7",null,null,null,null,null,"Data zakończenia okresu sprawozdawczego 7"]
[{"$f":"\"\"&INDEX(PP_Locale,ROW(),PP_LanguageIndex)","v":"Start date of reporting period 8"},{"$f":"DATE(YEAR(PP_Period1StartDate)-7,MONTH(PP_Period1StartDate),DAY(PP_Period1StartDate))","v":"2013-01-01"},null,null,null,"PP_Period8StartDate",{"$f":"DATE(YEAR(PP_Period1StartDate)-7,MONTH(PP_Period1StartDate),DAY(PP_Period1StartDate))","v":"2013-01-01"},null,null,null,"2013-01-01",null,null,null,{"$f":"\"\"&INDEX(PP_Locale,ROW(),PP_LanguageIndex)","v":"Start date of reporting period 8"},"Start date of reporting period 8",null,null,"Startdato for periode 8","Startdatum des Berichtszeitraums 8",null,"Fecha de inicio del período del informe 8",null,null,"Date de début de la période de reporting 8",null,null,"Data di inizio del periodo di riferimento 8",null,null,null,null,null,"Data rozpoczęcia okresu sprawozdawczego 8"]
[{"$f":"\"\"&INDEX(PP_Locale,ROW(),PP_LanguageIndex)","v":"End date of reporting period 8"},{"$f":"IF(COUNTBLANK(PP_Period8StartDate),\"\",PP_Period7StartDate-1)","v":"2013-12-31"},null,null,null,"PP_Period8EndDate",{"$f":"IF(COUNTBLANK(PP_Period8StartDate),\"\",PP_Period7StartDate-1)","v":41639},null,null,null,"2013-12-31",null,null,null,{"$f":"\"\"&INDEX(PP_Locale,ROW(),PP_LanguageIndex)","v":"End date of reporting period 8"},"End date of reporting period 8",null,null,"Slutdato for periode 8","Enddatum des Berichtszeitraums 8",null,"Fecha final del período del informe 8",null,null,"Date de fin de la période de reporting 8",null,null,"Data di fine del periodo di riferimento 8",null,null,null,null,null,"Data zakończenia okresu sprawozdawczego 8"]
[{"$f":"\"\"&INDEX(PP_Locale,ROW(),PP_LanguageIndex)","v":"Date of general meeting"},null,null,null,null,"PP_DateOfGeneralMeeting",null,null,null,null,{"$f":"IF(COUNTBLANK(B36),\"\",TEXT(YEAR(B36),\"0000\")&\"-\"&TEXT(MONTH(B36),\"00\")&\"-\"&TEXT(DAY(B36),\"00\"))","v":""},null,null,null,{"$f":"\"\"&INDEX(PP_Locale,ROW(),PP_LanguageIndex)","v":"Date of general meeting"},"Date of general meeting",null,null,"Generalforsamlingsdato",null,null,null,null,null,null,null,null,null,null,null,null,null,null,null,null,null,null,null,null,null,null,null,null,null,null,null,null,null,null,null,null,null,null,null,null,null,null,null,null,null,null,null,null,null,null,null,null,null,null,null,null,null,null,null,null,null,null,null,null,null,null,null,null,null,null,null,null,null,null,null,null,null,null,null,null,null,null,"&allowhtml=false&merge=false",{"$f":"\"pp://General Data/\"&INDEX(PP_Locale,ROW(),1)&\"?taxonomy=\"&PP_TaxonomyId&\"&labellanguage=en&period=1\"&IF(PP_Consolidated,\"_Consolidated\",\"\")&CT36","v":"pp://General Data/Date of general meeting?taxonomy=DKIFRS&labellanguage=en&period=1_Consolidated&allowhtml=false&merge=false"}]
[{"$f":"\"\"&INDEX(PP_Locale,ROW(),PP_LanguageIndex)","v":"Reporting period, number"},null,null,null,null,"PP_ReportingPeriodNumber",null,null,null,null,{"$f":"\"\"&B37","v":""},null,null,null,{"$f":"\"\"&INDEX(PP_Locale,ROW(),PP_LanguageIndex)","v":"Reporting period, number"},"Reporting period, number",null,null,"Regnskabsår (nr.)",null,null,null,null,null,null,null,null,null,null,null,null,null,null,null,null,null,null,null,null,null,null,null,null,null,null,null,null,null,null,null,null,null,null,null,null,null,null,null,null,null,null,null,null,null,null,null,null,null,null,null,null,null,null,null,null,null,null,null,null,null,null,null,null,null,null,null,null,null,null,null,null,null,null,null,null,null,null,"&allowhtml=false&merge=false",{"$f":"\"pp://General Data/\"&INDEX(PP_Locale,ROW(),1)&\"?taxonomy=\"&PP_TaxonomyId&\"&labellanguage=en&period=1\"&IF(PP_Consolidated,\"_Consolidated\",\"\")&CT37","v":"pp://General Data/Reporting period, number?taxonomy=DKIFRS&labellanguage=en&period=1_Consolidated&allowhtml=false&merge=false"}]
[null,null,null,null,null,null,null,null,null,null,null,null,null,null,{"$f":"\"\"&INDEX(PP_Locale,ROW(),PP_LanguageIndex)","v":""}]
[{"$f":"\"\"&INDEX(PP_Locale,ROW(),PP_LanguageIndex)","v":"Chairman of general meeting:"},null,null,null,null,null,null,null,null,null,null,null,null,null,{"$f":"\"\"&INDEX(PP_Locale,ROW(),PP_LanguageIndex)","v":"Chairman of general meeting:"},"Chairman of general meeting:",null,null,"Dirigent:"]
[{"$f":"\"\"&INDEX(PP_Locale,ROW(),PP_LanguageIndex)","v":"Name and surname of chairman of general meeting"},null,null,null,null,"PP_NameAndSurnameOfChairmanOfGeneralMeeting",null,null,null,null,{"$f":"\"\"&B40","v":""},null,null,null,{"$f":"\"\"&INDEX(PP_Locale,ROW(),PP_LanguageIndex)","v":"Name and surname of chairman of general meeting"},"Name and surname of chairman of general meeting",null,null,"Dirigentens navn",null,null,null,null,null,null,null,null,null,null,null,null,null,null,null,null,null,null,null,null,null,null,null,null,null,null,null,null,null,null,null,null,null,null,null,null,null,null,null,null,null,null,null,null,null,null,null,null,null,null,null,null,null,null,null,null,null,null,null,null,null,null,null,null,null,null,null,null,null,null,null,null,null,null,null,null,null,null,"&allowhtml=false&merge=false",{"$f":"\"pp://General Data/\"&INDEX(PP_Locale,ROW(),1)&\"?taxonomy=\"&PP_TaxonomyId&\"&labellanguage=en&period=1\"&IF(PP_Consolidated,\"_Consolidated\",\"\")&CT40","v":"pp://General Data/Name and surname of chairman of general meeting?taxonomy=DKIFRS&labellanguage=en&period=1_Consolidated&allowhtml=false&merge=false"}]
[null,null,null,null,null,null,null,null,null,null,null,null,null,null,{"$f":"\"\"&INDEX(PP_Locale,ROW(),PP_LanguageIndex)","v":""}]
[{"$f":"\"\"&INDEX(PP_Locale,ROW(),PP_LanguageIndex)","v":"Information on reporting entity:"},null,null,null,null,null,null,null,null,null,null,null,null,null,{"$f":"\"\"&INDEX(PP_Locale,ROW(),PP_LanguageIndex)","v":"Information on reporting entity:"},"Information on reporting entity:",null,null,"Information om den regnskabsaflæggende virksomhed:"]
[{"$f":"\"\"&INDEX(PP_Locale,ROW(),PP_LanguageIndex)","v":"Legal Entity Identifier [LEI] of reporting entity"},null,null,null,null,"PP_LegalEntityIdentifierOfReportingEntity",null,null,null,null,{"$f":"\"\"&B43","v":""},null,null,null,{"$f":"\"\"&INDEX(PP_Locale,ROW(),PP_LanguageIndex)","v":"Legal Entity Identifier [LEI] of reporting entity"},"Legal Entity Identifier [LEI] of reporting entity",null,null,"Regnskabsaflæggende virksomheds LEI-kode",null,null,null,null,null,null,null,null,null,null,null,null,null,null,null,null,null,null,null,null,null,null,null,null,null,null,null,null,null,null,null,null,null,null,null,null,null,null,null,null,null,null,null,null,null,null,null,null,null,null,null,null,null,null,null,null,null,null,null,null,null,null,null,null,null,null,null,null,null,null,null,null,null,null,null,null,null,null,"&allowhtml=false&merge=false",{"$f":"\"pp://General Data/\"&INDEX(PP_Locale,ROW(),1)&\"?taxonomy=\"&PP_TaxonomyId&\"&labellanguage=en&period=1\"&IF(PP_Consolidated,\"_Consolidated\",\"\")&CT43","v":"pp://General Data/Legal Entity Identifier [LEI] of reporting entity?taxonomy=DKIFRS&labellanguage=en&period=1_Consolidated&allowhtml=false&merge=false"}]
[{"$f":"\"\"&INDEX(PP_Locale,ROW(),PP_LanguageIndex)","v":"Name of reporting entity"},{"$f":"IFERROR(VLOOKUP(\"Test customer\",PP_Locale,PP_LanguageIndex,FALSE),\"Test customer\")","v":"Test customer"},{"$f":"IFERROR(VLOOKUP(\"Test customer\",PP_Locale,PP_LanguageIndex,FALSE),\"Test customer\")","v":"Test customer"},{"$f":"IFERROR(VLOOKUP(\"Test customer\",PP_Locale,PP_LanguageIndex,FALSE),\"Test customer\")","v":"Test customer"},{"$f":"IFERROR(VLOOKUP(\"Test customer\",PP_Locale,PP_LanguageIndex,FALSE),\"Test customer\")","v":"Test customer"},"PP_NameOfReportingEntity",{"$f":"IFERROR(VLOOKUP(\"Test customer\",PP_Locale,PP_LanguageIndex,FALSE),\"Test customer\")","v":"Test customer"},null,null,null,{"$f":"\"\"&B44","v":"Test customer"},null,null,null,{"$f":"\"\"&INDEX(PP_Locale,ROW(),PP_LanguageIndex)","v":"Name of reporting entity"},"Name of reporting entity",null,null,"Regnskabsaflæggende virksomheds navn",null,null,null,null,null,null,null,null,null,null,null,null,null,null,null,null,null,null,null,null,null,null,null,null,null,null,null,null,null,null,null,null,null,null,null,null,null,null,null,null,null,null,null,null,null,null,null,null,null,null,null,null,null,null,null,null,null,null,null,null,null,null,null,null,null,null,null,null,null,null,null,null,null,null,null,null,null,null,"&allowhtml=false&merge=false",{"$f":"\"pp://General Data/\"&INDEX(PP_Locale,ROW(),1)&\"?taxonomy=\"&PP_TaxonomyId&\"&labellanguage=en&period=1\"&IF(PP_Consolidated,\"_Consolidated\",\"\")&CT44","v":"pp://General Data/Name of reporting entity?taxonomy=DKIFRS&labellanguage=en&period=1_Consolidated&allowhtml=false&merge=false"}]
[{"$f":"\"\"&INDEX(PP_Locale,ROW(),PP_LanguageIndex)","v":"Class of reporting entity"},{"$f":"IFERROR(VLOOKUP(\"Reporting Class B\",PP_Locale,PP_LanguageIndex,FALSE),\"Reporting Class B\")","v":"Reporting class B"},{"$f":"\"\"&LOOKUP(PP_Language,{\"DA\";\"EN\"},{\"Regnskabsklasse B\";\"Reporting class B\"})","v":"Reporting class B"},{"$f":"\"\"&LOOKUP(PP_Language,{\"DA\";\"EN\"},{\"Regnskabsklasse B\";\"Reporting class B\"})","v":"Reporting class B"},{"$f":"\"\"&LOOKUP(PP_Language,{\"DA\";\"EN\"},{\"Regnskabsklasse B\";\"Reporting class B\"})","v":"Reporting class B"},"PP_ClassOfReportingEntity",{"$f":"IFERROR(VLOOKUP(\"Reporting Class B\",PP_Locale,PP_LanguageIndex,FALSE),\"Reporting Class B\")","v":"Reporting class B"},null,null,null,{"$f":"\"\"&SUBSTITUTE(B45,\" / \",\", \")","v":"Reporting class B"},null,null,null,{"$f":"\"\"&INDEX(PP_Locale,ROW(),PP_LanguageIndex)","v":"Class of reporting entity"},"Class of reporting entity",null,null,"Regnskabsaflæggende virksomheds regnskabsklasse",null,null,null,null,null,null,null,null,null,null,null,null,null,null,null,null,null,null,null,null,null,null,null,null,null,null,null,null,null,null,null,null,null,null,null,null,null,null,null,null,null,null,null,null,null,null,null,null,null,null,null,null,null,null,null,{"$f":"\"\"&LOOKUP(PP_Language,{\"DA\";\"EN\"},{\"Regnskabsklasse A\";\"Reporting class A\"})","v":"Reporting class A"},{"$f":"\"\"&LOOKUP(PP_Language,{\"DA\";\"EN\"},{\"Regnskabsklasse B\";\"Reporting class B\"})","v":"Reporting class B"},{"$f":"\"\"&LOOKUP(PP_Language,{\"DA\";\"EN\"},{\"Regnskabsklasse B / mikrovirksomhed\";\"Reporting class B / micro-undertaking\"})","v":"Reporting class B / micro-undertaking"},{"$f":"\"\"&LOOKUP(PP_Language,{\"DA\";\"EN\"},{\"Regnskabsklasse C / mellemstor virksomhed\";\"Reporting class C / medium-size enterprise\"})","v":"Reporting class C / medium-size enterprise"},{"$f":"\"\"&LOOKUP(PP_Language,{\"DA\";\"EN\"},{\"Regnskabsklasse C / stor virksomhed\";\"Reporting class C / large enterprise\"})","v":"Reporting class C / large enterprise"},{"$f":"\"\"&LOOKUP(PP_Language,{\"DA\";\"EN\"},{\"Regnskabsklasse D\";\"Reporting class D\"})","v":"Reporting class D"},null,null,null,null,null,null,null,null,null,null,null,null,null,null,null,null,null,"&allowhtml=false&merge=false"]
[{"$f":"\"\"&INDEX(PP_Locale,ROW(),PP_LanguageIndex)","v":"Identification number [CVR] of reporting entity"},12345678,12345678,12345678,12345678,"PP_IdentificationNumberCvrOfReportingEntity",12345678,null,null,null,{"$f":"\"\"&SUBSTITUTE(B46,\" \",\"\")","v":"12345678"},null,null,null,{"$f":"\"\"&INDEX(PP_Locale,ROW(),PP_LanguageIndex)","v":"Identification number [CVR] of reporting entity"},"Identification number [CVR] of reporting entity",null,null,"Regnskabsaflæggende virksomheds CVR-nr.",null,null,null,null,null,null,null,null,null,null,null,null,null,null,null,null,null,null,null,null,null,null,null,null,null,null,null,null,null,null,null,null,null,null,null,null,null,null,null,null,null,null,null,null,null,null,null,null,null,null,null,null,null,null,null,null,null,null,null,null,null,null,null,null,null,null,null,null,null,null,null,null,null,null,null,null,null,null,"&allowhtml=false&merge=false&skipspace=true",{"$f":"\"pp://General Data/\"&INDEX(PP_Locale,ROW(),1)&\"?taxonomy=\"&PP_TaxonomyId&\"&labellanguage=en&period=1\"&IF(PP_Consolidated,\"_Consolidated\",\"\")&CT46","v":"pp://General Data/Identification number [CVR] of reporting entity?taxonomy=DKIFRS&labellanguage=en&period=1_Consolidated&allowhtml=false&merge=false&skipspace=true"}]
[{"$f":"\"\"&INDEX(PP_Locale,ROW(),PP_LanguageIndex)","v":"Address of reporting entity, street name"},{"$f":"IFERROR(VLOOKUP(\"UNKNOWN\",PP_Locale,PP_LanguageIndex,FALSE),\"UNKNOWN\")","v":"UNKNOWN"},null,null,null,"PP_AddressOfReportingEntityStreetName",{"$f":"IFERROR(VLOOKUP(\"UNKNOWN\",PP_Locale,PP_LanguageIndex,FALSE),\"UNKNOWN\")","v":"UNKNOWN"},null,null,null,{"$f":"\"\"&B47","v":"UNKNOWN"},null,null,null,{"$f":"\"\"&INDEX(PP_Locale,ROW(),PP_LanguageIndex)","v":"Address of reporting entity, street name"},"Address of reporting entity, street name",null,null,"Regnskabsaflæggende virksomheds adresse, vejnavn",null,null,null,null,null,null,null,null,null,null,null,null,null,null,null,null,null,null,null,null,null,null,null,null,null,null,null,null,null,null,null,null,null,null,null,null,null,null,null,null,null,null,null,null,null,null,null,null,null,null,null,null,null,null,null,null,null,null,null,null,null,null,null,null,null,null,null,null,null,null,null,null,null,null,null,null,null,null,"&allowhtml=false&merge=false",{"$f":"\"pp://General Data/\"&INDEX(PP_Locale,ROW(),1)&\"?taxonomy=\"&PP_TaxonomyId&\"&labellanguage=en&period=1\"&IF(PP_Consolidated,\"_Consolidated\",\"\")&CT47","v":"pp://General Data/Address of reporting entity, street name?taxonomy=DKIFRS&labellanguage=en&period=1_Consolidated&allowhtml=false&merge=false"}]
[{"$f":"\"\"&INDEX(PP_Locale,ROW(),PP_LanguageIndex)","v":"Address of reporting entity, street building identifier"},{"$f":"IFERROR(VLOOKUP(\"UNKNOWN\",PP_Locale,PP_LanguageIndex,FALSE),\"UNKNOWN\")","v":"UNKNOWN"},null,null,null,"PP_AddressOfReportingEntityStreetBuildingIdentifier",{"$f":"IFERROR(VLOOKUP(\"UNKNOWN\",PP_Locale,PP_LanguageIndex,FALSE),\"UNKNOWN\")","v":"UNKNOWN"},null,null,null,"UNKNOWN",null,null,null,{"$f":"\"\"&INDEX(PP_Locale,ROW(),PP_LanguageIndex)","v":"Address of reporting entity, street building identifier"},"Address of reporting entity, street building identifier",null,null,"Regnskabsaflæggende virksomheds adresse, vejnr og etage",null,null,null,null,null,null,null,null,null,null,null,null,null,null,null,null,null,null,null,null,null,null,null,null,null,null,null,null,null,null,null,null,null,null,null,null,null,null,null,null,null,null,null,null,null,null,null,null,null,null,null,null,null,null,null,null,null,null,null,null,null,null,null,null,null,null,null,null,null,null,null,null,null,null,null,null,null,null,"&allowhtml=false&merge=false",{"$f":"\"pp://General Data/\"&INDEX(PP_Locale,ROW(),1)&\"?taxonomy=\"&PP_TaxonomyId&\"&labellanguage=en&period=1\"&IF(PP_Consolidated,\"_Consolidated\",\"\")&CT48","v":"pp://General Data/Address of reporting entity, street building identifier?taxonomy=DKIFRS&labellanguage=en&period=1_Consolidated&allowhtml=false&merge=false"}]
[{"$f":"\"\"&INDEX(PP_Locale,ROW(),PP_LanguageIndex)","v":"Address of reporting entity, post code identifier"},{"$f":"IFERROR(VLOOKUP(\"UNKNOWN\",PP_Locale,PP_LanguageIndex,FALSE),\"UNKNOWN\")","v":"UNKNOWN"},null,null,null,"PP_AddressOfReportingEntityPostCodeIdentifier",{"$f":"IFERROR(VLOOKUP(\"UNKNOWN\",PP_Locale,PP_LanguageIndex,FALSE),\"UNKNOWN\")","v":"UNKNOWN"},null,null,null,"UNKNOWN",null,null,null,{"$f":"\"\"&INDEX(PP_Locale,ROW(),PP_LanguageIndex)","v":"Address of reporting entity, post code identifier"},"Address of reporting entity, post code identifier",null,null,"Regnskabsaflæggende virksomheds adresse, postnummer",null,null,null,null,null,null,null,null,null,null,null,null,null,null,null,null,null,null,null,null,null,null,null,null,null,null,null,null,null,null,null,null,null,null,null,null,null,null,null,null,null,null,null,null,null,null,null,null,null,null,null,null,null,null,null,null,null,null,null,null,null,null,null,null,null,null,null,null,null,null,null,null,null,null,null,null,null,null,"&allowhtml=false&merge=false",{"$f":"\"pp://General Data/\"&INDEX(PP_Locale,ROW(),1)&\"?taxonomy=\"&PP_TaxonomyId&\"&labellanguage=en&period=1\"&IF(PP_Consolidated,\"_Consolidated\",\"\")&CT49","v":"pp://General Data/Address of reporting entity, post code identifier?taxonomy=DKIFRS&labellanguage=en&period=1_Consolidated&allowhtml=false&merge=false"}]
[{"$f":"\"\"&INDEX(PP_Locale,ROW(),PP_LanguageIndex)","v":"Address of reporting entity, district name"},{"$f":"IFERROR(VLOOKUP(\"UNKNOWN\",PP_Locale,PP_LanguageIndex,FALSE),\"UNKNOWN\")","v":"UNKNOWN"},null,null,null,"PP_AddressOfReportingEntityDistrictName",{"$f":"IFERROR(VLOOKUP(\"UNKNOWN\",PP_Locale,PP_LanguageIndex,FALSE),\"UNKNOWN\")","v":"UNKNOWN"},null,null,null,"UNKNOWN",null,null,null,{"$f":"\"\"&INDEX(PP_Locale,ROW(),PP_LanguageIndex)","v":"Address of reporting entity, district name"},"Address of reporting entity, district name",null,null,"Regnskabsaflæggende virksomheds adresse, by",null,null,null,null,null,null,null,null,null,null,null,null,null,null,null,null,null,null,null,null,null,null,null,null,null,null,null,null,null,null,null,null,null,null,null,null,null,null,null,null,null,null,null,null,null,null,null,null,null,null,null,null,null,null,null,null,null,null,null,null,null,null,null,null,null,null,null,null,null,null,null,null,null,null,null,null,null,null,"&allowhtml=false&merge=false",{"$f":"\"pp://General Data/\"&INDEX(PP_Locale,ROW(),1)&\"?taxonomy=\"&PP_TaxonomyId&\"&labellanguage=en&period=1\"&IF(PP_Consolidated,\"_Consolidated\",\"\")&CT50","v":"pp://General Data/Address of reporting entity, district name?taxonomy=DKIFRS&labellanguage=en&period=1_Consolidated&allowhtml=false&merge=false"}]
[{"$f":"\"\"&INDEX(PP_Locale,ROW(),PP_LanguageIndex)","v":"Address of reporting entity, country"},null,null,null,null,"PP_AddressOfReportingEntityCountry",null,null,null,null,"",null,null,null,{"$f":"\"\"&INDEX(PP_Locale,ROW(),PP_LanguageIndex)","v":"Address of reporting entity, country"},"Address of reporting entity, country",null,null,"Regnskabsaflæggende virksomheds adresse, land",null,null,null,null,null,null,null,null,null,null,null,null,null,null,null,null,null,null,null,null,null,null,null,null,null,null,null,null,null,null,null,null,null,null,null,null,null,null,null,null,null,null,null,null,null,null,null,null,null,null,null,null,null,null,null,null,null,null,null,null,null,null,null,null,null,null,null,null,null,null,null,null,null,null,null,null,null,null,"&allowhtml=false&merge=false",{"$f":"\"pp://General Data/\"&INDEX(PP_Locale,ROW(),1)&\"?taxonomy=\"&PP_TaxonomyId&\"&labellanguage=en&period=1\"&IF(PP_Consolidated,\"_Consolidated\",\"\")&CT51","v":"pp://General Data/Address of reporting entity, country?taxonomy=DKIFRS&labellanguage=en&period=1_Consolidated&allowhtml=false&merge=false"}]
[{"$f":"\"\"&INDEX(PP_Locale,ROW(),PP_LanguageIndex)","v":"Address of reporting entity, country identification code"},null,null,null,null,"PP_AddressOfReportingEntityCountryIdentificationCode",null,null,null,null,"",null,null,null,{"$f":"\"\"&INDEX(PP_Locale,ROW(),PP_LanguageIndex)","v":"Address of reporting entity, country identification code"},"Address of reporting entity, country identification code",null,null,"Regnskabsaflæggende virksomheds adresse, landekode",null,null,null,null,null,null,null,null,null,null,null,null,null,null,null,null,null,null,null,null,null,null,null,null,null,null,null,null,null,null,null,null,null,null,null,null,null,null,null,null,null,null,null,null,null,null,null,null,null,null,null,null,null,null,null,null,null,null,null,null,null,null,null,null,null,null,null,null,null,null,null,null,null,null,null,null,null,null,"&allowhtml=false&merge=false",{"$f":"\"pp://General Data/\"&INDEX(PP_Locale,ROW(),1)&\"?taxonomy=\"&PP_TaxonomyId&\"&labellanguage=en&period=1\"&IF(PP_Consolidated,\"_Consolidated\",\"\")&CT52","v":"pp://General Data/Address of reporting entity, country identification code?taxonomy=DKIFRS&labellanguage=en&period=1_Consolidated&allowhtml=false&merge=false"}]
[{"$f":"\"\"&INDEX(PP_Locale,ROW(),PP_LanguageIndex)","v":"Date of foundation of reporting entity"},null,null,null,null,"PP_DateOfFoundationOfReportingEntity",null,null,null,null,{"$f":"IF(COUNTBLANK(B53),\"\",TEXT(YEAR(B53),\"0000\")&\"-\"&TEXT(MONTH(B53),\"00\")&\"-\"&TEXT(DAY(B53),\"00\"))","v":""},null,null,null,{"$f":"\"\"&INDEX(PP_Locale,ROW(),PP_LanguageIndex)","v":"Date of foundation of reporting entity"},"Date of foundation of reporting entity",null,null,"Regnskabsaflæggende virksomheds stiftelsesdato",null,null,null,null,null,null,null,null,null,null,null,null,null,null,null,null,null,null,null,null,null,null,null,null,null,null,null,null,null,null,null,null,null,null,null,null,null,null,null,null,null,null,null,null,null,null,null,null,null,null,null,null,null,null,null,null,null,null,null,null,null,null,null,null,null,null,null,null,null,null,null,null,null,null,null,null,null,null,"&allowhtml=false&merge=false",{"$f":"\"pp://General Data/\"&INDEX(PP_Locale,ROW(),1)&\"?taxonomy=\"&PP_TaxonomyId&\"&labellanguage=en&period=1\"&IF(PP_Consolidated,\"_Consolidated\",\"\")&CT53","v":"pp://General Data/Date of foundation of reporting entity?taxonomy=DKIFRS&labellanguage=en&period=1_Consolidated&allowhtml=false&merge=false"}]
[{"$f":"\"\"&INDEX(PP_Locale,ROW(),PP_LanguageIndex)","v":"Registered office of reporting entity"},null,null,null,null,"PP_RegisteredOfficeOfReportingEntity",null,null,null,null,{"$f":"\"\"&B54","v":""},null,null,null,{"$f":"\"\"&INDEX(PP_Locale,ROW(),PP_LanguageIndex)","v":"Registered office of reporting entity"},"Registered office of reporting entity",null,null,"Regnskabsaflæggende virksomheds hjemsted",null,null,null,null,null,null,null,null,null,null,null,null,null,null,null,null,null,null,null,null,null,null,null,null,null,null,null,null,null,null,null,null,null,null,null,null,null,null,null,null,null,null,null,null,null,null,null,null,null,null,null,null,null,null,null,null,null,null,null,null,null,null,null,null,null,null,null,null,null,null,null,null,null,null,null,null,null,null,"&allowhtml=false&merge=false",{"$f":"\"pp://General Data/\"&INDEX(PP_Locale,ROW(),1)&\"?taxonomy=\"&PP_TaxonomyId&\"&labellanguage=en&period=1\"&IF(PP_Consolidated,\"_Consolidated\",\"\")&CT54","v":"pp://General Data/Registered office of reporting entity?taxonomy=DKIFRS&labellanguage=en&period=1_Consolidated&allowhtml=false&merge=false"}]
[{"$f":"\"\"&INDEX(PP_Locale,ROW(),PP_LanguageIndex)","v":"Telephone number of reporting entity"},null,null,null,null,"PP_TelephoneNumberOfReportingEntity",null,null,null,null,{"$f":"\"\"&SUBSTITUTE(B55,\" \",\"\")","v":""},null,null,null,{"$f":"\"\"&INDEX(PP_Locale,ROW(),PP_LanguageIndex)","v":"Telephone number of reporting entity"},"Telephone number of reporting entity",null,null,"Regnskabsaflæggende virksomheds telefonnummer",null,null,null,null,null,null,null,null,null,null,null,null,null,null,null,null,null,null,null,null,null,null,null,null,null,null,null,null,null,null,null,null,null,null,null,null,null,null,null,null,null,null,null,null,null,null,null,null,null,null,null,null,null,null,null,null,null,null,null,null,null,null,null,null,null,null,null,null,null,null,null,null,null,null,null,null,null,null,"&allowhtml=false&merge=false",{"$f":"\"pp://General Data/\"&INDEX(PP_Locale,ROW(),1)&\"?taxonomy=\"&PP_TaxonomyId&\"&labellanguage=en&period=1\"&IF(PP_Consolidated,\"_Consolidated\",\"\")&CT55","v":"pp://General Data/Telephone number of reporting entity?taxonomy=DKIFRS&labellanguage=en&period=1_Consolidated&allowhtml=false&merge=false"}]
[{"$f":"\"\"&INDEX(PP_Locale,ROW(),PP_LanguageIndex)","v":"Fax number of reporting entity"},null,null,null,null,"PP_FaxNumberOfReportingEntity",null,null,null,null,{"$f":"\"\"&SUBSTITUTE(B56,\" \",\"\")","v":""},null,null,null,{"$f":"\"\"&INDEX(PP_Locale,ROW(),PP_LanguageIndex)","v":"Fax number of reporting entity"},"Fax number of reporting entity",null,null,"Regnskabsaflæggende virksomheds faxnummer",null,null,null,null,null,null,null,null,null,null,null,null,null,null,null,null,null,null,null,null,null,null,null,null,null,null,null,null,null,null,null,null,null,null,null,null,null,null,null,null,null,null,null,null,null,null,null,null,null,null,null,null,null,null,null,null,null,null,null,null,null,null,null,null,null,null,null,null,null,null,null,null,null,null,null,null,null,null,"&allowhtml=false&merge=false",{"$f":"\"pp://General Data/\"&INDEX(PP_Locale,ROW(),1)&\"?taxonomy=\"&PP_TaxonomyId&\"&labellanguage=en&period=1\"&IF(PP_Consolidated,\"_Consolidated\",\"\")&CT56","v":"pp://General Data/Fax number of reporting entity?taxonomy=DKIFRS&labellanguage=en&period=1_Consolidated&allowhtml=false&merge=false"}]
[{"$f":"\"\"&INDEX(PP_Locale,ROW(),PP_LanguageIndex)","v":"Homepage of reporting entity"},null,null,null,null,"PP_HomepageOfReportingEntity",null,null,null,null,{"$f":"\"\"&B57","v":""},null,null,null,{"$f":"\"\"&INDEX(PP_Locale,ROW(),PP_LanguageIndex)","v":"Homepage of reporting entity"},"Homepage of reporting entity",null,null,"Regnskabsaflæggende virksomheds hjemmeside",null,null,null,null,null,null,null,null,null,null,null,null,null,null,null,null,null,null,null,null,null,null,null,null,null,null,null,null,null,null,null,null,null,null,null,null,null,null,null,null,null,null,null,null,null,null,null,null,null,null,null,null,null,null,null,null,null,null,null,null,null,null,null,null,null,null,null,null,null,null,null,null,null,null,null,null,null,null,"&allowhtml=false&merge=false",{"$f":"\"pp://General Data/\"&INDEX(PP_Locale,ROW(),1)&\"?taxonomy=\"&PP_TaxonomyId&\"&labellanguage=en&period=1\"&IF(PP_Consolidated,\"_Consolidated\",\"\")&CT57","v":"pp://General Data/Homepage of reporting entity?taxonomy=DKIFRS&labellanguage=en&period=1_Consolidated&allowhtml=false&merge=false"}]
[{"$f":"\"\"&INDEX(PP_Locale,ROW(),PP_LanguageIndex)","v":"E-mail of reporting entity"},null,null,null,null,"PP_EmailOfReportingEntity",null,null,null,null,"",null,null,null,{"$f":"\"\"&INDEX(PP_Locale,ROW(),PP_LanguageIndex)","v":"E-mail of reporting entity"},"E-mail of reporting entity",null,null,"Regnskabsaflæggende virksomheds e-mail",null,null,null,null,null,null,null,null,null,null,null,null,null,null,null,null,null,null,null,null,null,null,null,null,null,null,null,null,null,null,null,null,null,null,null,null,null,null,null,null,null,null,null,null,null,null,null,null,null,null,null,null,null,null,null,null,null,null,null,null,null,null,null,null,null,null,null,null,null,null,null,null,null,null,null,null,null,null,"&allowhtml=false&merge=false",{"$f":"\"pp://General Data/\"&INDEX(PP_Locale,ROW(),1)&\"?taxonomy=\"&PP_TaxonomyId&\"&labellanguage=en&period=1\"&IF(PP_Consolidated,\"_Consolidated\",\"\")&CT58","v":"pp://General Data/E-mail of reporting entity?taxonomy=DKIFRS&labellanguage=en&period=1_Consolidated&allowhtml=false&merge=false"}]
[{"$f":"\"\"&INDEX(PP_Locale,ROW(),PP_LanguageIndex)","v":"Secondary name of reporting entity 1"},null,null,null,null,"PP_SecondaryNameOfReportingEntity_1",null,null,null,null,"",null,null,null,{"$f":"\"\"&INDEX(PP_Locale,ROW(),PP_LanguageIndex)","v":"Secondary name of reporting entity 1"},"Secondary name of reporting entity 1",null,null,"Regnskabsaflæggende virksomheds binavn 1",null,null,null,null,null,null,null,null,null,null,null,null,null,null,null,null,null,null,null,null,null,null,null,null,null,null,null,null,null,null,null,null,null,null,null,null,null,null,null,null,null,null,null,null,null,null,null,null,null,null,null,null,null,null,null,null,null,null,null,null,null,null,null,null,null,null,null,null,null,null,null,null,null,null,null,null,null,null,"&allowhtml=false&merge=false",{"$f":"\"pp://General Data/\"&INDEX(PP_Locale,ROW(),1)&\"?taxonomy=\"&PP_TaxonomyId&\"&labellanguage=en&period=1\"&IF(PP_Consolidated,\"_Consolidated\",\"\")&CT59","v":"pp://General Data/Secondary name of reporting entity 1?taxonomy=DKIFRS&labellanguage=en&period=1_Consolidated&allowhtml=false&merge=false"}]
[{"$f":"\"\"&INDEX(PP_Locale,ROW(),PP_LanguageIndex)","v":"Secondary name of reporting entity 2"},null,null,null,null,"PP_SecondaryNameOfReportingEntity_2",null,null,null,null,"",null,null,null,{"$f":"\"\"&INDEX(PP_Locale,ROW(),PP_LanguageIndex)","v":"Secondary name of reporting entity 2"},"Secondary name of reporting entity 2",null,null,"Regnskabsaflæggende virksomheds binavn 2",null,null,null,null,null,null,null,null,null,null,null,null,null,null,null,null,null,null,null,null,null,null,null,null,null,null,null,null,null,null,null,null,null,null,null,null,null,null,null,null,null,null,null,null,null,null,null,null,null,null,null,null,null,null,null,null,null,null,null,null,null,null,null,null,null,null,null,null,null,null,null,null,null,null,null,null,null,null,"&allowhtml=false&merge=false",{"$f":"\"pp://General Data/\"&INDEX(PP_Locale,ROW(),1)&\"?taxonomy=\"&PP_TaxonomyId&\"&labellanguage=en&period=1\"&IF(PP_Consolidated,\"_Consolidated\",\"\")&CT60","v":"pp://General Data/Secondary name of reporting entity 2?taxonomy=DKIFRS&labellanguage=en&period=1_Consolidated&allowhtml=false&merge=false"}]
[{"$f":"\"\"&INDEX(PP_Locale,ROW(),PP_LanguageIndex)","v":"Secondary name of reporting entity 3"},null,null,null,null,"PP_SecondaryNameOfReportingEntity_3",null,null,null,null,"",null,null,null,{"$f":"\"\"&INDEX(PP_Locale,ROW(),PP_LanguageIndex)","v":"Secondary name of reporting entity 3"},"Secondary name of reporting entity 3",null,null,"Regnskabsaflæggende virksomheds binavn 3",null,null,null,null,null,null,null,null,null,null,null,null,null,null,null,null,null,null,null,null,null,null,null,null,null,null,null,null,null,null,null,null,null,null,null,null,null,null,null,null,null,null,null,null,null,null,null,null,null,null,null,null,null,null,null,null,null,null,null,null,null,null,null,null,null,null,null,null,null,null,null,null,null,null,null,null,null,null,"&allowhtml=false&merge=false",{"$f":"\"pp://General Data/\"&INDEX(PP_Locale,ROW(),1)&\"?taxonomy=\"&PP_TaxonomyId&\"&labellanguage=en&period=1\"&IF(PP_Consolidated,\"_Consolidated\",\"\")&CT61","v":"pp://General Data/Secondary name of reporting entity 3?taxonomy=DKIFRS&labellanguage=en&period=1_Consolidated&allowhtml=false&merge=false"}]
[{"$f":"\"\"&INDEX(PP_Locale,ROW(),PP_LanguageIndex)","v":"Link to corporate governance report"},null,null,null,null,"PP_LinkToCorporateGovernanceReport",null,null,null,null,"",null,null,null,{"$f":"\"\"&INDEX(PP_Locale,ROW(),PP_LanguageIndex)","v":"Link to corporate governance report"},"Link to corporate governance report",null,null,"Link til redegørelse for virksomhedsledelse",null,null,null,null,null,null,null,null,null,null,null,null,null,null,null,null,null,null,null,null,null,null,null,null,null,null,null,null,null,null,null,null,null,null,null,null,null,null,null,null,null,null,null,null,null,null,null,null,null,null,null,null,null,null,null,null,null,null,null,null,null,null,null,null,null,null,null,null,null,null,null,null,null,null,null,null,null,null,"&allowhtml=false&merge=false",{"$f":"\"pp://General Data/\"&INDEX(PP_Locale,ROW(),1)&\"?taxonomy=\"&PP_TaxonomyId&\"&labellanguage=en&period=1\"&IF(PP_Consolidated,\"_Consolidated\",\"\")&CT62","v":"pp://General Data/Link to corporate governance report?taxonomy=DKIFRS&labellanguage=en&period=1_Consolidated&allowhtml=false&merge=false"}]
[{"$f":"\"\"&INDEX(PP_Locale,ROW(),PP_LanguageIndex)","v":"Link to statement of corporate social responsibility"},null,null,null,null,"PP_LinkToStatementOfCorporateSocialResponsibility",null,null,null,null,"",null,null,null,{"$f":"\"\"&INDEX(PP_Locale,ROW(),PP_LanguageIndex)","v":"Link to statement of corporate social responsibility"},"Link to statement of corporate social responsibility",null,null,"Link til redegørelse for samfundsansvar",null,null,null,null,null,null,null,null,null,null,null,null,null,null,null,null,null,null,null,null,null,null,null,null,null,null,null,null,null,null,null,null,null,null,null,null,null,null,null,null,null,null,null,null,null,null,null,null,null,null,null,null,null,null,null,null,null,null,null,null,null,null,null,null,null,null,null,null,null,null,null,null,null,null,null,null,null,null,"&allowhtml=false&merge=false",{"$f":"\"pp://General Data/\"&INDEX(PP_Locale,ROW(),1)&\"?taxonomy=\"&PP_TaxonomyId&\"&labellanguage=en&period=1\"&IF(PP_Consolidated,\"_Consolidated\",\"\")&CT63","v":"pp://General Data/Link to statement of corporate social responsibility?taxonomy=DKIFRS&labellanguage=en&period=1_Consolidated&allowhtml=false&merge=false"}]
[{"$f":"\"\"&INDEX(PP_Locale,ROW(),PP_LanguageIndex)","v":"Link to statement of diversity policies"},null,null,null,null,"PP_LinkToStatementOfDiversityPolicies",null,null,null,null,"",null,null,null,{"$f":"\"\"&INDEX(PP_Locale,ROW(),PP_LanguageIndex)","v":"Link to statement of diversity policies"},"Link to statement of diversity policies",null,null,"Link til redegørelse for politikker om mangfoldighed",null,null,null,null,null,null,null,null,null,null,null,null,null,null,null,null,null,null,null,null,null,null,null,null,null,null,null,null,null,null,null,null,null,null,null,null,null,null,null,null,null,null,null,null,null,null,null,null,null,null,null,null,null,null,null,null,null,null,null,null,null,null,null,null,null,null,null,null,null,null,null,null,null,null,null,null,null,null,"&allowhtml=false&merge=false",{"$f":"\"pp://General Data/\"&INDEX(PP_Locale,ROW(),1)&\"?taxonomy=\"&PP_TaxonomyId&\"&labellanguage=en&period=1\"&IF(PP_Consolidated,\"_Consolidated\",\"\")&CT64","v":"pp://General Data/Link to statement of diversity policies?taxonomy=DKIFRS&labellanguage=en&period=1_Consolidated&allowhtml=false&merge=false"}]
[{"$f":"\"\"&INDEX(PP_Locale,ROW(),PP_LanguageIndex)","v":"Link to statement of target figures and policies for the underrepresented gender"},null,null,null,null,"PP_LinkToStatementOfTargetFiguresAndPoliciesForTheUnderrepresentedGender",null,null,null,null,"",null,null,null,{"$f":"\"\"&INDEX(PP_Locale,ROW(),PP_LanguageIndex)","v":"Link to statement of target figures and policies for the underrepresented gender"},"Link to statement of target figures and policies for the underrepresented gender",null,null,"Link til redegørelse for måltal og politikker vedrørende det underrepræsenterede køn",null,null,null,null,null,null,null,null,null,null,null,null,null,null,null,null,null,null,null,null,null,null,null,null,null,null,null,null,null,null,null,null,null,null,null,null,null,null,null,null,null,null,null,null,null,null,null,null,null,null,null,null,null,null,null,null,null,null,null,null,null,null,null,null,null,null,null,null,null,null,null,null,null,null,null,null,null,null,"&allowhtml=false&merge=false",{"$f":"\"pp://General Data/\"&INDEX(PP_Locale,ROW(),1)&\"?taxonomy=\"&PP_TaxonomyId&\"&labellanguage=en&period=1\"&IF(PP_Consolidated,\"_Consolidated\",\"\")&CT65","v":"pp://General Data/Link to statement of target figures and policies for the underrepresented gender?taxonomy=DKIFRS&labellanguage=en&period=1_Consolidated&allowhtml=false&merge=false"}]
[{"$f":"\"\"&INDEX(PP_Locale,ROW(),PP_LanguageIndex)","v":"Link to statement of policy for data ethics"},null,null,null,null,"PP_LinkToStatementOfPolicyForDataEthics",null,null,null,null,"",null,null,null,{"$f":"\"\"&INDEX(PP_Locale,ROW(),PP_LanguageIndex)","v":"Link to statement of policy for data ethics"},"Link to statement of policy for data ethics",null,null,"Link til redegørelse for virksomhedens politik for dataetik",null,null,null,null,null,null,null,null,null,null,null,null,null,null,null,null,null,null,null,null,null,null,null,null,null,null,null,null,null,null,null,null,null,null,null,null,null,null,null,null,null,null,null,null,null,null,null,null,null,null,null,null,null,null,null,null,null,null,null,null,null,null,null,null,null,null,null,null,null,null,null,null,null,null,null,null,null,null,"&allowhtml=false&merge=false",{"$f":"\"pp://General Data/\"&INDEX(PP_Locale,ROW(),1)&\"?taxonomy=\"&PP_TaxonomyId&\"&labellanguage=en&period=1\"&IF(PP_Consolidated,\"_Consolidated\",\"\")&CT66","v":"pp://General Data/Link to statement of policy for data ethics?taxonomy=DKIFRS&labellanguage=en&period=1_Consolidated&allowhtml=false&merge=false"}]
[{"$f":"\"\"&INDEX(PP_Locale,ROW(),PP_LanguageIndex)","v":"Link to report on payments to authorities"},null,null,null,null,"PP_LinkToReportOnPaymentsToAuthorities",null,null,null,null,"",null,null,null,{"$f":"\"\"&INDEX(PP_Locale,ROW(),PP_LanguageIndex)","v":"Link to report on payments to authorities"},"Link to report on payments to authorities",null,null,"Link til beretning om betalinger til myndigheder",null,null,null,null,null,null,null,null,null,null,null,null,null,null,null,null,null,null,null,null,null,null,null,null,null,null,null,null,null,null,null,null,null,null,null,null,null,null,null,null,null,null,null,null,null,null,null,null,null,null,null,null,null,null,null,null,null,null,null,null,null,null,null,null,null,null,null,null,null,null,null,null,null,null,null,null,null,null,"&allowhtml=false&merge=false",{"$f":"\"pp://General Data/\"&INDEX(PP_Locale,ROW(),1)&\"?taxonomy=\"&PP_TaxonomyId&\"&labellanguage=en&period=1\"&IF(PP_Consolidated,\"_Consolidated\",\"\")&CT67","v":"pp://General Data/Link to report on payments to authorities?taxonomy=DKIFRS&labellanguage=en&period=1_Consolidated&allowhtml=false&merge=false"}]
[{"$f":"\"\"&INDEX(PP_Locale,ROW(),PP_LanguageIndex)","v":"Link to statement of good management concerning foundation"},null,null,null,null,"PP_LinkToStatementOfGoodManagementConcerningFoundation",null,null,null,null,"",null,null,null,{"$f":"\"\"&INDEX(PP_Locale,ROW(),PP_LanguageIndex)","v":"Link to statement of good management concerning foundation"},"Link to statement of good management concerning foundation",null,null,"Link til redegørelse for god fondsledelse",null,null,null,null,null,null,null,null,null,null,null,null,null,null,null,null,null,null,null,null,null,null,null,null,null,null,null,null,null,null,null,null,null,null,null,null,null,null,null,null,null,null,null,null,null,null,null,null,null,null,null,null,null,null,null,null,null,null,null,null,null,null,null,null,null,null,null,null,null,null,null,null,null,null,null,null,null,null,"&allowhtml=false&merge=false",{"$f":"\"pp://General Data/\"&INDEX(PP_Locale,ROW(),1)&\"?taxonomy=\"&PP_TaxonomyId&\"&labellanguage=en&period=1\"&IF(PP_Consolidated,\"_Consolidated\",\"\")&CT68","v":"pp://General Data/Link to statement of good management concerning foundation?taxonomy=DKIFRS&labellanguage=en&period=1_Consolidated&allowhtml=false&merge=false"}]
[{"$f":"\"\"&INDEX(PP_Locale,ROW(),PP_LanguageIndex)","v":"Link to statement of the foundation's distribution policy"},null,null,null,null,"PP_LinkToStatementOfTheFoundationsDistributionPolicy",null,null,null,null,"",null,null,null,{"$f":"\"\"&INDEX(PP_Locale,ROW(),PP_LanguageIndex)","v":"Link to statement of the foundation's distribution policy"},"Link to statement of the foundation's distribution policy",null,null,"Link til redegørelse for fondens uddelingspolitik",null,null,null,null,null,null,null,null,null,null,null,null,null,null,null,null,null,null,null,null,null,null,null,null,null,null,null,null,null,null,null,null,null,null,null,null,null,null,null,null,null,null,null,null,null,null,null,null,null,null,null,null,null,null,null,null,null,null,null,null,null,null,null,null,null,null,null,null,null,null,null,null,null,null,null,null,null,null,"&allowhtml=false&merge=false",{"$f":"\"pp://General Data/\"&INDEX(PP_Locale,ROW(),1)&\"?taxonomy=\"&PP_TaxonomyId&\"&labellanguage=en&period=1\"&IF(PP_Consolidated,\"_Consolidated\",\"\")&CT69","v":"pp://General Data/Link to statement of the foundation's distribution policy?taxonomy=DKIFRS&labellanguage=en&period=1_Consolidated&allowhtml=false&merge=false"}]
[{"$f":"\"\"&INDEX(PP_Locale,ROW(),PP_LanguageIndex)","v":"Average number of employees"},null,null,null,null,"PP_AverageNumberOfEmployees",null,null,null,null,{"$f":"IF(COUNTBLANK(B70),\"\",B70)","v":""},{"$f":"IF(COUNTBLANK(C70),\"\",C70)","v":""},{"$f":"IF(COUNTBLANK(D70),\"\",D70)","v":""},{"$f":"IF(COUNTBLANK(E70),\"\",E70)","v":""},{"$f":"\"\"&INDEX(PP_Locale,ROW(),PP_LanguageIndex)","v":"Average number of employees"},"Average number of employees",null,null,"Gennemsnitligt antal ansatte"]
[null,null,null,null,null,null,null,null,null,null,null,null,null,null,{"$f":"\"\"&INDEX(PP_Locale,ROW(),PP_LanguageIndex)","v":""}]
[{"$f":"\"\"&INDEX(PP_Locale,ROW(),PP_LanguageIndex)","v":"Dates/locations:"},null,null,null,null,null,null,null,null,null,null,null,null,null,{"$f":"\"\"&INDEX(PP_Locale,ROW(),PP_LanguageIndex)","v":"Dates/locations:"},"Dates/locations:",null,null,"Datoer/lokationer:"]
[{"$f":"\"\"&INDEX(PP_Locale,ROW(),PP_LanguageIndex)","v":"Place of signature of statement by management"},null,null,null,null,"PP_PlaceOfSignatureOfStatement",null,null,null,null,{"$f":"IF(A73=\"\",\"\",\"\"&B73)","v":""},null,null,null,{"$f":"\"\"&INDEX(PP_Locale,ROW(),PP_LanguageIndex)","v":"Place of signature of statement by management"},"Place of signature of statement by management",null,null,"Ledelsespåtegning, sted",null,null,null,null,null,null,null,null,null,null,null,null,null,null,null,null,null,null,null,null,null,null,null,null,null,null,null,null,null,null,null,null,null,null,null,null,null,null,null,null,null,null,null,null,null,null,null,null,null,null,null,null,null,null,null,null,null,null,null,null,null,null,null,null,null,null,null,null,null,null,null,null,null,null,null,null,null,null,"&allowhtml=false&merge=false",{"$f":"\"pp://General Data/\"&INDEX(PP_Locale,ROW(),1)&\"?taxonomy=\"&PP_TaxonomyId&\"&labellanguage=en&period=1\"&IF(PP_Consolidated,\"_Consolidated\",\"\")&CT73","v":"pp://General Data/Place of signature of statement by management?taxonomy=DKIFRS&labellanguage=en&period=1_Consolidated&allowhtml=false&merge=false"}]
[{"$f":"\"\"&INDEX(PP_Locale,ROW(),PP_LanguageIndex)","v":"Date of approval of annual report"},null,null,null,null,"PP_DateOfApprovalOfAnnualReport",null,null,null,null,{"$f":"IF(COUNTBLANK(B74),\"\",TEXT(YEAR(B74),\"0000\")&\"-\"&TEXT(MONTH(B74),\"00\")&\"-\"&TEXT(DAY(B74),\"00\"))","v":""},null,null,null,{"$f":"\"\"&INDEX(PP_Locale,ROW(),PP_LanguageIndex)","v":"Date of approval of annual report"},"Date of approval of annual report",null,null,"Dato for ledelsens godkendelse af årsrapporten",null,null,null,null,null,null,null,null,null,null,null,null,null,null,null,null,null,null,null,null,null,null,null,null,null,null,null,null,null,null,null,null,null,null,null,null,null,null,null,null,null,null,null,null,null,null,null,null,null,null,null,null,null,null,null,null,null,null,null,null,null,null,null,null,null,null,null,null,null,null,null,null,null,null,null,null,null,null,"&allowhtml=false&merge=false",{"$f":"\"pp://General Data/\"&INDEX(PP_Locale,ROW(),1)&\"?taxonomy=\"&PP_TaxonomyId&\"&labellanguage=en&period=1\"&IF(PP_Consolidated,\"_Consolidated\",\"\")&CT74","v":"pp://General Data/Date of approval of annual report?taxonomy=DKIFRS&labellanguage=en&period=1_Consolidated&allowhtml=false&merge=false"}]
[null,null,null,null,null,null,null,null,null,null,null,null,null,null,{"$f":"\"\"&INDEX(PP_Locale,ROW(),PP_LanguageIndex)","v":""}]
[{"$f":"\"\"&INDEX(PP_Locale,ROW(),PP_LanguageIndex)","v":"Executive board:"},null,null,null,null,null,null,null,null,null,null,null,null,null,{"$f":"\"\"&INDEX(PP_Locale,ROW(),PP_LanguageIndex)","v":"Executive board:"},"Executive board:",null,null,"Direktion:"]
[{"$f":"\"\"&INDEX(PP_Locale,ROW(),PP_LanguageIndex)","v":"Name and surname of member of executive board 1"},null,null,null,null,"PP_NameAndSurnameOfMemberOfExecutiveBoard_1",null,null,null,null,{"$f":"\"\"&B77","v":""},null,null,null,{"$f":"\"\"&INDEX(PP_Locale,ROW(),PP_LanguageIndex)","v":"Name and surname of member of executive board 1"},"Name and surname of member of executive board 1",null,null,"Direktionsmedlems navn 1",null,null,null,null,null,null,null,null,null,null,null,null,null,null,null,null,null,null,null,null,null,null,null,null,null,null,null,null,null,null,null,null,null,null,null,null,null,null,null,null,null,null,null,null,null,null,null,null,null,null,null,null,null,null,null,null,null,null,null,null,null,null,null,null,null,null,null,null,null,null,null,null,null,null,null,null,null,null,"&allowhtml=false&merge=false",{"$f":"\"pp://General Data/\"&INDEX(PP_Locale,ROW(),1)&\"?taxonomy=\"&PP_TaxonomyId&\"&labellanguage=en&period=1\"&IF(PP_Consolidated,\"_Consolidated\",\"\")&CT77","v":"pp://General Data/Name and surname of member of executive board 1?taxonomy=DKIFRS&labellanguage=en&period=1_Consolidated&allowhtml=false&merge=false"}]
[{"$f":"\"\"&INDEX(PP_Locale,ROW(),PP_LanguageIndex)","v":"Title of member of executive board 1"},null,null,null,null,"PP_TitleOfMemberOfExecutiveBoard_1",null,null,null,null,"",null,null,null,{"$f":"\"\"&INDEX(PP_Locale,ROW(),PP_LanguageIndex)","v":"Title of member of executive board 1"},"Title of member of executive board 1",null,null,"Direktionsmedlems titel 1",null,null,null,null,null,null,null,null,null,null,null,null,null,null,null,null,null,null,null,null,null,null,null,null,null,null,null,null,null,null,null,null,null,null,null,null,null,null,null,null,null,null,null,null,null,null,null,null,null,null,null,null,null,null,null,null,null,null,null,null,null,null,null,null,null,null,null,null,null,null,null,null,null,null,null,null,null,null,"&allowhtml=false&merge=false",{"$f":"\"pp://General Data/\"&INDEX(PP_Locale,ROW(),1)&\"?taxonomy=\"&PP_TaxonomyId&\"&labellanguage=en&period=1\"&IF(PP_Consolidated,\"_Consolidated\",\"\")&CT78","v":"pp://General Data/Title of member of executive board 1?taxonomy=DKIFRS&labellanguage=en&period=1_Consolidated&allowhtml=false&merge=false"}]
[{"$f":"\"\"&INDEX(PP_Locale,ROW(),PP_LanguageIndex)","v":"Name and surname of member of executive board 2"},null,null,null,null,"PP_NameAndSurnameOfMemberOfExecutiveBoard_2",null,null,null,null,"",null,null,null,{"$f":"\"\"&INDEX(PP_Locale,ROW(),PP_LanguageIndex)","v":"Name and surname of member of executive board 2"},"Name and surname of member of executive board 2",null,null,"Direktionsmedlems navn 2",null,null,null,null,null,null,null,null,null,null,null,null,null,null,null,null,null,null,null,null,null,null,null,null,null,null,null,null,null,null,null,null,null,null,null,null,null,null,null,null,null,null,null,null,null,null,null,null,null,null,null,null,null,null,null,null,null,null,null,null,null,null,null,null,null,null,null,null,null,null,null,null,null,null,null,null,null,null,"&allowhtml=false&merge=false",{"$f":"\"pp://General Data/\"&INDEX(PP_Locale,ROW(),1)&\"?taxonomy=\"&PP_TaxonomyId&\"&labellanguage=en&period=1\"&IF(PP_Consolidated,\"_Consolidated\",\"\")&CT79","v":"pp://General Data/Name and surname of member of executive board 2?taxonomy=DKIFRS&labellanguage=en&period=1_Consolidated&allowhtml=false&merge=false"}]
[{"$f":"\"\"&INDEX(PP_Locale,ROW(),PP_LanguageIndex)","v":"Title of member of executive board 2"},null,null,null,null,"PP_TitleOfMemberOfExecutiveBoard_2",null,null,null,null,"",null,null,null,{"$f":"\"\"&INDEX(PP_Locale,ROW(),PP_LanguageIndex)","v":"Title of member of executive board 2"},"Title of member of executive board 2",null,null,"Direktionsmedlems titel 2",null,null,null,null,null,null,null,null,null,null,null,null,null,null,null,null,null,null,null,null,null,null,null,null,null,null,null,null,null,null,null,null,null,null,null,null,null,null,null,null,null,null,null,null,null,null,null,null,null,null,null,null,null,null,null,null,null,null,null,null,null,null,null,null,null,null,null,null,null,null,null,null,null,null,null,null,null,null,"&allowhtml=false&merge=false",{"$f":"\"pp://General Data/\"&INDEX(PP_Locale,ROW(),1)&\"?taxonomy=\"&PP_TaxonomyId&\"&labellanguage=en&period=1\"&IF(PP_Consolidated,\"_Consolidated\",\"\")&CT80","v":"pp://General Data/Title of member of executive board 2?taxonomy=DKIFRS&labellanguage=en&period=1_Consolidated&allowhtml=false&merge=false"}]
[{"$f":"\"\"&INDEX(PP_Locale,ROW(),PP_LanguageIndex)","v":"Name and surname of member of executive board 3"},null,null,null,null,"PP_NameAndSurnameOfMemberOfExecutiveBoard_3",null,null,null,null,"",null,null,null,{"$f":"\"\"&INDEX(PP_Locale,ROW(),PP_LanguageIndex)","v":"Name and surname of member of executive board 3"},"Name and surname of member of executive board 3",null,null,"Direktionsmedlems navn 3",null,null,null,null,null,null,null,null,null,null,null,null,null,null,null,null,null,null,null,null,null,null,null,null,null,null,null,null,null,null,null,null,null,null,null,null,null,null,null,null,null,null,null,null,null,null,null,null,null,null,null,null,null,null,null,null,null,null,null,null,null,null,null,null,null,null,null,null,null,null,null,null,null,null,null,null,null,null,"&allowhtml=false&merge=false",{"$f":"\"pp://General Data/\"&INDEX(PP_Locale,ROW(),1)&\"?taxonomy=\"&PP_TaxonomyId&\"&labellanguage=en&period=1\"&IF(PP_Consolidated,\"_Consolidated\",\"\")&CT81","v":"pp://General Data/Name and surname of member of executive board 3?taxonomy=DKIFRS&labellanguage=en&period=1_Consolidated&allowhtml=false&merge=false"}]
[{"$f":"\"\"&INDEX(PP_Locale,ROW(),PP_LanguageIndex)","v":"Title of member of executive board 3"},null,null,null,null,"PP_TitleOfMemberOfExecutiveBoard_3",null,null,null,null,"",null,null,null,{"$f":"\"\"&INDEX(PP_Locale,ROW(),PP_LanguageIndex)","v":"Title of member of executive board 3"},"Title of member of executive board 3",null,null,"Direktionsmedlems titel 3",null,null,null,null,null,null,null,null,null,null,null,null,null,null,null,null,null,null,null,null,null,null,null,null,null,null,null,null,null,null,null,null,null,null,null,null,null,null,null,null,null,null,null,null,null,null,null,null,null,null,null,null,null,null,null,null,null,null,null,null,null,null,null,null,null,null,null,null,null,null,null,null,null,null,null,null,null,null,"&allowhtml=false&merge=false",{"$f":"\"pp://General Data/\"&INDEX(PP_Locale,ROW(),1)&\"?taxonomy=\"&PP_TaxonomyId&\"&labellanguage=en&period=1\"&IF(PP_Consolidated,\"_Consolidated\",\"\")&CT82","v":"pp://General Data/Title of member of executive board 3?taxonomy=DKIFRS&labellanguage=en&period=1_Consolidated&allowhtml=false&merge=false"}]
[{"$f":"\"\"&INDEX(PP_Locale,ROW(),PP_LanguageIndex)","v":"Name and surname of member of executive board 4"},null,null,null,null,"PP_NameAndSurnameOfMemberOfExecutiveBoard_4",null,null,null,null,"",null,null,null,{"$f":"\"\"&INDEX(PP_Locale,ROW(),PP_LanguageIndex)","v":"Name and surname of member of executive board 4"},"Name and surname of member of executive board 4",null,null,"Direktionsmedlems navn 4",null,null,null,null,null,null,null,null,null,null,null,null,null,null,null,null,null,null,null,null,null,null,null,null,null,null,null,null,null,null,null,null,null,null,null,null,null,null,null,null,null,null,null,null,null,null,null,null,null,null,null,null,null,null,null,null,null,null,null,null,null,null,null,null,null,null,null,null,null,null,null,null,null,null,null,null,null,null,"&allowhtml=false&merge=false",{"$f":"\"pp://General Data/\"&INDEX(PP_Locale,ROW(),1)&\"?taxonomy=\"&PP_TaxonomyId&\"&labellanguage=en&period=1\"&IF(PP_Consolidated,\"_Consolidated\",\"\")&CT83","v":"pp://General Data/Name and surname of member of executive board 4?taxonomy=DKIFRS&labellanguage=en&period=1_Consolidated&allowhtml=false&merge=false"}]
[{"$f":"\"\"&INDEX(PP_Locale,ROW(),PP_LanguageIndex)","v":"Title of member of executive board 4"},null,null,null,null,"PP_TitleOfMemberOfExecutiveBoard_4",null,null,null,null,"",null,null,null,{"$f":"\"\"&INDEX(PP_Locale,ROW(),PP_LanguageIndex)","v":"Title of member of executive board 4"},"Title of member of executive board 4",null,null,"Direktionsmedlems titel 4",null,null,null,null,null,null,null,null,null,null,null,null,null,null,null,null,null,null,null,null,null,null,null,null,null,null,null,null,null,null,null,null,null,null,null,null,null,null,null,null,null,null,null,null,null,null,null,null,null,null,null,null,null,null,null,null,null,null,null,null,null,null,null,null,null,null,null,null,null,null,null,null,null,null,null,null,null,null,"&allowhtml=false&merge=false",{"$f":"\"pp://General Data/\"&INDEX(PP_Locale,ROW(),1)&\"?taxonomy=\"&PP_TaxonomyId&\"&labellanguage=en&period=1\"&IF(PP_Consolidated,\"_Consolidated\",\"\")&CT84","v":"pp://General Data/Title of member of executive board 4?taxonomy=DKIFRS&labellanguage=en&period=1_Consolidated&allowhtml=false&merge=false"}]
[{"$f":"\"\"&INDEX(PP_Locale,ROW(),PP_LanguageIndex)","v":"Name and surname of member of executive board 5"},null,null,null,null,"PP_NameAndSurnameOfMemberOfExecutiveBoard_5",null,null,null,null,"",null,null,null,{"$f":"\"\"&INDEX(PP_Locale,ROW(),PP_LanguageIndex)","v":"Name and surname of member of executive board 5"},"Name and surname of member of executive board 5",null,null,"Direktionsmedlems navn 5",null,null,null,null,null,null,null,null,null,null,null,null,null,null,null,null,null,null,null,null,null,null,null,null,null,null,null,null,null,null,null,null,null,null,null,null,null,null,null,null,null,null,null,null,null,null,null,null,null,null,null,null,null,null,null,null,null,null,null,null,null,null,null,null,null,null,null,null,null,null,null,null,null,null,null,null,null,null,"&allowhtml=false&merge=false",{"$f":"\"pp://General Data/\"&INDEX(PP_Locale,ROW(),1)&\"?taxonomy=\"&PP_TaxonomyId&\"&labellanguage=en&period=1\"&IF(PP_Consolidated,\"_Consolidated\",\"\")&CT85","v":"pp://General Data/Name and surname of member of executive board 5?taxonomy=DKIFRS&labellanguage=en&period=1_Consolidated&allowhtml=false&merge=false"}]
[{"$f":"\"\"&INDEX(PP_Locale,ROW(),PP_LanguageIndex)","v":"Title of member of executive board 5"},null,null,null,null,"PP_TitleOfMemberOfExecutiveBoard_5",null,null,null,null,"",null,null,null,{"$f":"\"\"&INDEX(PP_Locale,ROW(),PP_LanguageIndex)","v":"Title of member of executive board 5"},"Title of member of executive board 5",null,null,"Direktionsmedlems titel 5",null,null,null,null,null,null,null,null,null,null,null,null,null,null,null,null,null,null,null,null,null,null,null,null,null,null,null,null,null,null,null,null,null,null,null,null,null,null,null,null,null,null,null,null,null,null,null,null,null,null,null,null,null,null,null,null,null,null,null,null,null,null,null,null,null,null,null,null,null,null,null,null,null,null,null,null,null,null,"&allowhtml=false&merge=false",{"$f":"\"pp://General Data/\"&INDEX(PP_Locale,ROW(),1)&\"?taxonomy=\"&PP_TaxonomyId&\"&labellanguage=en&period=1\"&IF(PP_Consolidated,\"_Consolidated\",\"\")&CT86","v":"pp://General Data/Title of member of executive board 5?taxonomy=DKIFRS&labellanguage=en&period=1_Consolidated&allowhtml=false&merge=false"}]
[{"$f":"\"\"&INDEX(PP_Locale,ROW(),PP_LanguageIndex)","v":"Name and surname of member of executive board 6"},null,null,null,null,"PP_NameAndSurnameOfMemberOfExecutiveBoard_6",null,null,null,null,"",null,null,null,{"$f":"\"\"&INDEX(PP_Locale,ROW(),PP_LanguageIndex)","v":"Name and surname of member of executive board 6"},"Name and surname of member of executive board 6",null,null,"Direktionsmedlems navn 6",null,null,null,null,null,null,null,null,null,null,null,null,null,null,null,null,null,null,null,null,null,null,null,null,null,null,null,null,null,null,null,null,null,null,null,null,null,null,null,null,null,null,null,null,null,null,null,null,null,null,null,null,null,null,null,null,null,null,null,null,null,null,null,null,null,null,null,null,null,null,null,null,null,null,null,null,null,null,"&allowhtml=false&merge=false",{"$f":"\"pp://General Data/\"&INDEX(PP_Locale,ROW(),1)&\"?taxonomy=\"&PP_TaxonomyId&\"&labellanguage=en&period=1\"&IF(PP_Consolidated,\"_Consolidated\",\"\")&CT87","v":"pp://General Data/Name and surname of member of executive board 6?taxonomy=DKIFRS&labellanguage=en&period=1_Consolidated&allowhtml=false&merge=false"}]
[{"$f":"\"\"&INDEX(PP_Locale,ROW(),PP_LanguageIndex)","v":"Title of member of executive board 6"},null,null,null,null,"PP_TitleOfMemberOfExecutiveBoard_6",null,null,null,null,"",null,null,null,{"$f":"\"\"&INDEX(PP_Locale,ROW(),PP_LanguageIndex)","v":"Title of member of executive board 6"},"Title of member of executive board 6",null,null,"Direktionsmedlems titel 6",null,null,null,null,null,null,null,null,null,null,null,null,null,null,null,null,null,null,null,null,null,null,null,null,null,null,null,null,null,null,null,null,null,null,null,null,null,null,null,null,null,null,null,null,null,null,null,null,null,null,null,null,null,null,null,null,null,null,null,null,null,null,null,null,null,null,null,null,null,null,null,null,null,null,null,null,null,null,"&allowhtml=false&merge=false",{"$f":"\"pp://General Data/\"&INDEX(PP_Locale,ROW(),1)&\"?taxonomy=\"&PP_TaxonomyId&\"&labellanguage=en&period=1\"&IF(PP_Consolidated,\"_Consolidated\",\"\")&CT88","v":"pp://General Data/Title of member of executive board 6?taxonomy=DKIFRS&labellanguage=en&period=1_Consolidated&allowhtml=false&merge=false"}]
[null,null,null,null,null,null,null,null,null,null,null,null,null,null,{"$f":"\"\"&INDEX(PP_Locale,ROW(),PP_LanguageIndex)","v":""}]
[{"$f":"\"\"&INDEX(PP_Locale,ROW(),PP_LanguageIndex)","v":"Supervisory board:"},null,null,null,null,null,null,null,null,null,null,null,null,null,{"$f":"\"\"&INDEX(PP_Locale,ROW(),PP_LanguageIndex)","v":"Supervisory board:"},"Supervisory board:",null,null,"Bestyrelse:"]
[{"$f":"\"\"&INDEX(PP_Locale,ROW(),PP_LanguageIndex)","v":"Name and surname of member of supervisory board 1"},null,null,null,null,"PP_NameAndSurnameOfMemberOfSupervisoryBoard_1",null,null,null,null,{"$f":"\"\"&B91","v":""},null,null,null,{"$f":"\"\"&INDEX(PP_Locale,ROW(),PP_LanguageIndex)","v":"Name and surname of member of supervisory board 1"},"Name and surname of member of supervisory board 1",null,null,"Bestyrelsesmedlems navn 1",null,null,null,null,null,null,null,null,null,null,null,null,null,null,null,null,null,null,null,null,null,null,null,null,null,null,null,null,null,null,null,null,null,null,null,null,null,null,null,null,null,null,null,null,null,null,null,null,null,null,null,null,null,null,null,null,null,null,null,null,null,null,null,null,null,null,null,null,null,null,null,null,null,null,null,null,null,null,"&allowhtml=false&merge=false",{"$f":"\"pp://General Data/\"&INDEX(PP_Locale,ROW(),1)&\"?taxonomy=\"&PP_TaxonomyId&\"&labellanguage=en&period=1\"&IF(PP_Consolidated,\"_Consolidated\",\"\")&CT91","v":"pp://General Data/Name and surname of member of supervisory board 1?taxonomy=DKIFRS&labellanguage=en&period=1_Consolidated&allowhtml=false&merge=false"}]
[{"$f":"\"\"&INDEX(PP_Locale,ROW(),PP_LanguageIndex)","v":"Title of member of supervisory board 1"},null,null,null,null,"PP_TitleOfMemberOfSupervisoryBoard_1",null,null,null,null,"",null,null,null,{"$f":"\"\"&INDEX(PP_Locale,ROW(),PP_LanguageIndex)","v":"Title of member of supervisory board 1"},"Title of member of supervisory board 1",null,null,"Bestyrelsesmedlems titel 1",null,null,null,null,null,null,null,null,null,null,null,null,null,null,null,null,null,null,null,null,null,null,null,null,null,null,null,null,null,null,null,null,null,null,null,null,null,null,null,null,null,null,null,null,null,null,null,null,null,null,null,null,null,null,null,null,null,null,null,null,null,null,null,null,null,null,null,null,null,null,null,null,null,null,null,null,null,null,"&allowhtml=false&merge=false",{"$f":"\"pp://General Data/\"&INDEX(PP_Locale,ROW(),1)&\"?taxonomy=\"&PP_TaxonomyId&\"&labellanguage=en&period=1\"&IF(PP_Consolidated,\"_Consolidated\",\"\")&CT92","v":"pp://General Data/Title of member of supervisory board 1?taxonomy=DKIFRS&labellanguage=en&period=1_Consolidated&allowhtml=false&merge=false"}]
[{"$f":"\"\"&INDEX(PP_Locale,ROW(),PP_LanguageIndex)","v":"Name and surname of member of supervisory board 2"},null,null,null,null,"PP_NameAndSurnameOfMemberOfSupervisoryBoard_2",null,null,null,null,"",null,null,null,{"$f":"\"\"&INDEX(PP_Locale,ROW(),PP_LanguageIndex)","v":"Name and surname of member of supervisory board 2"},"Name and surname of member of supervisory board 2",null,null,"Bestyrelsesmedlems navn 2",null,null,null,null,null,null,null,null,null,null,null,null,null,null,null,null,null,null,null,null,null,null,null,null,null,null,null,null,null,null,null,null,null,null,null,null,null,null,null,null,null,null,null,null,null,null,null,null,null,null,null,null,null,null,null,null,null,null,null,null,null,null,null,null,null,null,null,null,null,null,null,null,null,null,null,null,null,null,"&allowhtml=false&merge=false",{"$f":"\"pp://General Data/\"&INDEX(PP_Locale,ROW(),1)&\"?taxonomy=\"&PP_TaxonomyId&\"&labellanguage=en&period=1\"&IF(PP_Consolidated,\"_Consolidated\",\"\")&CT93","v":"pp://General Data/Name and surname of member of supervisory board 2?taxonomy=DKIFRS&labellanguage=en&period=1_Consolidated&allowhtml=false&merge=false"}]
[{"$f":"\"\"&INDEX(PP_Locale,ROW(),PP_LanguageIndex)","v":"Title of member of supervisory board 2"},null,null,null,null,"PP_TitleOfMemberOfSupervisoryBoard_2",null,null,null,null,"",null,null,null,{"$f":"\"\"&INDEX(PP_Locale,ROW(),PP_LanguageIndex)","v":"Title of member of supervisory board 2"},"Title of member of supervisory board 2",null,null,"Bestyrelsesmedlems titel 2",null,null,null,null,null,null,null,null,null,null,null,null,null,null,null,null,null,null,null,null,null,null,null,null,null,null,null,null,null,null,null,null,null,null,null,null,null,null,null,null,null,null,null,null,null,null,null,null,null,null,null,null,null,null,null,null,null,null,null,null,null,null,null,null,null,null,null,null,null,null,null,null,null,null,null,null,null,null,"&allowhtml=false&merge=false",{"$f":"\"pp://General Data/\"&INDEX(PP_Locale,ROW(),1)&\"?taxonomy=\"&PP_TaxonomyId&\"&labellanguage=en&period=1\"&IF(PP_Consolidated,\"_Consolidated\",\"\")&CT94","v":"pp://General Data/Title of member of supervisory board 2?taxonomy=DKIFRS&labellanguage=en&period=1_Consolidated&allowhtml=false&merge=false"}]
[{"$f":"\"\"&INDEX(PP_Locale,ROW(),PP_LanguageIndex)","v":"Name and surname of member of supervisory board 3"},null,null,null,null,"PP_NameAndSurnameOfMemberOfSupervisoryBoard_3",null,null,null,null,"",null,null,null,{"$f":"\"\"&INDEX(PP_Locale,ROW(),PP_LanguageIndex)","v":"Name and surname of member of supervisory board 3"},"Name and surname of member of supervisory board 3",null,null,"Bestyrelsesmedlems navn 3",null,null,null,null,null,null,null,null,null,null,null,null,null,null,null,null,null,null,null,null,null,null,null,null,null,null,null,null,null,null,null,null,null,null,null,null,null,null,null,null,null,null,null,null,null,null,null,null,null,null,null,null,null,null,null,null,null,null,null,null,null,null,null,null,null,null,null,null,null,null,null,null,null,null,null,null,null,null,"&allowhtml=false&merge=false",{"$f":"\"pp://General Data/\"&INDEX(PP_Locale,ROW(),1)&\"?taxonomy=\"&PP_TaxonomyId&\"&labellanguage=en&period=1\"&IF(PP_Consolidated,\"_Consolidated\",\"\")&CT95","v":"pp://General Data/Name and surname of member of supervisory board 3?taxonomy=DKIFRS&labellanguage=en&period=1_Consolidated&allowhtml=false&merge=false"}]
[{"$f":"\"\"&INDEX(PP_Locale,ROW(),PP_LanguageIndex)","v":"Title of member of supervisory board 3"},null,null,null,null,"PP_TitleOfMemberOfSupervisoryBoard_3",null,null,null,null,"",null,null,null,{"$f":"\"\"&INDEX(PP_Locale,ROW(),PP_LanguageIndex)","v":"Title of member of supervisory board 3"},"Title of member of supervisory board 3",null,null,"Bestyrelsesmedlems titel 3",null,null,null,null,null,null,null,null,null,null,null,null,null,null,null,null,null,null,null,null,null,null,null,null,null,null,null,null,null,null,null,null,null,null,null,null,null,null,null,null,null,null,null,null,null,null,null,null,null,null,null,null,null,null,null,null,null,null,null,null,null,null,null,null,null,null,null,null,null,null,null,null,null,null,null,null,null,null,"&allowhtml=false&merge=false",{"$f":"\"pp://General Data/\"&INDEX(PP_Locale,ROW(),1)&\"?taxonomy=\"&PP_TaxonomyId&\"&labellanguage=en&period=1\"&IF(PP_Consolidated,\"_Consolidated\",\"\")&CT96","v":"pp://General Data/Title of member of supervisory board 3?taxonomy=DKIFRS&labellanguage=en&period=1_Consolidated&allowhtml=false&merge=false"}]
[{"$f":"\"\"&INDEX(PP_Locale,ROW(),PP_LanguageIndex)","v":"Name and surname of member of supervisory board 4"},null,null,null,null,"PP_NameAndSurnameOfMemberOfSupervisoryBoard_4",null,null,null,null,"",null,null,null,{"$f":"\"\"&INDEX(PP_Locale,ROW(),PP_LanguageIndex)","v":"Name and surname of member of supervisory board 4"},"Name and surname of member of supervisory board 4",null,null,"Bestyrelsesmedlems navn 4",null,null,null,null,null,null,null,null,null,null,null,null,null,null,null,null,null,null,null,null,null,null,null,null,null,null,null,null,null,null,null,null,null,null,null,null,null,null,null,null,null,null,null,null,null,null,null,null,null,null,null,null,null,null,null,null,null,null,null,null,null,null,null,null,null,null,null,null,null,null,null,null,null,null,null,null,null,null,"&allowhtml=false&merge=false",{"$f":"\"pp://General Data/\"&INDEX(PP_Locale,ROW(),1)&\"?taxonomy=\"&PP_TaxonomyId&\"&labellanguage=en&period=1\"&IF(PP_Consolidated,\"_Consolidated\",\"\")&CT97","v":"pp://General Data/Name and surname of member of supervisory board 4?taxonomy=DKIFRS&labellanguage=en&period=1_Consolidated&allowhtml=false&merge=false"}]
[{"$f":"\"\"&INDEX(PP_Locale,ROW(),PP_LanguageIndex)","v":"Title of member of supervisory board 4"},null,null,null,null,"PP_TitleOfMemberOfSupervisoryBoard_4",null,null,null,null,"",null,null,null,{"$f":"\"\"&INDEX(PP_Locale,ROW(),PP_LanguageIndex)","v":"Title of member of supervisory board 4"},"Title of member of supervisory board 4",null,null,"Bestyrelsesmedlems titel 4",null,null,null,null,null,null,null,null,null,null,null,null,null,null,null,null,null,null,null,null,null,null,null,null,null,null,null,null,null,null,null,null,null,null,null,null,null,null,null,null,null,null,null,null,null,null,null,null,null,null,null,null,null,null,null,null,null,null,null,null,null,null,null,null,null,null,null,null,null,null,null,null,null,null,null,null,null,null,"&allowhtml=false&merge=false",{"$f":"\"pp://General Data/\"&INDEX(PP_Locale,ROW(),1)&\"?taxonomy=\"&PP_TaxonomyId&\"&labellanguage=en&period=1\"&IF(PP_Consolidated,\"_Consolidated\",\"\")&CT98","v":"pp://General Data/Title of member of supervisory board 4?taxonomy=DKIFRS&labellanguage=en&period=1_Consolidated&allowhtml=false&merge=false"}]
[{"$f":"\"\"&INDEX(PP_Locale,ROW(),PP_LanguageIndex)","v":"Name and surname of member of supervisory board 5"},null,null,null,null,"PP_NameAndSurnameOfMemberOfSupervisoryBoard_5",null,null,null,null,"",null,null,null,{"$f":"\"\"&INDEX(PP_Locale,ROW(),PP_LanguageIndex)","v":"Name and surname of member of supervisory board 5"},"Name and surname of member of supervisory board 5",null,null,"Bestyrelsesmedlems navn 5",null,null,null,null,null,null,null,null,null,null,null,null,null,null,null,null,null,null,null,null,null,null,null,null,null,null,null,null,null,null,null,null,null,null,null,null,null,null,null,null,null,null,null,null,null,null,null,null,null,null,null,null,null,null,null,null,null,null,null,null,null,null,null,null,null,null,null,null,null,null,null,null,null,null,null,null,null,null,"&allowhtml=false&merge=false",{"$f":"\"pp://General Data/\"&INDEX(PP_Locale,ROW(),1)&\"?taxonomy=\"&PP_TaxonomyId&\"&labellanguage=en&period=1\"&IF(PP_Consolidated,\"_Consolidated\",\"\")&CT99","v":"pp://General Data/Name and surname of member of supervisory board 5?taxonomy=DKIFRS&labellanguage=en&period=1_Consolidated&allowhtml=false&merge=false"}]
[{"$f":"\"\"&INDEX(PP_Locale,ROW(),PP_LanguageIndex)","v":"Title of member of supervisory board 5"},null,null,null,null,"PP_TitleOfMemberOfSupervisoryBoard_5",null,null,null,null,"",null,null,null,{"$f":"\"\"&INDEX(PP_Locale,ROW(),PP_LanguageIndex)","v":"Title of member of supervisory board 5"},"Title of member of supervisory board 5",null,null,"Bestyrelsesmedlems titel 5",null,null,null,null,null,null,null,null,null,null,null,null,null,null,null,null,null,null,null,null,null,null,null,null,null,null,null,null,null,null,null,null,null,null,null,null,null,null,null,null,null,null,null,null,null,null,null,null,null,null,null,null,null,null,null,null,null,null,null,null,null,null,null,null,null,null,null,null,null,null,null,null,null,null,null,null,null,null,"&allowhtml=false&merge=false",{"$f":"\"pp://General Data/\"&INDEX(PP_Locale,ROW(),1)&\"?taxonomy=\"&PP_TaxonomyId&\"&labellanguage=en&period=1\"&IF(PP_Consolidated,\"_Consolidated\",\"\")&CT100","v":"pp://General Data/Title of member of supervisory board 5?taxonomy=DKIFRS&labellanguage=en&period=1_Consolidated&allowhtml=false&merge=false"}]
[{"$f":"\"\"&INDEX(PP_Locale,ROW(),PP_LanguageIndex)","v":"Name and surname of member of supervisory board 6"},null,null,null,null,"PP_NameAndSurnameOfMemberOfSupervisoryBoard_6",null,null,null,null,"",null,null,null,{"$f":"\"\"&INDEX(PP_Locale,ROW(),PP_LanguageIndex)","v":"Name and surname of member of supervisory board 6"},"Name and surname of member of supervisory board 6",null,null,"Bestyrelsesmedlems navn 6",null,null,null,null,null,null,null,null,null,null,null,null,null,null,null,null,null,null,null,null,null,null,null,null,null,null,null,null,null,null,null,null,null,null,null,null,null,null,null,null,null,null,null,null,null,null,null,null,null,null,null,null,null,null,null,null,null,null,null,null,null,null,null,null,null,null,null,null,null,null,null,null,null,null,null,null,null,null,"&allowhtml=false&merge=false",{"$f":"\"pp://General Data/\"&INDEX(PP_Locale,ROW(),1)&\"?taxonomy=\"&PP_TaxonomyId&\"&labellanguage=en&period=1\"&IF(PP_Consolidated,\"_Consolidated\",\"\")&CT101","v":"pp://General Data/Name and surname of member of supervisory board 6?taxonomy=DKIFRS&labellanguage=en&period=1_Consolidated&allowhtml=false&merge=false"}]
[{"$f":"\"\"&INDEX(PP_Locale,ROW(),PP_LanguageIndex)","v":"Title of member of supervisory board 6"},null,null,null,null,"PP_TitleOfMemberOfSupervisoryBoard_6",null,null,null,null,"",null,null,null,{"$f":"\"\"&INDEX(PP_Locale,ROW(),PP_LanguageIndex)","v":"Title of member of supervisory board 6"},"Title of member of supervisory board 6",null,null,"Bestyrelsesmedlems titel 6",null,null,null,null,null,null,null,null,null,null,null,null,null,null,null,null,null,null,null,null,null,null,null,null,null,null,null,null,null,null,null,null,null,null,null,null,null,null,null,null,null,null,null,null,null,null,null,null,null,null,null,null,null,null,null,null,null,null,null,null,null,null,null,null,null,null,null,null,null,null,null,null,null,null,null,null,null,null,"&allowhtml=false&merge=false",{"$f":"\"pp://General Data/\"&INDEX(PP_Locale,ROW(),1)&\"?taxonomy=\"&PP_TaxonomyId&\"&labellanguage=en&period=1\"&IF(PP_Consolidated,\"_Consolidated\",\"\")&CT102","v":"pp://General Data/Title of member of supervisory board 6?taxonomy=DKIFRS&labellanguage=en&period=1_Consolidated&allowhtml=false&merge=false"}]
[{"$f":"\"\"&INDEX(PP_Locale,ROW(),PP_LanguageIndex)","v":"Name and surname of member of supervisory board 7"},null,null,null,null,"PP_NameAndSurnameOfMemberOfSupervisoryBoard_7",null,null,null,null,"",null,null,null,{"$f":"\"\"&INDEX(PP_Locale,ROW(),PP_LanguageIndex)","v":"Name and surname of member of supervisory board 7"},"Name and surname of member of supervisory board 7",null,null,"Bestyrelsesmedlems navn 7",null,null,null,null,null,null,null,null,null,null,null,null,null,null,null,null,null,null,null,null,null,null,null,null,null,null,null,null,null,null,null,null,null,null,null,null,null,null,null,null,null,null,null,null,null,null,null,null,null,null,null,null,null,null,null,null,null,null,null,null,null,null,null,null,null,null,null,null,null,null,null,null,null,null,null,null,null,null,"&allowhtml=false&merge=false",{"$f":"\"pp://General Data/\"&INDEX(PP_Locale,ROW(),1)&\"?taxonomy=\"&PP_TaxonomyId&\"&labellanguage=en&period=1\"&IF(PP_Consolidated,\"_Consolidated\",\"\")&CT103","v":"pp://General Data/Name and surname of member of supervisory board 7?taxonomy=DKIFRS&labellanguage=en&period=1_Consolidated&allowhtml=false&merge=false"}]
[{"$f":"\"\"&INDEX(PP_Locale,ROW(),PP_LanguageIndex)","v":"Title of member of supervisory board 7"},null,null,null,null,"PP_TitleOfMemberOfSupervisoryBoard_7",null,null,null,null,"",null,null,null,{"$f":"\"\"&INDEX(PP_Locale,ROW(),PP_LanguageIndex)","v":"Title of member of supervisory board 7"},"Title of member of supervisory board 7",null,null,"Bestyrelsesmedlems titel 7",null,null,null,null,null,null,null,null,null,null,null,null,null,null,null,null,null,null,null,null,null,null,null,null,null,null,null,null,null,null,null,null,null,null,null,null,null,null,null,null,null,null,null,null,null,null,null,null,null,null,null,null,null,null,null,null,null,null,null,null,null,null,null,null,null,null,null,null,null,null,null,null,null,null,null,null,null,null,"&allowhtml=false&merge=false",{"$f":"\"pp://General Data/\"&INDEX(PP_Locale,ROW(),1)&\"?taxonomy=\"&PP_TaxonomyId&\"&labellanguage=en&period=1\"&IF(PP_Consolidated,\"_Consolidated\",\"\")&CT104","v":"pp://General Data/Title of member of supervisory board 7?taxonomy=DKIFRS&labellanguage=en&period=1_Consolidated&allowhtml=false&merge=false"}]
[{"$f":"\"\"&INDEX(PP_Locale,ROW(),PP_LanguageIndex)","v":"Name and surname of member of supervisory board 8"},null,null,null,null,"PP_NameAndSurnameOfMemberOfSupervisoryBoard_8",null,null,null,null,"",null,null,null,{"$f":"\"\"&INDEX(PP_Locale,ROW(),PP_LanguageIndex)","v":"Name and surname of member of supervisory board 8"},"Name and surname of member of supervisory board 8",null,null,"Bestyrelsesmedlems navn 8",null,null,null,null,null,null,null,null,null,null,null,null,null,null,null,null,null,null,null,null,null,null,null,null,null,null,null,null,null,null,null,null,null,null,null,null,null,null,null,null,null,null,null,null,null,null,null,null,null,null,null,null,null,null,null,null,null,null,null,null,null,null,null,null,null,null,null,null,null,null,null,null,null,null,null,null,null,null,"&allowhtml=false&merge=false",{"$f":"\"pp://General Data/\"&INDEX(PP_Locale,ROW(),1)&\"?taxonomy=\"&PP_TaxonomyId&\"&labellanguage=en&period=1\"&IF(PP_Consolidated,\"_Consolidated\",\"\")&CT105","v":"pp://General Data/Name and surname of member of supervisory board 8?taxonomy=DKIFRS&labellanguage=en&period=1_Consolidated&allowhtml=false&merge=false"}]
[{"$f":"\"\"&INDEX(PP_Locale,ROW(),PP_LanguageIndex)","v":"Title of member of supervisory board 8"},null,null,null,null,"PP_TitleOfMemberOfSupervisoryBoard_8",null,null,null,null,"",null,null,null,{"$f":"\"\"&INDEX(PP_Locale,ROW(),PP_LanguageIndex)","v":"Title of member of supervisory board 8"},"Title of member of supervisory board 8",null,null,"Bestyrelsesmedlems titel 8",null,null,null,null,null,null,null,null,null,null,null,null,null,null,null,null,null,null,null,null,null,null,null,null,null,null,null,null,null,null,null,null,null,null,null,null,null,null,null,null,null,null,null,null,null,null,null,null,null,null,null,null,null,null,null,null,null,null,null,null,null,null,null,null,null,null,null,null,null,null,null,null,null,null,null,null,null,null,"&allowhtml=false&merge=false",{"$f":"\"pp://General Data/\"&INDEX(PP_Locale,ROW(),1)&\"?taxonomy=\"&PP_TaxonomyId&\"&labellanguage=en&period=1\"&IF(PP_Consolidated,\"_Consolidated\",\"\")&CT106","v":"pp://General Data/Title of member of supervisory board 8?taxonomy=DKIFRS&labellanguage=en&period=1_Consolidated&allowhtml=false&merge=false"}]
[{"$f":"\"\"&INDEX(PP_Locale,ROW(),PP_LanguageIndex)","v":"Name and surname of member of supervisory board 9"},null,null,null,null,"PP_NameAndSurnameOfMemberOfSupervisoryBoard_9",null,null,null,null,"",null,null,null,{"$f":"\"\"&INDEX(PP_Locale,ROW(),PP_LanguageIndex)","v":"Name and surname of member of supervisory board 9"},"Name and surname of member of supervisory board 9",null,null,"Bestyrelsesmedlems navn 9",null,null,null,null,null,null,null,null,null,null,null,null,null,null,null,null,null,null,null,null,null,null,null,null,null,null,null,null,null,null,null,null,null,null,null,null,null,null,null,null,null,null,null,null,null,null,null,null,null,null,null,null,null,null,null,null,null,null,null,null,null,null,null,null,null,null,null,null,null,null,null,null,null,null,null,null,null,null,"&allowhtml=false&merge=false",{"$f":"\"pp://General Data/\"&INDEX(PP_Locale,ROW(),1)&\"?taxonomy=\"&PP_TaxonomyId&\"&labellanguage=en&period=1\"&IF(PP_Consolidated,\"_Consolidated\",\"\")&CT107","v":"pp://General Data/Name and surname of member of supervisory board 9?taxonomy=DKIFRS&labellanguage=en&period=1_Consolidated&allowhtml=false&merge=false"}]
[{"$f":"\"\"&INDEX(PP_Locale,ROW(),PP_LanguageIndex)","v":"Title of member of supervisory board 9"},null,null,null,null,"PP_TitleOfMemberOfSupervisoryBoard_9",null,null,null,null,"",null,null,null,{"$f":"\"\"&INDEX(PP_Locale,ROW(),PP_LanguageIndex)","v":"Title of member of supervisory board 9"},"Title of member of supervisory board 9",null,null,"Bestyrelsesmedlems titel 9",null,null,null,null,null,null,null,null,null,null,null,null,null,null,null,null,null,null,null,null,null,null,null,null,null,null,null,null,null,null,null,null,null,null,null,null,null,null,null,null,null,null,null,null,null,null,null,null,null,null,null,null,null,null,null,null,null,null,null,null,null,null,null,null,null,null,null,null,null,null,null,null,null,null,null,null,null,null,"&allowhtml=false&merge=false",{"$f":"\"pp://General Data/\"&INDEX(PP_Locale,ROW(),1)&\"?taxonomy=\"&PP_TaxonomyId&\"&labellanguage=en&period=1\"&IF(PP_Consolidated,\"_Consolidated\",\"\")&CT108","v":"pp://General Data/Title of member of supervisory board 9?taxonomy=DKIFRS&labellanguage=en&period=1_Consolidated&allowhtml=false&merge=false"}]
[{"$f":"\"\"&INDEX(PP_Locale,ROW(),PP_LanguageIndex)","v":"Name and surname of member of supervisory board 10"},null,null,null,null,"PP_NameAndSurnameOfMemberOfSupervisoryBoard_10",null,null,null,null,"",null,null,null,{"$f":"\"\"&INDEX(PP_Locale,ROW(),PP_LanguageIndex)","v":"Name and surname of member of supervisory board 10"},"Name and surname of member of supervisory board 10",null,null,"Bestyrelsesmedlems navn 10",null,null,null,null,null,null,null,null,null,null,null,null,null,null,null,null,null,null,null,null,null,null,null,null,null,null,null,null,null,null,null,null,null,null,null,null,null,null,null,null,null,null,null,null,null,null,null,null,null,null,null,null,null,null,null,null,null,null,null,null,null,null,null,null,null,null,null,null,null,null,null,null,null,null,null,null,null,null,"&allowhtml=false&merge=false",{"$f":"\"pp://General Data/\"&INDEX(PP_Locale,ROW(),1)&\"?taxonomy=\"&PP_TaxonomyId&\"&labellanguage=en&period=1\"&IF(PP_Consolidated,\"_Consolidated\",\"\")&CT109","v":"pp://General Data/Name and surname of member of supervisory board 10?taxonomy=DKIFRS&labellanguage=en&period=1_Consolidated&allowhtml=false&merge=false"}]
[{"$f":"\"\"&INDEX(PP_Locale,ROW(),PP_LanguageIndex)","v":"Title of member of supervisory board 10"},null,null,null,null,"PP_TitleOfMemberOfSupervisoryBoard_10",null,null,null,null,"",null,null,null,{"$f":"\"\"&INDEX(PP_Locale,ROW(),PP_LanguageIndex)","v":"Title of member of supervisory board 10"},"Title of member of supervisory board 10",null,null,"Bestyrelsesmedlems titel 10",null,null,null,null,null,null,null,null,null,null,null,null,null,null,null,null,null,null,null,null,null,null,null,null,null,null,null,null,null,null,null,null,null,null,null,null,null,null,null,null,null,null,null,null,null,null,null,null,null,null,null,null,null,null,null,null,null,null,null,null,null,null,null,null,null,null,null,null,null,null,null,null,null,null,null,null,null,null,"&allowhtml=false&merge=false",{"$f":"\"pp://General Data/\"&INDEX(PP_Locale,ROW(),1)&\"?taxonomy=\"&PP_TaxonomyId&\"&labellanguage=en&period=1\"&IF(PP_Consolidated,\"_Consolidated\",\"\")&CT110","v":"pp://General Data/Title of member of supervisory board 10?taxonomy=DKIFRS&labellanguage=en&period=1_Consolidated&allowhtml=false&merge=false"}]
[{"$f":"\"\"&INDEX(PP_Locale,ROW(),PP_LanguageIndex)","v":"Name and surname of member of supervisory board 11"},null,null,null,null,"PP_NameAndSurnameOfMemberOfSupervisoryBoard_11",null,null,null,null,"",null,null,null,{"$f":"\"\"&INDEX(PP_Locale,ROW(),PP_LanguageIndex)","v":"Name and surname of member of supervisory board 11"},"Name and surname of member of supervisory board 11",null,null,"Bestyrelsesmedlems navn 11",null,null,null,null,null,null,null,null,null,null,null,null,null,null,null,null,null,null,null,null,null,null,null,null,null,null,null,null,null,null,null,null,null,null,null,null,null,null,null,null,null,null,null,null,null,null,null,null,null,null,null,null,null,null,null,null,null,null,null,null,null,null,null,null,null,null,null,null,null,null,null,null,null,null,null,null,null,null,"&allowhtml=false&merge=false",{"$f":"\"pp://General Data/\"&INDEX(PP_Locale,ROW(),1)&\"?taxonomy=\"&PP_TaxonomyId&\"&labellanguage=en&period=1\"&IF(PP_Consolidated,\"_Consolidated\",\"\")&CT111","v":"pp://General Data/Name and surname of member of supervisory board 11?taxonomy=DKIFRS&labellanguage=en&period=1_Consolidated&allowhtml=false&merge=false"}]
[{"$f":"\"\"&INDEX(PP_Locale,ROW(),PP_LanguageIndex)","v":"Title of member of supervisory board 11"},null,null,null,null,"PP_TitleOfMemberOfSupervisoryBoard_11",null,null,null,null,"",null,null,null,{"$f":"\"\"&INDEX(PP_Locale,ROW(),PP_LanguageIndex)","v":"Title of member of supervisory board 11"},"Title of member of supervisory board 11",null,null,"Bestyrelsesmedlems titel 11",null,null,null,null,null,null,null,null,null,null,null,null,null,null,null,null,null,null,null,null,null,null,null,null,null,null,null,null,null,null,null,null,null,null,null,null,null,null,null,null,null,null,null,null,null,null,null,null,null,null,null,null,null,null,null,null,null,null,null,null,null,null,null,null,null,null,null,null,null,null,null,null,null,null,null,null,null,null,"&allowhtml=false&merge=false",{"$f":"\"pp://General Data/\"&INDEX(PP_Locale,ROW(),1)&\"?taxonomy=\"&PP_TaxonomyId&\"&labellanguage=en&period=1\"&IF(PP_Consolidated,\"_Consolidated\",\"\")&CT112","v":"pp://General Data/Title of member of supervisory board 11?taxonomy=DKIFRS&labellanguage=en&period=1_Consolidated&allowhtml=false&merge=false"}]
[{"$f":"\"\"&INDEX(PP_Locale,ROW(),PP_LanguageIndex)","v":"Name and surname of member of supervisory board 12"},null,null,null,null,"PP_NameAndSurnameOfMemberOfSupervisoryBoard_12",null,null,null,null,"",null,null,null,{"$f":"\"\"&INDEX(PP_Locale,ROW(),PP_LanguageIndex)","v":"Name and surname of member of supervisory board 12"},"Name and surname of member of supervisory board 12",null,null,"Bestyrelsesmedlems navn 12",null,null,null,null,null,null,null,null,null,null,null,null,null,null,null,null,null,null,null,null,null,null,null,null,null,null,null,null,null,null,null,null,null,null,null,null,null,null,null,null,null,null,null,null,null,null,null,null,null,null,null,null,null,null,null,null,null,null,null,null,null,null,null,null,null,null,null,null,null,null,null,null,null,null,null,null,null,null,"&allowhtml=false&merge=false",{"$f":"\"pp://General Data/\"&INDEX(PP_Locale,ROW(),1)&\"?taxonomy=\"&PP_TaxonomyId&\"&labellanguage=en&period=1\"&IF(PP_Consolidated,\"_Consolidated\",\"\")&CT113","v":"pp://General Data/Name and surname of member of supervisory board 12?taxonomy=DKIFRS&labellanguage=en&period=1_Consolidated&allowhtml=false&merge=false"}]
[{"$f":"\"\"&INDEX(PP_Locale,ROW(),PP_LanguageIndex)","v":"Title of member of supervisory board 12"},null,null,null,null,"PP_TitleOfMemberOfSupervisoryBoard_12",null,null,null,null,"",null,null,null,{"$f":"\"\"&INDEX(PP_Locale,ROW(),PP_LanguageIndex)","v":"Title of member of supervisory board 12"},"Title of member of supervisory board 12",null,null,"Bestyrelsesmedlems titel 12",null,null,null,null,null,null,null,null,null,null,null,null,null,null,null,null,null,null,null,null,null,null,null,null,null,null,null,null,null,null,null,null,null,null,null,null,null,null,null,null,null,null,null,null,null,null,null,null,null,null,null,null,null,null,null,null,null,null,null,null,null,null,null,null,null,null,null,null,null,null,null,null,null,null,null,null,null,null,"&allowhtml=false&merge=false",{"$f":"\"pp://General Data/\"&INDEX(PP_Locale,ROW(),1)&\"?taxonomy=\"&PP_TaxonomyId&\"&labellanguage=en&period=1\"&IF(PP_Consolidated,\"_Consolidated\",\"\")&CT114","v":"pp://General Data/Title of member of supervisory board 12?taxonomy=DKIFRS&labellanguage=en&period=1_Consolidated&allowhtml=false&merge=false"}]
[{"$f":"\"\"&INDEX(PP_Locale,ROW(),PP_LanguageIndex)","v":"Name and surname of member of supervisory board 13"},null,null,null,null,"PP_NameAndSurnameOfMemberOfSupervisoryBoard_13",null,null,null,null,"",null,null,null,{"$f":"\"\"&INDEX(PP_Locale,ROW(),PP_LanguageIndex)","v":"Name and surname of member of supervisory board 13"},"Name and surname of member of supervisory board 13",null,null,"Bestyrelsesmedlems navn 13",null,null,null,null,null,null,null,null,null,null,null,null,null,null,null,null,null,null,null,null,null,null,null,null,null,null,null,null,null,null,null,null,null,null,null,null,null,null,null,null,null,null,null,null,null,null,null,null,null,null,null,null,null,null,null,null,null,null,null,null,null,null,null,null,null,null,null,null,null,null,null,null,null,null,null,null,null,null,"&allowhtml=false&merge=false",{"$f":"\"pp://General Data/\"&INDEX(PP_Locale,ROW(),1)&\"?taxonomy=\"&PP_TaxonomyId&\"&labellanguage=en&period=1\"&IF(PP_Consolidated,\"_Consolidated\",\"\")&CT115","v":"pp://General Data/Name and surname of member of supervisory board 13?taxonomy=DKIFRS&labellanguage=en&period=1_Consolidated&allowhtml=false&merge=false"}]
[{"$f":"\"\"&INDEX(PP_Locale,ROW(),PP_LanguageIndex)","v":"Title of member of supervisory board 13"},null,null,null,null,"PP_TitleOfMemberOfSupervisoryBoard_13",null,null,null,null,"",null,null,null,{"$f":"\"\"&INDEX(PP_Locale,ROW(),PP_LanguageIndex)","v":"Title of member of supervisory board 13"},"Title of member of supervisory board 13",null,null,"Bestyrelsesmedlems titel 13",null,null,null,null,null,null,null,null,null,null,null,null,null,null,null,null,null,null,null,null,null,null,null,null,null,null,null,null,null,null,null,null,null,null,null,null,null,null,null,null,null,null,null,null,null,null,null,null,null,null,null,null,null,null,null,null,null,null,null,null,null,null,null,null,null,null,null,null,null,null,null,null,null,null,null,null,null,null,"&allowhtml=false&merge=false",{"$f":"\"pp://General Data/\"&INDEX(PP_Locale,ROW(),1)&\"?taxonomy=\"&PP_TaxonomyId&\"&labellanguage=en&period=1\"&IF(PP_Consolidated,\"_Consolidated\",\"\")&CT116","v":"pp://General Data/Title of member of supervisory board 13?taxonomy=DKIFRS&labellanguage=en&period=1_Consolidated&allowhtml=false&merge=false"}]
[{"$f":"\"\"&INDEX(PP_Locale,ROW(),PP_LanguageIndex)","v":"Name and surname of member of supervisory board 14"},null,null,null,null,"PP_NameAndSurnameOfMemberOfSupervisoryBoard_14",null,null,null,null,"",null,null,null,{"$f":"\"\"&INDEX(PP_Locale,ROW(),PP_LanguageIndex)","v":"Name and surname of member of supervisory board 14"},"Name and surname of member of supervisory board 14",null,null,"Bestyrelsesmedlems navn 14",null,null,null,null,null,null,null,null,null,null,null,null,null,null,null,null,null,null,null,null,null,null,null,null,null,null,null,null,null,null,null,null,null,null,null,null,null,null,null,null,null,null,null,null,null,null,null,null,null,null,null,null,null,null,null,null,null,null,null,null,null,null,null,null,null,null,null,null,null,null,null,null,null,null,null,null,null,null,"&allowhtml=false&merge=false",{"$f":"\"pp://General Data/\"&INDEX(PP_Locale,ROW(),1)&\"?taxonomy=\"&PP_TaxonomyId&\"&labellanguage=en&period=1\"&IF(PP_Consolidated,\"_Consolidated\",\"\")&CT117","v":"pp://General Data/Name and surname of member of supervisory board 14?taxonomy=DKIFRS&labellanguage=en&period=1_Consolidated&allowhtml=false&merge=false"}]
[{"$f":"\"\"&INDEX(PP_Locale,ROW(),PP_LanguageIndex)","v":"Title of member of supervisory board 14"},null,null,null,null,"PP_TitleOfMemberOfSupervisoryBoard_14",null,null,null,null,"",null,null,null,{"$f":"\"\"&INDEX(PP_Locale,ROW(),PP_LanguageIndex)","v":"Title of member of supervisory board 14"},"Title of member of supervisory board 14",null,null,"Bestyrelsesmedlems titel 14",null,null,null,null,null,null,null,null,null,null,null,null,null,null,null,null,null,null,null,null,null,null,null,null,null,null,null,null,null,null,null,null,null,null,null,null,null,null,null,null,null,null,null,null,null,null,null,null,null,null,null,null,null,null,null,null,null,null,null,null,null,null,null,null,null,null,null,null,null,null,null,null,null,null,null,null,null,null,"&allowhtml=false&merge=false",{"$f":"\"pp://General Data/\"&INDEX(PP_Locale,ROW(),1)&\"?taxonomy=\"&PP_TaxonomyId&\"&labellanguage=en&period=1\"&IF(PP_Consolidated,\"_Consolidated\",\"\")&CT118","v":"pp://General Data/Title of member of supervisory board 14?taxonomy=DKIFRS&labellanguage=en&period=1_Consolidated&allowhtml=false&merge=false"}]
[{"$f":"\"\"&INDEX(PP_Locale,ROW(),PP_LanguageIndex)","v":"Name and surname of member of supervisory board 15"},null,null,null,null,"PP_NameAndSurnameOfMemberOfSupervisoryBoard_15",null,null,null,null,"",null,null,null,{"$f":"\"\"&INDEX(PP_Locale,ROW(),PP_LanguageIndex)","v":"Name and surname of member of supervisory board 15"},"Name and surname of member of supervisory board 15",null,null,"Bestyrelsesmedlems navn 15",null,null,null,null,null,null,null,null,null,null,null,null,null,null,null,null,null,null,null,null,null,null,null,null,null,null,null,null,null,null,null,null,null,null,null,null,null,null,null,null,null,null,null,null,null,null,null,null,null,null,null,null,null,null,null,null,null,null,null,null,null,null,null,null,null,null,null,null,null,null,null,null,null,null,null,null,null,null,"&allowhtml=false&merge=false",{"$f":"\"pp://General Data/\"&INDEX(PP_Locale,ROW(),1)&\"?taxonomy=\"&PP_TaxonomyId&\"&labellanguage=en&period=1\"&IF(PP_Consolidated,\"_Consolidated\",\"\")&CT119","v":"pp://General Data/Name and surname of member of supervisory board 15?taxonomy=DKIFRS&labellanguage=en&period=1_Consolidated&allowhtml=false&merge=false"}]
[{"$f":"\"\"&INDEX(PP_Locale,ROW(),PP_LanguageIndex)","v":"Title of member of supervisory board 15"},null,null,null,null,"PP_TitleOfMemberOfSupervisoryBoard_15",null,null,null,null,"",null,null,null,{"$f":"\"\"&INDEX(PP_Locale,ROW(),PP_LanguageIndex)","v":"Title of member of supervisory board 15"},"Title of member of supervisory board 15",null,null,"Bestyrelsesmedlems titel 15",null,null,null,null,null,null,null,null,null,null,null,null,null,null,null,null,null,null,null,null,null,null,null,null,null,null,null,null,null,null,null,null,null,null,null,null,null,null,null,null,null,null,null,null,null,null,null,null,null,null,null,null,null,null,null,null,null,null,null,null,null,null,null,null,null,null,null,null,null,null,null,null,null,null,null,null,null,null,"&allowhtml=false&merge=false",{"$f":"\"pp://General Data/\"&INDEX(PP_Locale,ROW(),1)&\"?taxonomy=\"&PP_TaxonomyId&\"&labellanguage=en&period=1\"&IF(PP_Consolidated,\"_Consolidated\",\"\")&CT120","v":"pp://General Data/Title of member of supervisory board 15?taxonomy=DKIFRS&labellanguage=en&period=1_Consolidated&allowhtml=false&merge=false"}]
[{"$f":"\"\"&INDEX(PP_Locale,ROW(),PP_LanguageIndex)","v":"Name and surname of member of supervisory board 16"},null,null,null,null,"PP_NameAndSurnameOfMemberOfSupervisoryBoard_16",null,null,null,null,"",null,null,null,{"$f":"\"\"&INDEX(PP_Locale,ROW(),PP_LanguageIndex)","v":"Name and surname of member of supervisory board 16"},"Name and surname of member of supervisory board 16",null,null,"Bestyrelsesmedlems navn 16",null,null,null,null,null,null,null,null,null,null,null,null,null,null,null,null,null,null,null,null,null,null,null,null,null,null,null,null,null,null,null,null,null,null,null,null,null,null,null,null,null,null,null,null,null,null,null,null,null,null,null,null,null,null,null,null,null,null,null,null,null,null,null,null,null,null,null,null,null,null,null,null,null,null,null,null,null,null,"&allowhtml=false&merge=false",{"$f":"\"pp://General Data/\"&INDEX(PP_Locale,ROW(),1)&\"?taxonomy=\"&PP_TaxonomyId&\"&labellanguage=en&period=1\"&IF(PP_Consolidated,\"_Consolidated\",\"\")&CT121","v":"pp://General Data/Name and surname of member of supervisory board 16?taxonomy=DKIFRS&labellanguage=en&period=1_Consolidated&allowhtml=false&merge=false"}]
[{"$f":"\"\"&INDEX(PP_Locale,ROW(),PP_LanguageIndex)","v":"Title of member of supervisory board 16"},null,null,null,null,"PP_TitleOfMemberOfSupervisoryBoard_16",null,null,null,null,"",null,null,null,{"$f":"\"\"&INDEX(PP_Locale,ROW(),PP_LanguageIndex)","v":"Title of member of supervisory board 16"},"Title of member of supervisory board 16",null,null,"Bestyrelsesmedlems titel 16",null,null,null,null,null,null,null,null,null,null,null,null,null,null,null,null,null,null,null,null,null,null,null,null,null,null,null,null,null,null,null,null,null,null,null,null,null,null,null,null,null,null,null,null,null,null,null,null,null,null,null,null,null,null,null,null,null,null,null,null,null,null,null,null,null,null,null,null,null,null,null,null,null,null,null,null,null,null,"&allowhtml=false&merge=false",{"$f":"\"pp://General Data/\"&INDEX(PP_Locale,ROW(),1)&\"?taxonomy=\"&PP_TaxonomyId&\"&labellanguage=en&period=1\"&IF(PP_Consolidated,\"_Consolidated\",\"\")&CT122","v":"pp://General Data/Title of member of supervisory board 16?taxonomy=DKIFRS&labellanguage=en&period=1_Consolidated&allowhtml=false&merge=false"}]
[{"$f":"\"\"&INDEX(PP_Locale,ROW(),PP_LanguageIndex)","v":"Name and surname of member of supervisory board 17"},null,null,null,null,"PP_NameAndSurnameOfMemberOfSupervisoryBoard_17",null,null,null,null,"",null,null,null,{"$f":"\"\"&INDEX(PP_Locale,ROW(),PP_LanguageIndex)","v":"Name and surname of member of supervisory board 17"},"Name and surname of member of supervisory board 17",null,null,"Bestyrelsesmedlems navn 17",null,null,null,null,null,null,null,null,null,null,null,null,null,null,null,null,null,null,null,null,null,null,null,null,null,null,null,null,null,null,null,null,null,null,null,null,null,null,null,null,null,null,null,null,null,null,null,null,null,null,null,null,null,null,null,null,null,null,null,null,null,null,null,null,null,null,null,null,null,null,null,null,null,null,null,null,null,null,"&allowhtml=false&merge=false",{"$f":"\"pp://General Data/\"&INDEX(PP_Locale,ROW(),1)&\"?taxonomy=\"&PP_TaxonomyId&\"&labellanguage=en&period=1\"&IF(PP_Consolidated,\"_Consolidated\",\"\")&CT123","v":"pp://General Data/Name and surname of member of supervisory board 17?taxonomy=DKIFRS&labellanguage=en&period=1_Consolidated&allowhtml=false&merge=false"}]
[{"$f":"\"\"&INDEX(PP_Locale,ROW(),PP_LanguageIndex)","v":"Title of member of supervisory board 17"},null,null,null,null,"PP_TitleOfMemberOfSupervisoryBoard_17",null,null,null,null,"",null,null,null,{"$f":"\"\"&INDEX(PP_Locale,ROW(),PP_LanguageIndex)","v":"Title of member of supervisory board 17"},"Title of member of supervisory board 17",null,null,"Bestyrelsesmedlems titel 17",null,null,null,null,null,null,null,null,null,null,null,null,null,null,null,null,null,null,null,null,null,null,null,null,null,null,null,null,null,null,null,null,null,null,null,null,null,null,null,null,null,null,null,null,null,null,null,null,null,null,null,null,null,null,null,null,null,null,null,null,null,null,null,null,null,null,null,null,null,null,null,null,null,null,null,null,null,null,"&allowhtml=false&merge=false",{"$f":"\"pp://General Data/\"&INDEX(PP_Locale,ROW(),1)&\"?taxonomy=\"&PP_TaxonomyId&\"&labellanguage=en&period=1\"&IF(PP_Consolidated,\"_Consolidated\",\"\")&CT124","v":"pp://General Data/Title of member of supervisory board 17?taxonomy=DKIFRS&labellanguage=en&period=1_Consolidated&allowhtml=false&merge=false"}]
[{"$f":"\"\"&INDEX(PP_Locale,ROW(),PP_LanguageIndex)","v":"Name and surname of member of supervisory board 18"},null,null,null,null,"PP_NameAndSurnameOfMemberOfSupervisoryBoard_18",null,null,null,null,"",null,null,null,{"$f":"\"\"&INDEX(PP_Locale,ROW(),PP_LanguageIndex)","v":"Name and surname of member of supervisory board 18"},"Name and surname of member of supervisory board 18",null,null,"Bestyrelsesmedlems navn 18",null,null,null,null,null,null,null,null,null,null,null,null,null,null,null,null,null,null,null,null,null,null,null,null,null,null,null,null,null,null,null,null,null,null,null,null,null,null,null,null,null,null,null,null,null,null,null,null,null,null,null,null,null,null,null,null,null,null,null,null,null,null,null,null,null,null,null,null,null,null,null,null,null,null,null,null,null,null,"&allowhtml=false&merge=false",{"$f":"\"pp://General Data/\"&INDEX(PP_Locale,ROW(),1)&\"?taxonomy=\"&PP_TaxonomyId&\"&labellanguage=en&period=1\"&IF(PP_Consolidated,\"_Consolidated\",\"\")&CT125","v":"pp://General Data/Name and surname of member of supervisory board 18?taxonomy=DKIFRS&labellanguage=en&period=1_Consolidated&allowhtml=false&merge=false"}]
[{"$f":"\"\"&INDEX(PP_Locale,ROW(),PP_LanguageIndex)","v":"Title of member of supervisory board 18"},null,null,null,null,"PP_TitleOfMemberOfSupervisoryBoard_18",null,null,null,null,"",null,null,null,{"$f":"\"\"&INDEX(PP_Locale,ROW(),PP_LanguageIndex)","v":"Title of member of supervisory board 18"},"Title of member of supervisory board 18",null,null,"Bestyrelsesmedlems titel 18",null,null,null,null,null,null,null,null,null,null,null,null,null,null,null,null,null,null,null,null,null,null,null,null,null,null,null,null,null,null,null,null,null,null,null,null,null,null,null,null,null,null,null,null,null,null,null,null,null,null,null,null,null,null,null,null,null,null,null,null,null,null,null,null,null,null,null,null,null,null,null,null,null,null,null,null,null,null,"&allowhtml=false&merge=false",{"$f":"\"pp://General Data/\"&INDEX(PP_Locale,ROW(),1)&\"?taxonomy=\"&PP_TaxonomyId&\"&labellanguage=en&period=1\"&IF(PP_Consolidated,\"_Consolidated\",\"\")&CT126","v":"pp://General Data/Title of member of supervisory board 18?taxonomy=DKIFRS&labellanguage=en&period=1_Consolidated&allowhtml=false&merge=false"}]
[{"$f":"\"\"&INDEX(PP_Locale,ROW(),PP_LanguageIndex)","v":"Name and surname of member of supervisory board 19"},null,null,null,null,"PP_NameAndSurnameOfMemberOfSupervisoryBoard_19",null,null,null,null,"",null,null,null,{"$f":"\"\"&INDEX(PP_Locale,ROW(),PP_LanguageIndex)","v":"Name and surname of member of supervisory board 19"},"Name and surname of member of supervisory board 19",null,null,"Bestyrelsesmedlems navn 19",null,null,null,null,null,null,null,null,null,null,null,null,null,null,null,null,null,null,null,null,null,null,null,null,null,null,null,null,null,null,null,null,null,null,null,null,null,null,null,null,null,null,null,null,null,null,null,null,null,null,null,null,null,null,null,null,null,null,null,null,null,null,null,null,null,null,null,null,null,null,null,null,null,null,null,null,null,null,"&allowhtml=false&merge=false",{"$f":"\"pp://General Data/\"&INDEX(PP_Locale,ROW(),1)&\"?taxonomy=\"&PP_TaxonomyId&\"&labellanguage=en&period=1\"&IF(PP_Consolidated,\"_Consolidated\",\"\")&CT127","v":"pp://General Data/Name and surname of member of supervisory board 19?taxonomy=DKIFRS&labellanguage=en&period=1_Consolidated&allowhtml=false&merge=false"}]
[{"$f":"\"\"&INDEX(PP_Locale,ROW(),PP_LanguageIndex)","v":"Title of member of supervisory board 19"},null,null,null,null,"PP_TitleOfMemberOfSupervisoryBoard_19",null,null,null,null,"",null,null,null,{"$f":"\"\"&INDEX(PP_Locale,ROW(),PP_LanguageIndex)","v":"Title of member of supervisory board 19"},"Title of member of supervisory board 19",null,null,"Bestyrelsesmedlems titel 19",null,null,null,null,null,null,null,null,null,null,null,null,null,null,null,null,null,null,null,null,null,null,null,null,null,null,null,null,null,null,null,null,null,null,null,null,null,null,null,null,null,null,null,null,null,null,null,null,null,null,null,null,null,null,null,null,null,null,null,null,null,null,null,null,null,null,null,null,null,null,null,null,null,null,null,null,null,null,"&allowhtml=false&merge=false",{"$f":"\"pp://General Data/\"&INDEX(PP_Locale,ROW(),1)&\"?taxonomy=\"&PP_TaxonomyId&\"&labellanguage=en&period=1\"&IF(PP_Consolidated,\"_Consolidated\",\"\")&CT128","v":"pp://General Data/Title of member of supervisory board 19?taxonomy=DKIFRS&labellanguage=en&period=1_Consolidated&allowhtml=false&merge=false"}]
[{"$f":"\"\"&INDEX(PP_Locale,ROW(),PP_LanguageIndex)","v":"Name and surname of member of supervisory board 20"},null,null,null,null,"PP_NameAndSurnameOfMemberOfSupervisoryBoard_20",null,null,null,null,"",null,null,null,{"$f":"\"\"&INDEX(PP_Locale,ROW(),PP_LanguageIndex)","v":"Name and surname of member of supervisory board 20"},"Name and surname of member of supervisory board 20",null,null,"Bestyrelsesmedlems navn 20",null,null,null,null,null,null,null,null,null,null,null,null,null,null,null,null,null,null,null,null,null,null,null,null,null,null,null,null,null,null,null,null,null,null,null,null,null,null,null,null,null,null,null,null,null,null,null,null,null,null,null,null,null,null,null,null,null,null,null,null,null,null,null,null,null,null,null,null,null,null,null,null,null,null,null,null,null,null,"&allowhtml=false&merge=false",{"$f":"\"pp://General Data/\"&INDEX(PP_Locale,ROW(),1)&\"?taxonomy=\"&PP_TaxonomyId&\"&labellanguage=en&period=1\"&IF(PP_Consolidated,\"_Consolidated\",\"\")&CT129","v":"pp://General Data/Name and surname of member of supervisory board 20?taxonomy=DKIFRS&labellanguage=en&period=1_Consolidated&allowhtml=false&merge=false"}]
[{"$f":"\"\"&INDEX(PP_Locale,ROW(),PP_LanguageIndex)","v":"Title of member of supervisory board 20"},null,null,null,null,"PP_TitleOfMemberOfSupervisoryBoard_20",null,null,null,null,"",null,null,null,{"$f":"\"\"&INDEX(PP_Locale,ROW(),PP_LanguageIndex)","v":"Title of member of supervisory board 20"},"Title of member of supervisory board 20",null,null,"Bestyrelsesmedlems titel 20",null,null,null,null,null,null,null,null,null,null,null,null,null,null,null,null,null,null,null,null,null,null,null,null,null,null,null,null,null,null,null,null,null,null,null,null,null,null,null,null,null,null,null,null,null,null,null,null,null,null,null,null,null,null,null,null,null,null,null,null,null,null,null,null,null,null,null,null,null,null,null,null,null,null,null,null,null,null,"&allowhtml=false&merge=false",{"$f":"\"pp://General Data/\"&INDEX(PP_Locale,ROW(),1)&\"?taxonomy=\"&PP_TaxonomyId&\"&labellanguage=en&period=1\"&IF(PP_Consolidated,\"_Consolidated\",\"\")&CT130","v":"pp://General Data/Title of member of supervisory board 20?taxonomy=DKIFRS&labellanguage=en&period=1_Consolidated&allowhtml=false&merge=false"}]
[null,null,null,null,null,null,null,null,null,null,null,null,null,null,{"$f":"\"\"&INDEX(PP_Locale,ROW(),PP_LanguageIndex)","v":""}]
[{"$f":"\"\"&INDEX(PP_Locale,ROW(),PP_LanguageIndex)","v":"Submitting enterprise:"},null,null,null,null,null,null,null,null,null,null,null,null,null,{"$f":"\"\"&INDEX(PP_Locale,ROW(),PP_LanguageIndex)","v":"Submitting enterprise:"},"Submitting enterprise:",null,null,"Indsender:"]
[{"$f":"\"\"&INDEX(PP_Locale,ROW(),PP_LanguageIndex)","v":"Legal Entity Identifier [LEI] of submitting enterprise"},{"$f":"\"\"&PP_LegalEntityIdentifierOfReportingEntity","v":""},null,null,null,"PP_LegalEntityIdentifierOfSubmittingEnterprise",{"$f":"\"\"&PP_LegalEntityIdentifierOfReportingEntity","v":""},null,null,null,{"$f":"\"\"&B133","v":""},null,null,null,{"$f":"\"\"&INDEX(PP_Locale,ROW(),PP_LanguageIndex)","v":"Legal Entity Identifier [LEI] of submitting enterprise"},"Legal Entity Identifier [LEI] of submitting enterprise",null,null,"Indsendende virksomheds LEI-kode"]
[{"$f":"\"\"&INDEX(PP_Locale,ROW(),PP_LanguageIndex)","v":"Identification number [CVR] of submitting enterprise"},{"$f":"\"\"&PP_IdentificationNumberCvrOfReportingEntity","v":"12345678"},null,null,null,"PP_IdentificationNumberCvrOfSubmittingEnterprise",{"$f":"\"\"&PP_IdentificationNumberCvrOfReportingEntity","v":"12345678"},null,null,null,{"$f":"\"\"&SUBSTITUTE(B134,\" \",\"\")","v":"12345678"},null,null,null,{"$f":"\"\"&INDEX(PP_Locale,ROW(),PP_LanguageIndex)","v":"Identification number [CVR] of submitting enterprise"},"Identification number [CVR] of submitting enterprise",null,null,"Indsendende virksomheds CVR-nr."]
[{"$f":"\"\"&INDEX(PP_Locale,ROW(),PP_LanguageIndex)","v":"Name of submitting enterprise"},{"$f":"\"\"&PP_NameOfReportingEntity","v":"Test customer"},null,null,null,"PP_NameOfSubmittingEnterprise",{"$f":"\"\"&PP_NameOfReportingEntity","v":"Test customer"},null,null,null,{"$f":"\"\"&B135","v":"Test customer"},null,null,null,{"$f":"\"\"&INDEX(PP_Locale,ROW(),PP_LanguageIndex)","v":"Name of submitting enterprise"},"Name of submitting enterprise",null,null,"Indsendende virksomheds navn"]
[{"$f":"\"\"&INDEX(PP_Locale,ROW(),PP_LanguageIndex)","v":"Address of submitting enterprise, street and number"},{"$f":"\"\"&PP_AddressOfReportingEntityStreetName&\" \"&PP_AddressOfReportingEntityStreetBuildingIdentifier","v":"UNKNOWN UNKNOWN"},null,null,null,"PP_AddressOfSubmittingEnterpriseStreetAndNumber",{"$f":"\"\"&PP_AddressOfReportingEntityStreetName&\" \"&PP_AddressOfReportingEntityStreetBuildingIdentifier","v":"UNKNOWN UNKNOWN"},null,null,null,{"$f":"\"\"&B136","v":"UNKNOWN UNKNOWN"},null,null,null,{"$f":"\"\"&INDEX(PP_Locale,ROW(),PP_LanguageIndex)","v":"Address of submitting enterprise, street and number"},"Address of submitting enterprise, street and number",null,null,"Indsendende virksomheds adresse, vej og nummer"]
[{"$f":"\"\"&INDEX(PP_Locale,ROW(),PP_LanguageIndex)","v":"Address of submitting enterprise, postcode and town"},{"$f":"\"\"&PP_AddressOfReportingEntityPostCodeIdentifier&\" \"&PP_AddressOfReportingEntityDistrictName","v":"UNKNOWN UNKNOWN"},null,null,null,"PP_AddressOfSubmittingEnterprisePostcodeAndTown",{"$f":"\"\"&PP_AddressOfReportingEntityPostCodeIdentifier&\" \"&PP_AddressOfReportingEntityDistrictName","v":"UNKNOWN UNKNOWN"},null,null,null,{"$f":"\"\"&B137","v":"UNKNOWN UNKNOWN"},null,null,null,{"$f":"\"\"&INDEX(PP_Locale,ROW(),PP_LanguageIndex)","v":"Address of submitting enterprise, postcode and town"},"Address of submitting enterprise, postcode and town",null,null,"Indsendende virksomheds adresse, postnummer og by"]
[null,null,null,null,null,null,null,null,null,null,null,null,null,null,{"$f":"\"\"&INDEX(PP_Locale,ROW(),PP_LanguageIndex)","v":""}]
[{"$f":"IF(A140=\"\",\"\",\"\"&INDEX(PP_Locale,ROW(),PP_LanguageIndex))","v":"Opinion:"},null,null,null,null,null,null,null,null,null,null,null,null,null,{"$f":"\"\"&INDEX(PP_Locale,ROW(),PP_LanguageIndex)","v":"Opinion:"},"Opinion:",null,null,"Konklusion:"]
[{"$f":"IFERROR(INDEX(P$290:S$292,MATCH(PP_TypeOfAuditorAssistance,INDEX(P$264:S$269,,PP_LanguageIndex),0),PP_LanguageIndex),\"\")","v":"Type of opinion on audited financial statements (Audit)"},{"$f":"IFERROR(VLOOKUP(\"Opinion\",PP_Locale,PP_LanguageIndex,FALSE),\"Opinion\")","v":"Opinion"},{"$f":"IFERROR(VLOOKUP(\"Opinion\",PP_Locale,PP_LanguageIndex,FALSE),\"Opinion\")","v":"Opinion"},{"$f":"IFERROR(VLOOKUP(\"Opinion\",PP_Locale,PP_LanguageIndex,FALSE),\"Opinion\")","v":"Opinion"},{"$f":"IFERROR(VLOOKUP(\"Opinion\",PP_Locale,PP_LanguageIndex,FALSE),\"Opinion\")","v":"Opinion"},"PP_TypeOfModifiedOpinion",{"$f":"IFERROR(VLOOKUP(\"Opinion\",PP_Locale,PP_LanguageIndex,FALSE),\"Opinion\")","v":"Opinion"},null,null,null,{"$f":"\"\"&B140","v":"Opinion"},null,null,null,{"$f":"\"\"&INDEX(PP_Locale,ROW(),PP_LanguageIndex)","v":""},{"$f":"IFERROR(INDEX(P$290:S$292,MATCH(\"Michael\",INDEX(P$264:S$269,,PP_LanguageIndex),0),PP_LanguageIndex),\"\")","v":""},null,null,null,null,null,null,null,null,null,null,null,null,null,null,null,null,null,null,null,null,null,null,null,null,null,null,null,null,null,null,null,null,null,null,null,null,null,null,null,null,null,null,null,null,null,null,null,null,null,null,null,null,null,null,null,null,null,null,{"$f":"IFERROR(VLOOKUP(\"Opinion\",PP_Locale,PP_LanguageIndex,FALSE),\"Opinion\")","v":"Opinion"},{"$f":"IFERROR(VLOOKUP(\"Qualified Opinion\",PP_Locale,PP_LanguageIndex,FALSE),\"Qualified Opinion\")","v":"Qualified Opinion"},{"$f":"IFERROR(VLOOKUP(\"Adverse Opinion\",PP_Locale,PP_LanguageIndex,FALSE),\"Adverse Opinion\")","v":"Adverse Opinion"},{"$f":"IFERROR(VLOOKUP(\"Disclaimer of Opinion\",PP_Locale,PP_LanguageIndex,FALSE),\"Disclaimer of Opinion\")","v":"Disclaimer of Opinion"}]
[{"$f":"IFERROR(INDEX(P$287:S$289,MATCH(PP_TypeOfAuditorAssistance,INDEX(P$264:S$269,,PP_LanguageIndex),0),PP_LanguageIndex),\"\")","v":"Type of basis for opinion on audited financial statements (audit)"},{"$f":"IFERROR(VLOOKUP(\"Basis for Opinion\",PP_Locale,PP_LanguageIndex,FALSE),\"Basis for Opinion\")","v":"Basis for Opinion"},{"$f":"IFERROR(VLOOKUP(\"Opinion\",PP_Locale,PP_LanguageIndex,FALSE),\"Opinion\")","v":"Opinion"},{"$f":"IFERROR(VLOOKUP(\"Opinion\",PP_Locale,PP_LanguageIndex,FALSE),\"Opinion\")","v":"Opinion"},{"$f":"IFERROR(VLOOKUP(\"Opinion\",PP_Locale,PP_LanguageIndex,FALSE),\"Opinion\")","v":"Opinion"},"PP_TypeOfBasisForModifiedOpinion",{"$f":"IFERROR(VLOOKUP(\"Basis for Opinion\",PP_Locale,PP_LanguageIndex,FALSE),\"Basis for Opinion\")","v":"Basis for Opinion"},null,null,null,{"$f":"\"\"&B141","v":"Basis for Opinion"},null,null,null,{"$f":"\"\"&INDEX(PP_Locale,ROW(),PP_LanguageIndex)","v":""},null,null,null,null,null,null,null,null,null,null,null,null,null,null,null,null,null,null,null,null,null,null,null,null,null,null,null,null,null,null,null,null,null,null,null,null,null,null,null,null,null,null,null,null,null,null,null,null,null,null,null,null,null,null,null,null,null,null,null,{"$f":"IFERROR(VLOOKUP(\"Basis for Opinion\",PP_Locale,PP_LanguageIndex,FALSE),\"Basis for Opinion\")","v":"Basis for Opinion"},{"$f":"IFERROR(VLOOKUP(\"Basis for Qualified Opinion\",PP_Locale,PP_LanguageIndex,FALSE),\"Basis for Qualified Opinion\")","v":"Basis for Qualified Opinion"},{"$f":"IFERROR(VLOOKUP(\"Basis for Adverse Opinion\",PP_Locale,PP_LanguageIndex,FALSE),\"Basis for Adverse Opinion\")","v":"Basis for Adverse Opinion"},{"$f":"IFERROR(VLOOKUP(\"Basis for Disclaimer of Opinion\",PP_Locale,PP_LanguageIndex,FALSE),\"Basis for Disclaimer of Opinion\")","v":"Basis for Disclaimer of Opinion"}]
[null,null,null,null,null,null,null,null,null,null,null,null,null,null,{"$f":"\"\"&INDEX(PP_Locale,ROW(),PP_LanguageIndex)","v":""}]
[{"$f":"IF(A144=\"\",\"\",\"\"&INDEX(PP_Locale,ROW(),PP_LanguageIndex))","v":"Reporting responsibilities according to the Danish executive order on approved auditors' reports:"},null,null,null,null,null,null,null,null,null,null,null,null,null,{"$f":"\"\"&INDEX(PP_Locale,ROW(),PP_LanguageIndex)","v":"Reporting responsibilities according to the Danish executive order on approved auditors' reports:"},"Reporting responsibilities according to the Danish executive order on approved auditors' reports:",null,null,"Erklæringsforpligtelser i henhold til erklæringsbekendtgørelsen:"]
[{"$f":"IFERROR(INDEX(P$293:S$294,MATCH(PP_TypeOfAuditorAssistance,INDEX(P$264:S$269,,PP_LanguageIndex),0),PP_LanguageIndex),\"\")","v":"Reporting responsibilities according to the Danish executive order on approved auditors' reports especially the criminal code and Fiscal-, tax- and subsidy legislation (Audit)"},null,null,null,null,"PP_ReportingResponsibilitiesAccordingToTheDanishExecutiveOrderOnApprovedAuditorsReportsEspeciallyTheCriminalCodeAndFiscalTaxAndSubsidyLegislation",null,null,null,null,{"$f":"IF(B144=Yes,\"true\",IF(B144=No,\"false\",\"\"))","v":""},null,null,null,{"$f":"\"\"&INDEX(PP_Locale,ROW(),PP_LanguageIndex)","v":""},null,null,null,null,null,null,null,null,null,null,null,null,null,null,null,null,null,null,null,null,null,null,null,null,null,null,null,null,null,null,null,null,null,null,null,null,null,null,null,null,null,null,null,null,null,null,null,null,null,null,null,null,null,null,null,null,null,null,null,{"$f":"Yes","v":"Yes"},{"$f":"No","v":"No"}]
[{"$f":"IFERROR(INDEX(P$295:S$296,MATCH(PP_TypeOfAuditorAssistance,INDEX(P$264:S$269,,PP_LanguageIndex),0),PP_LanguageIndex),\"\")","v":"Reporting responsibilities according to the Danish executive order on approved auditors' reports especially the companies act or equivalent legislation, that the company is subject to (Audit)"},null,null,null,null,"PP_ReportingResponsibilitiesAccordingToTheDanishExecutiveOrderOnApprovedAuditorsReportsEspeciallyTheCompaniesActOrEquivalentLegislationThatTheCompanyIsSubjectTo",null,null,null,null,{"$f":"IF(B145=Yes,\"true\",IF(B145=No,\"false\",\"\"))","v":""},null,null,null,{"$f":"\"\"&INDEX(PP_Locale,ROW(),PP_LanguageIndex)","v":""},null,null,null,null,null,null,null,null,null,null,null,null,null,null,null,null,null,null,null,null,null,null,null,null,null,null,null,null,null,null,null,null,null,null,null,null,null,null,null,null,null,null,null,null,null,null,null,null,null,null,null,null,null,null,null,null,null,null,null,{"$f":"Yes","v":"Yes"},{"$f":"No","v":"No"}]
[{"$f":"IFERROR(INDEX(P$297:S$298,MATCH(PP_TypeOfAuditorAssistance,INDEX(P$264:S$269,,PP_LanguageIndex),0),PP_LanguageIndex),\"\")","v":"Reporting responsibilities according to the Danish executive order on approved auditors' reports especially legislation on financial reporting, including accounting and storage of accounting records (Audit)"},null,null,null,null,"PP_ReportingResponsibilitiesAccordingToTheDanishExecutiveOrderOnApprovedAuditorsReportsEspeciallyLegislationOnFinancialReportingIncludingAccountingAndStorageOfAccountingRecords",null,null,null,null,{"$f":"IF(B146=Yes,\"true\",IF(B146=No,\"false\",\"\"))","v":""},null,null,null,{"$f":"\"\"&INDEX(PP_Locale,ROW(),PP_LanguageIndex)","v":""},null,null,null,null,null,null,null,null,null,null,null,null,null,null,null,null,null,null,null,null,null,null,null,null,null,null,null,null,null,null,null,null,null,null,null,null,null,null,null,null,null,null,null,null,null,null,null,null,null,null,null,null,null,null,null,null,null,null,null,{"$f":"Yes","v":"Yes"},{"$f":"No","v":"No"}]
[{"$f":"IFERROR(INDEX(P$299:S$300,MATCH(PP_TypeOfAuditorAssistance,INDEX(P$264:S$269,,PP_LanguageIndex),0),PP_LanguageIndex),\"\")","v":"Reporting responsibilities according to the Danish executive order on approved auditors' reports especially other matters (Audit)"},null,null,null,null,"PP_ReportingResponsibilitiesAccordingToTheDanishExecutiveOrderOnApprovedAuditorsReportsEspeciallyOtherMatters",null,null,null,null,{"$f":"IF(B147=Yes,\"true\",IF(B147=No,\"false\",\"\"))","v":""},null,null,null,{"$f":"\"\"&INDEX(PP_Locale,ROW(),PP_LanguageIndex)","v":""},null,null,null,null,null,null,null,null,null,null,null,null,null,null,null,null,null,null,null,null,null,null,null,null,null,null,null,null,null,null,null,null,null,null,null,null,null,null,null,null,null,null,null,null,null,null,null,null,null,null,null,null,null,null,null,null,null,null,null,{"$f":"Yes","v":"Yes"},{"$f":"No","v":"No"}]
[null,null,null,null,null,null,null,null,null,null,null,null,null,null,{"$f":"\"\"&INDEX(PP_Locale,ROW(),PP_LanguageIndex)","v":""}]
[{"$f":"IF(PP_TypeOfAuditorAssistance=NoAuditAssistance,\"\",\"\"&INDEX(PP_Locale,ROW(),PP_LanguageIndex))","v":"Dates/locations:"},null,null,null,null,null,null,null,null,null,null,null,null,null,{"$f":"\"\"&INDEX(PP_Locale,ROW(),PP_LanguageIndex)","v":"Dates/locations:"},"Dates/locations:",null,null,"Datoer/lokationer:"]
[{"$f":"IF(PP_TypeOfAuditorAssistance=NoAuditAssistance,\"\",\"\"&INDEX(PP_Locale,ROW(),PP_LanguageIndex))","v":"Signature of auditors, place"},null,null,null,null,"PP_SignatureOfAuditorsPlace",null,null,null,null,{"$f":"IF(A150=\"\",\"\",\"\"&B150)","v":""},null,null,null,{"$f":"\"\"&INDEX(PP_Locale,ROW(),PP_LanguageIndex)","v":"Signature of auditors, place"},"Signature of auditors, place",null,null,"Revisors underskrift, sted",null,null,null,null,null,null,null,null,null,null,null,null,null,null,null,null,null,null,null,null,null,null,null,null,null,null,null,null,null,null,null,null,null,null,null,null,null,null,null,null,null,null,null,null,null,null,null,null,null,null,null,null,null,null,null,null,null,null,null,null,null,null,null,null,null,null,null,null,null,null,null,null,null,null,null,null,null,null,"&allowhtml=false&merge=false",{"$f":"\"pp://General Data/\"&INDEX(PP_Locale,ROW(),1)&\"?taxonomy=\"&PP_TaxonomyId&\"&labellanguage=en&period=1\"&IF(PP_Consolidated,\"_Consolidated\",\"\")&CT150","v":"pp://General Data/Signature of auditors, place?taxonomy=DKIFRS&labellanguage=en&period=1_Consolidated&allowhtml=false&merge=false"}]
[{"$f":"IF(PP_TypeOfAuditorAssistance=NoAuditAssistance,\"\",\"\"&INDEX(PP_Locale,ROW(),PP_LanguageIndex))","v":"Signature of auditors, date"},null,null,null,null,"PP_SignatureOfAuditorsDate",null,null,null,null,{"$f":"IF(COUNTBLANK(B151),\"\",TEXT(YEAR(B151),\"0000\")&\"-\"&TEXT(MONTH(B151),\"00\")&\"-\"&TEXT(DAY(B151),\"00\"))","v":""},null,null,null,{"$f":"\"\"&INDEX(PP_Locale,ROW(),PP_LanguageIndex)","v":"Signature of auditors, date"},"Signature of auditors, date",null,null,"Revisors underskrift, dato",null,null,null,null,null,null,null,null,null,null,null,null,null,null,null,null,null,null,null,null,null,null,null,null,null,null,null,null,null,null,null,null,null,null,null,null,null,null,null,null,null,null,null,null,null,null,null,null,null,null,null,null,null,null,null,null,null,null,null,null,null,null,null,null,null,null,null,null,null,null,null,null,null,null,null,null,null,null,"&allowhtml=false&merge=false",{"$f":"\"pp://General Data/\"&INDEX(PP_Locale,ROW(),1)&\"?taxonomy=\"&PP_TaxonomyId&\"&labellanguage=en&period=1\"&IF(PP_Consolidated,\"_Consolidated\",\"\")&CT151","v":"pp://General Data/Signature of auditors, date?taxonomy=DKIFRS&labellanguage=en&period=1_Consolidated&allowhtml=false&merge=false"}]
[null,null,null,null,null,null,null,null,null,null,null,null,null,null,{"$f":"\"\"&INDEX(PP_Locale,ROW(),PP_LanguageIndex)","v":""}]
[{"$f":"IF(PP_TypeOfAuditorAssistance=NoAuditAssistance,\"\",\"\"&INDEX(PP_Locale,ROW(),PP_LanguageIndex))","v":"Auditor 1:"},null,null,null,null,null,null,null,null,null,null,null,null,null,{"$f":"\"\"&INDEX(PP_Locale,ROW(),PP_LanguageIndex)","v":"Auditor 1:"},"Auditor 1:",null,null,"Revisor 1:"]
[{"$f":"IF(PP_TypeOfAuditorAssistance=NoAuditAssistance,\"\",\"\"&INDEX(PP_Locale,ROW(),PP_LanguageIndex))","v":"Name and surname of auditor 1"},null,null,null,null,"PP_NameAndSurnameOfAuditor_1",null,null,null,null,{"$f":"IF(A154=\"\",\"\",\"\"&B154)","v":""},null,null,null,{"$f":"\"\"&INDEX(PP_Locale,ROW(),PP_LanguageIndex)","v":"Name and surname of auditor 1"},"Name and surname of auditor 1",null,null,"Revisors navn 1",null,null,null,null,null,null,null,null,null,null,null,null,null,null,null,null,null,null,null,null,null,null,null,null,null,null,null,null,null,null,null,null,null,null,null,null,null,null,null,null,null,null,null,null,null,null,null,null,null,null,null,null,null,null,null,null,null,null,null,null,null,null,null,null,null,null,null,null,null,null,null,null,null,null,null,null,null,null,"&allowhtml=false&merge=false",{"$f":"\"pp://General Data/\"&INDEX(PP_Locale,ROW(),1)&\"?taxonomy=\"&PP_TaxonomyId&\"&labellanguage=en&period=1\"&IF(PP_Consolidated,\"_Consolidated\",\"\")&CT154","v":"pp://General Data/Name and surname of auditor 1?taxonomy=DKIFRS&labellanguage=en&period=1_Consolidated&allowhtml=false&merge=false"}]
[{"$f":"IF(PP_TypeOfAuditorAssistance=NoAuditAssistance,\"\",\"\"&INDEX(PP_Locale,ROW(),PP_LanguageIndex))","v":"Description of auditor 1"},null,null,null,null,"PP_DescriptionOfAuditor_1",null,null,null,null,{"$f":"IF(A155=\"\",\"\",\"\"&B155)","v":""},null,null,null,{"$f":"\"\"&INDEX(PP_Locale,ROW(),PP_LanguageIndex)","v":"Description of auditor 1"},"Description of auditor 1",null,null,"Revisors titel 1",null,null,null,null,null,null,null,null,null,null,null,null,null,null,null,null,null,null,null,null,null,null,null,null,null,null,null,null,null,null,null,null,null,null,null,null,null,null,null,null,null,null,null,null,null,null,null,null,null,null,null,null,null,null,null,null,null,null,null,null,null,null,null,null,null,null,null,null,null,null,null,null,null,null,null,null,null,null,"&allowhtml=false&merge=false",{"$f":"\"pp://General Data/\"&INDEX(PP_Locale,ROW(),1)&\"?taxonomy=\"&PP_TaxonomyId&\"&labellanguage=en&period=1\"&IF(PP_Consolidated,\"_Consolidated\",\"\")&CT155","v":"pp://General Data/Description of auditor 1?taxonomy=DKIFRS&labellanguage=en&period=1_Consolidated&allowhtml=false&merge=false"}]
[{"$f":"IF(PP_TypeOfAuditorAssistance=NoAuditAssistance,\"\",\"\"&INDEX(PP_Locale,ROW(),PP_LanguageIndex))","v":"Identification number of auditor 1"},null,null,null,null,"PP_IdentificationNumberOfAuditor_1",null,null,null,null,{"$f":"IF(A156=\"\",\"\",\"\"&B156)","v":""},null,null,null,{"$f":"\"\"&INDEX(PP_Locale,ROW(),PP_LanguageIndex)","v":"Identification number of auditor 1"},"Identification number of auditor 1",null,null,"Revisors MNE-nr. 1",null,null,null,null,null,null,null,null,null,null,null,null,null,null,null,null,null,null,null,null,null,null,null,null,null,null,null,null,null,null,null,null,null,null,null,null,null,null,null,null,null,null,null,null,null,null,null,null,null,null,null,null,null,null,null,null,null,null,null,null,null,null,null,null,null,null,null,null,null,null,null,null,null,null,null,null,null,null,"&allowhtml=false&merge=false",{"$f":"\"pp://General Data/\"&INDEX(PP_Locale,ROW(),1)&\"?taxonomy=\"&PP_TaxonomyId&\"&labellanguage=en&period=1\"&IF(PP_Consolidated,\"_Consolidated\",\"\")&CT156","v":"pp://General Data/Identification number of auditor 1?taxonomy=DKIFRS&labellanguage=en&period=1_Consolidated&allowhtml=false&merge=false"}]
[{"$f":"IF(PP_TypeOfAuditorAssistance=NoAuditAssistance,\"\",\"\"&INDEX(PP_Locale,ROW(),PP_LanguageIndex))","v":"Legal Entity Identifier [LEI] of audit firm 1"},null,null,null,null,"PP_LegalEntityIdentifierOfAuditFirm_1",null,null,null,null,{"$f":"\"\"&B157","v":""},null,null,null,{"$f":"\"\"&INDEX(PP_Locale,ROW(),PP_LanguageIndex)","v":"Legal Entity Identifier [LEI] of audit firm 1"},"Legal Entity Identifier [LEI] of audit firm 1",null,null,"Revisionsvirksomhedens LEI-kode 1",null,null,null,null,null,null,null,null,null,null,null,null,null,null,null,null,null,null,null,null,null,null,null,null,null,null,null,null,null,null,null,null,null,null,null,null,null,null,null,null,null,null,null,null,null,null,null,null,null,null,null,null,null,null,null,null,null,null,null,null,null,null,null,null,null,null,null,null,null,null,null,null,null,null,null,null,null,null,"&allowhtml=false&merge=false",{"$f":"\"pp://General Data/\"&INDEX(PP_Locale,ROW(),1)&\"?taxonomy=\"&PP_TaxonomyId&\"&labellanguage=en&period=1\"&IF(PP_Consolidated,\"_Consolidated\",\"\")&CT157","v":"pp://General Data/Legal Entity Identifier [LEI] of audit firm 1?taxonomy=DKIFRS&labellanguage=en&period=1_Consolidated&allowhtml=false&merge=false"}]
[{"$f":"IF(PP_TypeOfAuditorAssistance=NoAuditAssistance,\"\",\"\"&INDEX(PP_Locale,ROW(),PP_LanguageIndex))","v":"Identification number [CVR] of audit firm 1"},null,null,null,null,"PP_IdentificationNumberCvrOfAuditFirm_1",null,null,null,null,{"$f":"\"\"&SUBSTITUTE(B158,\" \",\"\")","v":""},null,null,null,{"$f":"\"\"&INDEX(PP_Locale,ROW(),PP_LanguageIndex)","v":"Identification number [CVR] of audit firm 1"},"Identification number [CVR] of audit firm 1",null,null,"Revisionsvirksomhedens CVR-nr. 1",null,null,null,null,null,null,null,null,null,null,null,null,null,null,null,null,null,null,null,null,null,null,null,null,null,null,null,null,null,null,null,null,null,null,null,null,null,null,null,null,null,null,null,null,null,null,null,null,null,null,null,null,null,null,null,null,null,null,null,null,null,null,null,null,null,null,null,null,null,null,null,null,null,null,null,null,null,null,"&allowhtml=false&merge=false&skipspace=true",{"$f":"\"pp://General Data/\"&INDEX(PP_Locale,ROW(),1)&\"?taxonomy=\"&PP_TaxonomyId&\"&labellanguage=en&period=1\"&IF(PP_Consolidated,\"_Consolidated\",\"\")&CT158","v":"pp://General Data/Identification number [CVR] of audit firm 1?taxonomy=DKIFRS&labellanguage=en&period=1_Consolidated&allowhtml=false&merge=false&skipspace=true"}]
[{"$f":"IF(PP_TypeOfAuditorAssistance=NoAuditAssistance,\"\",\"\"&INDEX(PP_Locale,ROW(),PP_LanguageIndex))","v":"Identification number [PNR] of audit firm 1"},null,null,null,null,"PP_IdentificationNumberPnrOfAuditFirm_1",null,null,null,null,{"$f":"\"\"&SUBSTITUTE(B159,\"-\",\"\")","v":""},null,null,null,{"$f":"\"\"&INDEX(PP_Locale,ROW(),PP_LanguageIndex)","v":"Identification number [PNR] of audit firm 1"},"Identification number [PNR] of audit firm 1",null,null,"Revisionsvirksomhedens P-nr. 1",null,null,null,null,null,null,null,null,null,null,null,null,null,null,null,null,null,null,null,null,null,null,null,null,null,null,null,null,null,null,null,null,null,null,null,null,null,null,null,null,null,null,null,null,null,null,null,null,null,null,null,null,null,null,null,null,null,null,null,null,null,null,null,null,null,null,null,null,null,null,null,null,null,null,null,null,null,null,"&allowhtml=false&merge=false",{"$f":"\"pp://General Data/\"&INDEX(PP_Locale,ROW(),1)&\"?taxonomy=\"&PP_TaxonomyId&\"&labellanguage=en&period=1\"&IF(PP_Consolidated,\"_Consolidated\",\"\")&CT159","v":"pp://General Data/Identification number [PNR] of audit firm 1?taxonomy=DKIFRS&labellanguage=en&period=1_Consolidated&allowhtml=false&merge=false"}]
[{"$f":"IF(PP_TypeOfAuditorAssistance=NoAuditAssistance,\"\",\"\"&INDEX(PP_Locale,ROW(),PP_LanguageIndex))","v":"Name of audit firm 1"},null,null,null,null,"PP_NameOfAuditFirm_1",null,null,null,null,{"$f":"\"\"&B160","v":""},null,null,null,{"$f":"\"\"&INDEX(PP_Locale,ROW(),PP_LanguageIndex)","v":"Name of audit firm 1"},"Name of audit firm 1",null,null,"Revisionsvirksomhedens navn 1",null,null,null,null,null,null,null,null,null,null,null,null,null,null,null,null,null,null,null,null,null,null,null,null,null,null,null,null,null,null,null,null,null,null,null,null,null,null,null,null,null,null,null,null,null,null,null,null,null,null,null,null,null,null,null,null,null,null,null,null,null,null,null,null,null,null,null,null,null,null,null,null,null,null,null,null,null,null,"&allowhtml=false&merge=false",{"$f":"\"pp://General Data/\"&INDEX(PP_Locale,ROW(),1)&\"?taxonomy=\"&PP_TaxonomyId&\"&labellanguage=en&period=1\"&IF(PP_Consolidated,\"_Consolidated\",\"\")&CT160","v":"pp://General Data/Name of audit firm 1?taxonomy=DKIFRS&labellanguage=en&period=1_Consolidated&allowhtml=false&merge=false"}]
[{"$f":"IF(PP_TypeOfAuditorAssistance=NoAuditAssistance,\"\",\"\"&INDEX(PP_Locale,ROW(),PP_LanguageIndex))","v":"Address of auditor, street name 1"},null,null,null,null,"PP_AddressOfAuditorStreetName_1",null,null,null,null,"",null,null,null,{"$f":"\"\"&INDEX(PP_Locale,ROW(),PP_LanguageIndex)","v":"Address of auditor, street name 1"},"Address of auditor, street name 1",null,null,"Revisionsvirksomhedens adresse, vejnavn 1",null,null,null,null,null,null,null,null,null,null,null,null,null,null,null,null,null,null,null,null,null,null,null,null,null,null,null,null,null,null,null,null,null,null,null,null,null,null,null,null,null,null,null,null,null,null,null,null,null,null,null,null,null,null,null,null,null,null,null,null,null,null,null,null,null,null,null,null,null,null,null,null,null,null,null,null,null,null,"&allowhtml=false&merge=false",{"$f":"\"pp://General Data/\"&INDEX(PP_Locale,ROW(),1)&\"?taxonomy=\"&PP_TaxonomyId&\"&labellanguage=en&period=1\"&IF(PP_Consolidated,\"_Consolidated\",\"\")&CT161","v":"pp://General Data/Address of auditor, street name 1?taxonomy=DKIFRS&labellanguage=en&period=1_Consolidated&allowhtml=false&merge=false"}]
[{"$f":"IF(PP_TypeOfAuditorAssistance=NoAuditAssistance,\"\",\"\"&INDEX(PP_Locale,ROW(),PP_LanguageIndex))","v":"Address of auditor, street building identifier 1"},null,null,null,null,"PP_AddressOfAuditorStreetBuildingIdentifier_1",null,null,null,null,"",null,null,null,{"$f":"\"\"&INDEX(PP_Locale,ROW(),PP_LanguageIndex)","v":"Address of auditor, street building identifier 1"},"Address of auditor, street building identifier 1",null,null,"Revisionsvirksomhedens adresse, vejnr og etage 1",null,null,null,null,null,null,null,null,null,null,null,null,null,null,null,null,null,null,null,null,null,null,null,null,null,null,null,null,null,null,null,null,null,null,null,null,null,null,null,null,null,null,null,null,null,null,null,null,null,null,null,null,null,null,null,null,null,null,null,null,null,null,null,null,null,null,null,null,null,null,null,null,null,null,null,null,null,null,"&allowhtml=false&merge=false",{"$f":"\"pp://General Data/\"&INDEX(PP_Locale,ROW(),1)&\"?taxonomy=\"&PP_TaxonomyId&\"&labellanguage=en&period=1\"&IF(PP_Consolidated,\"_Consolidated\",\"\")&CT162","v":"pp://General Data/Address of auditor, street building identifier 1?taxonomy=DKIFRS&labellanguage=en&period=1_Consolidated&allowhtml=false&merge=false"}]
[{"$f":"IF(PP_TypeOfAuditorAssistance=NoAuditAssistance,\"\",\"\"&INDEX(PP_Locale,ROW(),PP_LanguageIndex))","v":"Address of auditor, post code identifier 1"},null,null,null,null,"PP_AddressOfAuditorPostCodeIdentifier_1",null,null,null,null,"",null,null,null,{"$f":"\"\"&INDEX(PP_Locale,ROW(),PP_LanguageIndex)","v":"Address of auditor, post code identifier 1"},"Address of auditor, post code identifier 1",null,null,"Revisionsvirksomhedens adresse, postnummer 1",null,null,null,null,null,null,null,null,null,null,null,null,null,null,null,null,null,null,null,null,null,null,null,null,null,null,null,null,null,null,null,null,null,null,null,null,null,null,null,null,null,null,null,null,null,null,null,null,null,null,null,null,null,null,null,null,null,null,null,null,null,null,null,null,null,null,null,null,null,null,null,null,null,null,null,null,null,null,"&allowhtml=false&merge=false",{"$f":"\"pp://General Data/\"&INDEX(PP_Locale,ROW(),1)&\"?taxonomy=\"&PP_TaxonomyId&\"&labellanguage=en&period=1\"&IF(PP_Consolidated,\"_Consolidated\",\"\")&CT163","v":"pp://General Data/Address of auditor, post code identifier 1?taxonomy=DKIFRS&labellanguage=en&period=1_Consolidated&allowhtml=false&merge=false"}]
[{"$f":"IF(PP_TypeOfAuditorAssistance=NoAuditAssistance,\"\",\"\"&INDEX(PP_Locale,ROW(),PP_LanguageIndex))","v":"Address of auditor, district name 1"},null,null,null,null,"PP_AddressOfAuditorDistrictName_1",null,null,null,null,"",null,null,null,{"$f":"\"\"&INDEX(PP_Locale,ROW(),PP_LanguageIndex)","v":"Address of auditor, district name 1"},"Address of auditor, district name 1",null,null,"Revisionsvirksomhedens adresse, by 1",null,null,null,null,null,null,null,null,null,null,null,null,null,null,null,null,null,null,null,null,null,null,null,null,null,null,null,null,null,null,null,null,null,null,null,null,null,null,null,null,null,null,null,null,null,null,null,null,null,null,null,null,null,null,null,null,null,null,null,null,null,null,null,null,null,null,null,null,null,null,null,null,null,null,null,null,null,null,"&allowhtml=false&merge=false",{"$f":"\"pp://General Data/\"&INDEX(PP_Locale,ROW(),1)&\"?taxonomy=\"&PP_TaxonomyId&\"&labellanguage=en&period=1\"&IF(PP_Consolidated,\"_Consolidated\",\"\")&CT164","v":"pp://General Data/Address of auditor, district name 1?taxonomy=DKIFRS&labellanguage=en&period=1_Consolidated&allowhtml=false&merge=false"}]
[{"$f":"IF(PP_TypeOfAuditorAssistance=NoAuditAssistance,\"\",\"\"&INDEX(PP_Locale,ROW(),PP_LanguageIndex))","v":"Address of auditor, country 1"},null,null,null,null,"PP_AddressOfAuditorCountry_1",null,null,null,null,"",null,null,null,{"$f":"\"\"&INDEX(PP_Locale,ROW(),PP_LanguageIndex)","v":"Address of auditor, country 1"},"Address of auditor, country 1",null,null,"Revisionsvirksomhedens adresse, land 1",null,null,null,null,null,null,null,null,null,null,null,null,null,null,null,null,null,null,null,null,null,null,null,null,null,null,null,null,null,null,null,null,null,null,null,null,null,null,null,null,null,null,null,null,null,null,null,null,null,null,null,null,null,null,null,null,null,null,null,null,null,null,null,null,null,null,null,null,null,null,null,null,null,null,null,null,null,null,"&allowhtml=false&merge=false",{"$f":"\"pp://General Data/\"&INDEX(PP_Locale,ROW(),1)&\"?taxonomy=\"&PP_TaxonomyId&\"&labellanguage=en&period=1\"&IF(PP_Consolidated,\"_Consolidated\",\"\")&CT165","v":"pp://General Data/Address of auditor, country 1?taxonomy=DKIFRS&labellanguage=en&period=1_Consolidated&allowhtml=false&merge=false"}]
[{"$f":"IF(PP_TypeOfAuditorAssistance=NoAuditAssistance,\"\",\"\"&INDEX(PP_Locale,ROW(),PP_LanguageIndex))","v":"Address of auditor, country identification code 1"},null,null,null,null,"PP_AddressOfAuditorCountryIdentificationCode_1",null,null,null,null,"",null,null,null,{"$f":"\"\"&INDEX(PP_Locale,ROW(),PP_LanguageIndex)","v":"Address of auditor, country identification code 1"},"Address of auditor, country identification code 1",null,null,"Revisionsvirksomhedens adresse, landekode 1",null,null,null,null,null,null,null,null,null,null,null,null,null,null,null,null,null,null,null,null,null,null,null,null,null,null,null,null,null,null,null,null,null,null,null,null,null,null,null,null,null,null,null,null,null,null,null,null,null,null,null,null,null,null,null,null,null,null,null,null,null,null,null,null,null,null,null,null,null,null,null,null,null,null,null,null,null,null,"&allowhtml=false&merge=false",{"$f":"\"pp://General Data/\"&INDEX(PP_Locale,ROW(),1)&\"?taxonomy=\"&PP_TaxonomyId&\"&labellanguage=en&period=1\"&IF(PP_Consolidated,\"_Consolidated\",\"\")&CT166","v":"pp://General Data/Address of auditor, country identification code 1?taxonomy=DKIFRS&labellanguage=en&period=1_Consolidated&allowhtml=false&merge=false"}]
[{"$f":"IF(PP_TypeOfAuditorAssistance=NoAuditAssistance,\"\",\"\"&INDEX(PP_Locale,ROW(),PP_LanguageIndex))","v":"Telephone number of auditor 1"},null,null,null,null,"PP_TelephoneNumberOfAuditor_1",null,null,null,null,{"$f":"\"\"&SUBSTITUTE(B167,\" \",\"\")","v":""},null,null,null,{"$f":"\"\"&INDEX(PP_Locale,ROW(),PP_LanguageIndex)","v":"Telephone number of auditor 1"},"Telephone number of auditor 1",null,null,"Revisionsvirksomhedens telefonnummer 1",null,null,null,null,null,null,null,null,null,null,null,null,null,null,null,null,null,null,null,null,null,null,null,null,null,null,null,null,null,null,null,null,null,null,null,null,null,null,null,null,null,null,null,null,null,null,null,null,null,null,null,null,null,null,null,null,null,null,null,null,null,null,null,null,null,null,null,null,null,null,null,null,null,null,null,null,null,null,"&allowhtml=false&merge=false",{"$f":"\"pp://General Data/\"&INDEX(PP_Locale,ROW(),1)&\"?taxonomy=\"&PP_TaxonomyId&\"&labellanguage=en&period=1\"&IF(PP_Consolidated,\"_Consolidated\",\"\")&CT167","v":"pp://General Data/Telephone number of auditor 1?taxonomy=DKIFRS&labellanguage=en&period=1_Consolidated&allowhtml=false&merge=false"}]
[{"$f":"IF(PP_TypeOfAuditorAssistance=NoAuditAssistance,\"\",\"\"&INDEX(PP_Locale,ROW(),PP_LanguageIndex))","v":"E-mail of auditor 1"},null,null,null,null,"PP_EmailOfAuditor_1",null,null,null,null,{"$f":"\"\"&B168","v":""},null,null,null,{"$f":"\"\"&INDEX(PP_Locale,ROW(),PP_LanguageIndex)","v":"E-mail of auditor 1"},"E-mail of auditor 1",null,null,"Revisionsvirksomhedens e-mail 1",null,null,null,null,null,null,null,null,null,null,null,null,null,null,null,null,null,null,null,null,null,null,null,null,null,null,null,null,null,null,null,null,null,null,null,null,null,null,null,null,null,null,null,null,null,null,null,null,null,null,null,null,null,null,null,null,null,null,null,null,null,null,null,null,null,null,null,null,null,null,null,null,null,null,null,null,null,null,"&allowhtml=false&merge=false",{"$f":"\"pp://General Data/\"&INDEX(PP_Locale,ROW(),1)&\"?taxonomy=\"&PP_TaxonomyId&\"&labellanguage=en&period=1\"&IF(PP_Consolidated,\"_Consolidated\",\"\")&CT168","v":"pp://General Data/E-mail of auditor 1?taxonomy=DKIFRS&labellanguage=en&period=1_Consolidated&allowhtml=false&merge=false"}]
[null,null,null,null,null,null,null,null,null,null,null,null,null,null,{"$f":"\"\"&INDEX(PP_Locale,ROW(),PP_LanguageIndex)","v":""}]
[{"$f":"IF(PP_TypeOfAuditorAssistance=NoAuditAssistance,\"\",\"\"&INDEX(PP_Locale,ROW(),PP_LanguageIndex))","v":"Auditor 2:"},null,null,null,null,null,null,null,null,null,null,null,null,null,{"$f":"\"\"&INDEX(PP_Locale,ROW(),PP_LanguageIndex)","v":"Auditor 2:"},"Auditor 2:",null,null,"Revisor 2:"]
[{"$f":"IF(PP_TypeOfAuditorAssistance=NoAuditAssistance,\"\",\"\"&INDEX(PP_Locale,ROW(),PP_LanguageIndex))","v":"Name and surname of auditor 2"},null,null,null,null,"PP_NameAndSurnameOfAuditor_2",null,null,null,null,{"$f":"IF(A171=\"\",\"\",\"\"&B171)","v":""},null,null,null,{"$f":"\"\"&INDEX(PP_Locale,ROW(),PP_LanguageIndex)","v":"Name and surname of auditor 2"},"Name and surname of auditor 2",null,null,"Revisors navn 2",null,null,null,null,null,null,null,null,null,null,null,null,null,null,null,null,null,null,null,null,null,null,null,null,null,null,null,null,null,null,null,null,null,null,null,null,null,null,null,null,null,null,null,null,null,null,null,null,null,null,null,null,null,null,null,null,null,null,null,null,null,null,null,null,null,null,null,null,null,null,null,null,null,null,null,null,null,null,"&allowhtml=false&merge=false",{"$f":"\"pp://General Data/\"&INDEX(PP_Locale,ROW(),1)&\"?taxonomy=\"&PP_TaxonomyId&\"&labellanguage=en&period=1\"&IF(PP_Consolidated,\"_Consolidated\",\"\")&CT171","v":"pp://General Data/Name and surname of auditor 2?taxonomy=DKIFRS&labellanguage=en&period=1_Consolidated&allowhtml=false&merge=false"}]
[{"$f":"IF(PP_TypeOfAuditorAssistance=NoAuditAssistance,\"\",\"\"&INDEX(PP_Locale,ROW(),PP_LanguageIndex))","v":"Description of auditor 2"},null,null,null,null,"PP_DescriptionOfAuditor_2",null,null,null,null,{"$f":"IF(A172=\"\",\"\",\"\"&B172)","v":""},null,null,null,{"$f":"\"\"&INDEX(PP_Locale,ROW(),PP_LanguageIndex)","v":"Description of auditor 2"},"Description of auditor 2",null,null,"Revisors titel 2",null,null,null,null,null,null,null,null,null,null,null,null,null,null,null,null,null,null,null,null,null,null,null,null,null,null,null,null,null,null,null,null,null,null,null,null,null,null,null,null,null,null,null,null,null,null,null,null,null,null,null,null,null,null,null,null,null,null,null,null,null,null,null,null,null,null,null,null,null,null,null,null,null,null,null,null,null,null,"&allowhtml=false&merge=false",{"$f":"\"pp://General Data/\"&INDEX(PP_Locale,ROW(),1)&\"?taxonomy=\"&PP_TaxonomyId&\"&labellanguage=en&period=1\"&IF(PP_Consolidated,\"_Consolidated\",\"\")&CT172","v":"pp://General Data/Description of auditor 2?taxonomy=DKIFRS&labellanguage=en&period=1_Consolidated&allowhtml=false&merge=false"}]
[{"$f":"IF(PP_TypeOfAuditorAssistance=NoAuditAssistance,\"\",\"\"&INDEX(PP_Locale,ROW(),PP_LanguageIndex))","v":"Identification number of auditor 2"},null,null,null,null,"PP_IdentificationNumberOfAuditor_2",null,null,null,null,{"$f":"IF(A173=\"\",\"\",\"\"&B173)","v":""},null,null,null,{"$f":"\"\"&INDEX(PP_Locale,ROW(),PP_LanguageIndex)","v":"Identification number of auditor 2"},"Identification number of auditor 2",null,null,"Revisors MNE-nr. 2",null,null,null,null,null,null,null,null,null,null,null,null,null,null,null,null,null,null,null,null,null,null,null,null,null,null,null,null,null,null,null,null,null,null,null,null,null,null,null,null,null,null,null,null,null,null,null,null,null,null,null,null,null,null,null,null,null,null,null,null,null,null,null,null,null,null,null,null,null,null,null,null,null,null,null,null,null,null,"&allowhtml=false&merge=false",{"$f":"\"pp://General Data/\"&INDEX(PP_Locale,ROW(),1)&\"?taxonomy=\"&PP_TaxonomyId&\"&labellanguage=en&period=1\"&IF(PP_Consolidated,\"_Consolidated\",\"\")&CT173","v":"pp://General Data/Identification number of auditor 2?taxonomy=DKIFRS&labellanguage=en&period=1_Consolidated&allowhtml=false&merge=false"}]
[{"$f":"IF(PP_TypeOfAuditorAssistance=NoAuditAssistance,\"\",\"\"&INDEX(PP_Locale,ROW(),PP_LanguageIndex))","v":"Legal Entity Identifier [LEI] of audit firm 2"},{"$f":"\"\"&IF(COUNTBLANK(PP_NameAndSurnameOfAuditor_2),,PP_LegalEntityIdentifierOfAuditFirm_1)","v":""},null,null,null,"PP_LegalEntityIdentifierOfAuditFirm_2",null,null,null,null,{"$f":"\"\"&SUBSTITUTE(B174,\" \",\"\")","v":""},null,null,null,{"$f":"\"\"&INDEX(PP_Locale,ROW(),PP_LanguageIndex)","v":"Legal Entity Identifier [LEI] of audit firm 2"},"Legal Entity Identifier [LEI] of audit firm 2",null,null,"Revisionsvirksomhedens LEI-kode 2",null,null,null,null,null,null,null,null,null,null,null,null,null,null,null,null,null,null,null,null,null,null,null,null,null,null,null,null,null,null,null,null,null,null,null,null,null,null,null,null,null,null,null,null,null,null,null,null,null,null,null,null,null,null,null,null,null,null,null,null,null,null,null,null,null,null,null,null,null,null,null,null,null,null,null,null,null,null,"&allowhtml=false&merge=false",{"$f":"\"pp://General Data/\"&INDEX(PP_Locale,ROW(),1)&\"?taxonomy=\"&PP_TaxonomyId&\"&labellanguage=en&period=1\"&IF(PP_Consolidated,\"_Consolidated\",\"\")&CT174","v":"pp://General Data/Legal Entity Identifier [LEI] of audit firm 2?taxonomy=DKIFRS&labellanguage=en&period=1_Consolidated&allowhtml=false&merge=false"}]
[{"$f":"IF(PP_TypeOfAuditorAssistance=NoAuditAssistance,\"\",\"\"&INDEX(PP_Locale,ROW(),PP_LanguageIndex))","v":"Identification number [CVR] of audit firm 2"},{"$f":"\"\"&IF(COUNTBLANK(PP_NameAndSurnameOfAuditor_2),,PP_IdentificationNumberCvrOfAuditFirm_1)","v":""},null,null,null,"PP_IdentificationNumberCvrOfAuditFirm_2",null,null,null,null,{"$f":"\"\"&SUBSTITUTE(B175,\" \",\"\")","v":""},null,null,null,{"$f":"\"\"&INDEX(PP_Locale,ROW(),PP_LanguageIndex)","v":"Identification number [CVR] of audit firm 2"},"Identification number [CVR] of audit firm 2",null,null,"Revisionsvirksomhedens CVR-nr. 2",null,null,null,null,null,null,null,null,null,null,null,null,null,null,null,null,null,null,null,null,null,null,null,null,null,null,null,null,null,null,null,null,null,null,null,null,null,null,null,null,null,null,null,null,null,null,null,null,null,null,null,null,null,null,null,null,null,null,null,null,null,null,null,null,null,null,null,null,null,null,null,null,null,null,null,null,null,null,"&allowhtml=false&merge=false&skipspace=true",{"$f":"\"pp://General Data/\"&INDEX(PP_Locale,ROW(),1)&\"?taxonomy=\"&PP_TaxonomyId&\"&labellanguage=en&period=1\"&IF(PP_Consolidated,\"_Consolidated\",\"\")&CT175","v":"pp://General Data/Identification number [CVR] of audit firm 2?taxonomy=DKIFRS&labellanguage=en&period=1_Consolidated&allowhtml=false&merge=false&skipspace=true"}]
[{"$f":"IF(PP_TypeOfAuditorAssistance=NoAuditAssistance,\"\",\"\"&INDEX(PP_Locale,ROW(),PP_LanguageIndex))","v":"Identification number [PNR] of audit firm 2"},{"$f":"\"\"&IF(COUNTBLANK(PP_NameAndSurnameOfAuditor_2),,PP_IdentificationNumberPnrOfAuditFirm_1)","v":""},null,null,null,"PP_IdentificationNumberPnrOfAuditFirm_2",null,null,null,null,{"$f":"\"\"&SUBSTITUTE(B176,\"-\",\"\")","v":""},null,null,null,{"$f":"\"\"&INDEX(PP_Locale,ROW(),PP_LanguageIndex)","v":"Identification number [PNR] of audit firm 2"},"Identification number [PNR] of audit firm 2",null,null,"Revisionsvirksomhedens P-nr. 2",null,null,null,null,null,null,null,null,null,null,null,null,null,null,null,null,null,null,null,null,null,null,null,null,null,null,null,null,null,null,null,null,null,null,null,null,null,null,null,null,null,null,null,null,null,null,null,null,null,null,null,null,null,null,null,null,null,null,null,null,null,null,null,null,null,null,null,null,null,null,null,null,null,null,null,null,null,null,"&allowhtml=false&merge=false",{"$f":"\"pp://General Data/\"&INDEX(PP_Locale,ROW(),1)&\"?taxonomy=\"&PP_TaxonomyId&\"&labellanguage=en&period=1\"&IF(PP_Consolidated,\"_Consolidated\",\"\")&CT176","v":"pp://General Data/Identification number [PNR] of audit firm 2?taxonomy=DKIFRS&labellanguage=en&period=1_Consolidated&allowhtml=false&merge=false"}]
[{"$f":"IF(PP_TypeOfAuditorAssistance=NoAuditAssistance,\"\",\"\"&INDEX(PP_Locale,ROW(),PP_LanguageIndex))","v":"Name of audit firm 2"},{"$f":"\"\"&IF(COUNTBLANK(PP_NameAndSurnameOfAuditor_2),,PP_NameOfAuditFirm_1)","v":""},null,null,null,"PP_NameOfAuditFirm_2",null,null,null,null,{"$f":"\"\"&B177","v":""},null,null,null,{"$f":"\"\"&INDEX(PP_Locale,ROW(),PP_LanguageIndex)","v":"Name of audit firm 2"},"Name of audit firm 2",null,null,"Revisionsvirksomhedens navn 2",null,null,null,null,null,null,null,null,null,null,null,null,null,null,null,null,null,null,null,null,null,null,null,null,null,null,null,null,null,null,null,null,null,null,null,null,null,null,null,null,null,null,null,null,null,null,null,null,null,null,null,null,null,null,null,null,null,null,null,null,null,null,null,null,null,null,null,null,null,null,null,null,null,null,null,null,null,null,"&allowhtml=false&merge=false",{"$f":"\"pp://General Data/\"&INDEX(PP_Locale,ROW(),1)&\"?taxonomy=\"&PP_TaxonomyId&\"&labellanguage=en&period=1\"&IF(PP_Consolidated,\"_Consolidated\",\"\")&CT177","v":"pp://General Data/Name of audit firm 2?taxonomy=DKIFRS&labellanguage=en&period=1_Consolidated&allowhtml=false&merge=false"}]
[{"$f":"IF(PP_TypeOfAuditorAssistance=NoAuditAssistance,\"\",\"\"&INDEX(PP_Locale,ROW(),PP_LanguageIndex))","v":"Address of auditor, street name 2"},{"$f":"\"\"&IF(COUNTBLANK(PP_NameAndSurnameOfAuditor_2),,PP_AddressOfAuditorStreetName_1)","v":""},null,null,null,"PP_AddressOfAuditorStreetName_2",null,null,null,null,"",null,null,null,{"$f":"\"\"&INDEX(PP_Locale,ROW(),PP_LanguageIndex)","v":"Address of auditor, street name 2"},"Address of auditor, street name 2",null,null,"Revisionsvirksomhedens adresse, vejnavn 2",null,null,null,null,null,null,null,null,null,null,null,null,null,null,null,null,null,null,null,null,null,null,null,null,null,null,null,null,null,null,null,null,null,null,null,null,null,null,null,null,null,null,null,null,null,null,null,null,null,null,null,null,null,null,null,null,null,null,null,null,null,null,null,null,null,null,null,null,null,null,null,null,null,null,null,null,null,null,"&allowhtml=false&merge=false",{"$f":"\"pp://General Data/\"&INDEX(PP_Locale,ROW(),1)&\"?taxonomy=\"&PP_TaxonomyId&\"&labellanguage=en&period=1\"&IF(PP_Consolidated,\"_Consolidated\",\"\")&CT178","v":"pp://General Data/Address of auditor, street name 2?taxonomy=DKIFRS&labellanguage=en&period=1_Consolidated&allowhtml=false&merge=false"}]
[{"$f":"IF(PP_TypeOfAuditorAssistance=NoAuditAssistance,\"\",\"\"&INDEX(PP_Locale,ROW(),PP_LanguageIndex))","v":"Address of auditor, street building identifier 2"},{"$f":"\"\"&IF(COUNTBLANK(PP_NameAndSurnameOfAuditor_2),,PP_AddressOfAuditorStreetBuildingIdentifier_1)","v":""},null,null,null,"PP_AddressOfAuditorStreetBuildingIdentifier_2",null,null,null,null,"",null,null,null,{"$f":"\"\"&INDEX(PP_Locale,ROW(),PP_LanguageIndex)","v":"Address of auditor, street building identifier 2"},"Address of auditor, street building identifier 2",null,null,"Revisionsvirksomhedens adresse, vejnr og etage 2",null,null,null,null,null,null,null,null,null,null,null,null,null,null,null,null,null,null,null,null,null,null,null,null,null,null,null,null,null,null,null,null,null,null,null,null,null,null,null,null,null,null,null,null,null,null,null,null,null,null,null,null,null,null,null,null,null,null,null,null,null,null,null,null,null,null,null,null,null,null,null,null,null,null,null,null,null,null,"&allowhtml=false&merge=false",{"$f":"\"pp://General Data/\"&INDEX(PP_Locale,ROW(),1)&\"?taxonomy=\"&PP_TaxonomyId&\"&labellanguage=en&period=1\"&IF(PP_Consolidated,\"_Consolidated\",\"\")&CT179","v":"pp://General Data/Address of auditor, street building identifier 2?taxonomy=DKIFRS&labellanguage=en&period=1_Consolidated&allowhtml=false&merge=false"}]
[{"$f":"IF(PP_TypeOfAuditorAssistance=NoAuditAssistance,\"\",\"\"&INDEX(PP_Locale,ROW(),PP_LanguageIndex))","v":"Address of auditor, post code identifier 2"},{"$f":"\"\"&IF(COUNTBLANK(PP_NameAndSurnameOfAuditor_2),,PP_AddressOfAuditorPostCodeIdentifier_1)","v":""},null,null,null,"PP_AddressOfAuditorPostCodeIdentifier_2",null,null,null,null,"",null,null,null,{"$f":"\"\"&INDEX(PP_Locale,ROW(),PP_LanguageIndex)","v":"Address of auditor, post code identifier 2"},"Address of auditor, post code identifier 2",null,null,"Revisionsvirksomhedens adresse, postnummer 2",null,null,null,null,null,null,null,null,null,null,null,null,null,null,null,null,null,null,null,null,null,null,null,null,null,null,null,null,null,null,null,null,null,null,null,null,null,null,null,null,null,null,null,null,null,null,null,null,null,null,null,null,null,null,null,null,null,null,null,null,null,null,null,null,null,null,null,null,null,null,null,null,null,null,null,null,null,null,"&allowhtml=false&merge=false",{"$f":"\"pp://General Data/\"&INDEX(PP_Locale,ROW(),1)&\"?taxonomy=\"&PP_TaxonomyId&\"&labellanguage=en&period=1\"&IF(PP_Consolidated,\"_Consolidated\",\"\")&CT180","v":"pp://General Data/Address of auditor, post code identifier 2?taxonomy=DKIFRS&labellanguage=en&period=1_Consolidated&allowhtml=false&merge=false"}]
[{"$f":"IF(PP_TypeOfAuditorAssistance=NoAuditAssistance,\"\",\"\"&INDEX(PP_Locale,ROW(),PP_LanguageIndex))","v":"Address of auditor, district name 2"},{"$f":"\"\"&IF(COUNTBLANK(PP_NameAndSurnameOfAuditor_2),,PP_AddressOfAuditorDistrictName_1)","v":""},null,null,null,"PP_AddressOfAuditorDistrictName_2",null,null,null,null,"",null,null,null,{"$f":"\"\"&INDEX(PP_Locale,ROW(),PP_LanguageIndex)","v":"Address of auditor, district name 2"},"Address of auditor, district name 2",null,null,"Revisionsvirksomhedens adresse, by 2",null,null,null,null,null,null,null,null,null,null,null,null,null,null,null,null,null,null,null,null,null,null,null,null,null,null,null,null,null,null,null,null,null,null,null,null,null,null,null,null,null,null,null,null,null,null,null,null,null,null,null,null,null,null,null,null,null,null,null,null,null,null,null,null,null,null,null,null,null,null,null,null,null,null,null,null,null,null,"&allowhtml=false&merge=false",{"$f":"\"pp://General Data/\"&INDEX(PP_Locale,ROW(),1)&\"?taxonomy=\"&PP_TaxonomyId&\"&labellanguage=en&period=1\"&IF(PP_Consolidated,\"_Consolidated\",\"\")&CT181","v":"pp://General Data/Address of auditor, district name 2?taxonomy=DKIFRS&labellanguage=en&period=1_Consolidated&allowhtml=false&merge=false"}]
[{"$f":"IF(PP_TypeOfAuditorAssistance=NoAuditAssistance,\"\",\"\"&INDEX(PP_Locale,ROW(),PP_LanguageIndex))","v":"Address of auditor, country 2"},{"$f":"\"\"&IF(COUNTBLANK(PP_NameAndSurnameOfAuditor_2),,PP_AddressOfAuditorCountry_1)","v":""},null,null,null,"PP_AddressOfAuditorCountry_2",null,null,null,null,"",null,null,null,{"$f":"\"\"&INDEX(PP_Locale,ROW(),PP_LanguageIndex)","v":"Address of auditor, country 2"},"Address of auditor, country 2",null,null,"Revisionsvirksomhedens adresse, land 2",null,null,null,null,null,null,null,null,null,null,null,null,null,null,null,null,null,null,null,null,null,null,null,null,null,null,null,null,null,null,null,null,null,null,null,null,null,null,null,null,null,null,null,null,null,null,null,null,null,null,null,null,null,null,null,null,null,null,null,null,null,null,null,null,null,null,null,null,null,null,null,null,null,null,null,null,null,null,"&allowhtml=false&merge=false",{"$f":"\"pp://General Data/\"&INDEX(PP_Locale,ROW(),1)&\"?taxonomy=\"&PP_TaxonomyId&\"&labellanguage=en&period=1\"&IF(PP_Consolidated,\"_Consolidated\",\"\")&CT182","v":"pp://General Data/Address of auditor, country 2?taxonomy=DKIFRS&labellanguage=en&period=1_Consolidated&allowhtml=false&merge=false"}]
[{"$f":"IF(PP_TypeOfAuditorAssistance=NoAuditAssistance,\"\",\"\"&INDEX(PP_Locale,ROW(),PP_LanguageIndex))","v":"Address of auditor, country identification code 2"},{"$f":"\"\"&IF(COUNTBLANK(PP_NameAndSurnameOfAuditor_2),,PP_AddressOfAuditorCountryIdentificationCode_1)","v":""},null,null,null,"PP_AddressOfAuditorCountryIdentificationCode_2",null,null,null,null,"",null,null,null,{"$f":"\"\"&INDEX(PP_Locale,ROW(),PP_LanguageIndex)","v":"Address of auditor, country identification code 2"},"Address of auditor, country identification code 2",null,null,"Revisionsvirksomhedens adresse, landekode 2",null,null,null,null,null,null,null,null,null,null,null,null,null,null,null,null,null,null,null,null,null,null,null,null,null,null,null,null,null,null,null,null,null,null,null,null,null,null,null,null,null,null,null,null,null,null,null,null,null,null,null,null,null,null,null,null,null,null,null,null,null,null,null,null,null,null,null,null,null,null,null,null,null,null,null,null,null,null,"&allowhtml=false&merge=false",{"$f":"\"pp://General Data/\"&INDEX(PP_Locale,ROW(),1)&\"?taxonomy=\"&PP_TaxonomyId&\"&labellanguage=en&period=1\"&IF(PP_Consolidated,\"_Consolidated\",\"\")&CT183","v":"pp://General Data/Address of auditor, country identification code 2?taxonomy=DKIFRS&labellanguage=en&period=1_Consolidated&allowhtml=false&merge=false"}]
[{"$f":"IF(PP_TypeOfAuditorAssistance=NoAuditAssistance,\"\",\"\"&INDEX(PP_Locale,ROW(),PP_LanguageIndex))","v":"Telephone number of auditor 2"},{"$f":"\"\"&IF(COUNTBLANK(PP_NameAndSurnameOfAuditor_2),,PP_TelephoneNumberOfAuditor_1)","v":""},null,null,null,"PP_TelephoneNumberOfAuditor_2",null,null,null,null,{"$f":"\"\"&SUBSTITUTE(B184,\" \",\"\")","v":""},null,null,null,{"$f":"\"\"&INDEX(PP_Locale,ROW(),PP_LanguageIndex)","v":"Telephone number of auditor 2"},"Telephone number of auditor 2",null,null,"Revisionsvirksomhedens telefonnummer 2",null,null,null,null,null,null,null,null,null,null,null,null,null,null,null,null,null,null,null,null,null,null,null,null,null,null,null,null,null,null,null,null,null,null,null,null,null,null,null,null,null,null,null,null,null,null,null,null,null,null,null,null,null,null,null,null,null,null,null,null,null,null,null,null,null,null,null,null,null,null,null,null,null,null,null,null,null,null,"&allowhtml=false&merge=false",{"$f":"\"pp://General Data/\"&INDEX(PP_Locale,ROW(),1)&\"?taxonomy=\"&PP_TaxonomyId&\"&labellanguage=en&period=1\"&IF(PP_Consolidated,\"_Consolidated\",\"\")&CT184","v":"pp://General Data/Telephone number of auditor 2?taxonomy=DKIFRS&labellanguage=en&period=1_Consolidated&allowhtml=false&merge=false"}]
[{"$f":"IF(PP_TypeOfAuditorAssistance=NoAuditAssistance,\"\",\"\"&INDEX(PP_Locale,ROW(),PP_LanguageIndex))","v":"E-mail of auditor 2"},{"$f":"\"\"&IF(COUNTBLANK(PP_NameAndSurnameOfAuditor_2),,PP_EmailOfAuditor_1)","v":""},null,null,null,"PP_EmailOfAuditor_2",null,null,null,null,{"$f":"\"\"&B185","v":""},null,null,null,{"$f":"\"\"&INDEX(PP_Locale,ROW(),PP_LanguageIndex)","v":"E-mail of auditor 2"},"E-mail of auditor 2",null,null,"Revisionsvirksomhedens e-mail 2",null,null,null,null,null,null,null,null,null,null,null,null,null,null,null,null,null,null,null,null,null,null,null,null,null,null,null,null,null,null,null,null,null,null,null,null,null,null,null,null,null,null,null,null,null,null,null,null,null,null,null,null,null,null,null,null,null,null,null,null,null,null,null,null,null,null,null,null,null,null,null,null,null,null,null,null,null,null,"&allowhtml=false&merge=false",{"$f":"\"pp://General Data/\"&INDEX(PP_Locale,ROW(),1)&\"?taxonomy=\"&PP_TaxonomyId&\"&labellanguage=en&period=1\"&IF(PP_Consolidated,\"_Consolidated\",\"\")&CT185","v":"pp://General Data/E-mail of auditor 2?taxonomy=DKIFRS&labellanguage=en&period=1_Consolidated&allowhtml=false&merge=false"}]
[null,null,null,null,null,null,null,null,null,null,null,null,null,null,{"$f":"\"\"&INDEX(PP_Locale,ROW(),PP_LanguageIndex)","v":""}]
[{"$f":"\"\"&INDEX(PP_Locale,ROW(),PP_LanguageIndex)","v":"Internal audit:"},null,null,null,null,null,null,null,null,null,null,null,null,null,{"$f":"\"\"&INDEX(PP_Locale,ROW(),PP_LanguageIndex)","v":"Internal audit:"},"Internal audit:",null,null,"Intern revision:"]
[{"$f":"\"\"&INDEX(PP_Locale,ROW(),PP_LanguageIndex)","v":"Signature internal audit, place"},null,null,null,null,"PP_SignatureInternalAuditPlace",null,null,null,null,{"$f":"\"\"&B188","v":""},null,null,null,{"$f":"\"\"&INDEX(PP_Locale,ROW(),PP_LanguageIndex)","v":"Signature internal audit, place"},"Signature internal audit, place",null,null,"Intern revision, sted",null,null,null,null,null,null,null,null,null,null,null,null,null,null,null,null,null,null,null,null,null,null,null,null,null,null,null,null,null,null,null,null,null,null,null,null,null,null,null,null,null,null,null,null,null,null,null,null,null,null,null,null,null,null,null,null,null,null,null,null,null,null,null,null,null,null,null,null,null,null,null,null,null,null,null,null,null,null,"&allowhtml=false&merge=false",{"$f":"\"pp://General Data/\"&INDEX(PP_Locale,ROW(),1)&\"?taxonomy=\"&PP_TaxonomyId&\"&labellanguage=en&period=1\"&IF(PP_Consolidated,\"_Consolidated\",\"\")&CT188","v":"pp://General Data/Signature internal audit, place?taxonomy=DKIFRS&labellanguage=en&period=1_Consolidated&allowhtml=false&merge=false"}]
[{"$f":"\"\"&INDEX(PP_Locale,ROW(),PP_LanguageIndex)","v":"Signature internal audit, date"},null,null,null,null,"PP_SignatureInternalAuditDate",null,null,null,null,{"$f":"IF(COUNTBLANK(B189),\"\",TEXT(YEAR(B189),\"0000\")&\"-\"&TEXT(MONTH(B189),\"00\")&\"-\"&TEXT(DAY(B189),\"00\"))","v":""},null,null,null,{"$f":"\"\"&INDEX(PP_Locale,ROW(),PP_LanguageIndex)","v":"Signature internal audit, date"},"Signature internal audit, date",null,null,"Intern revision, dato",null,null,null,null,null,null,null,null,null,null,null,null,null,null,null,null,null,null,null,null,null,null,null,null,null,null,null,null,null,null,null,null,null,null,null,null,null,null,null,null,null,null,null,null,null,null,null,null,null,null,null,null,null,null,null,null,null,null,null,null,null,null,null,null,null,null,null,null,null,null,null,null,null,null,null,null,null,null,"&allowhtml=false&merge=false",{"$f":"\"pp://General Data/\"&INDEX(PP_Locale,ROW(),1)&\"?taxonomy=\"&PP_TaxonomyId&\"&labellanguage=en&period=1\"&IF(PP_Consolidated,\"_Consolidated\",\"\")&CT189","v":"pp://General Data/Signature internal audit, date?taxonomy=DKIFRS&labellanguage=en&period=1_Consolidated&allowhtml=false&merge=false"}]
[{"$f":"\"\"&INDEX(PP_Locale,ROW(),PP_LanguageIndex)","v":"Name and surname of performer of internal audit 1"},null,null,null,null,"PP_NameAndSurnameOfPerformerOfInternalAudit_1",null,null,null,null,{"$f":"IF(A190=\"\",\"\",\"\"&B190)","v":""},null,null,null,{"$f":"\"\"&INDEX(PP_Locale,ROW(),PP_LanguageIndex)","v":"Name and surname of performer of internal audit 1"},"Name and surname of performer of internal audit 1",null,null,"Intern revision navn 1",null,null,null,null,null,null,null,null,null,null,null,null,null,null,null,null,null,null,null,null,null,null,null,null,null,null,null,null,null,null,null,null,null,null,null,null,null,null,null,null,null,null,null,null,null,null,null,null,null,null,null,null,null,null,null,null,null,null,null,null,null,null,null,null,null,null,null,null,null,null,null,null,null,null,null,null,null,null,"&allowhtml=false&merge=false",{"$f":"\"pp://General Data/\"&INDEX(PP_Locale,ROW(),1)&\"?taxonomy=\"&PP_TaxonomyId&\"&labellanguage=en&period=1\"&IF(PP_Consolidated,\"_Consolidated\",\"\")&CT190","v":"pp://General Data/Name and surname of performer of internal audit 1?taxonomy=DKIFRS&labellanguage=en&period=1_Consolidated&allowhtml=false&merge=false"}]
[{"$f":"\"\"&INDEX(PP_Locale,ROW(),PP_LanguageIndex)","v":"Title of performer of internal audit 1"},null,null,null,null,"PP_TitleOfPerformerOfInternalAudit_1",null,null,null,null,{"$f":"IF(A191=\"\",\"\",\"\"&B191)","v":""},null,null,null,{"$f":"\"\"&INDEX(PP_Locale,ROW(),PP_LanguageIndex)","v":"Title of performer of internal audit 1"},"Title of performer of internal audit 1",null,null,"Intern revision titel 1",null,null,null,null,null,null,null,null,null,null,null,null,null,null,null,null,null,null,null,null,null,null,null,null,null,null,null,null,null,null,null,null,null,null,null,null,null,null,null,null,null,null,null,null,null,null,null,null,null,null,null,null,null,null,null,null,null,null,null,null,null,null,null,null,null,null,null,null,null,null,null,null,null,null,null,null,null,null,"&allowhtml=false&merge=false",{"$f":"\"pp://General Data/\"&INDEX(PP_Locale,ROW(),1)&\"?taxonomy=\"&PP_TaxonomyId&\"&labellanguage=en&period=1\"&IF(PP_Consolidated,\"_Consolidated\",\"\")&CT191","v":"pp://General Data/Title of performer of internal audit 1?taxonomy=DKIFRS&labellanguage=en&period=1_Consolidated&allowhtml=false&merge=false"}]
[{"$f":"\"\"&INDEX(PP_Locale,ROW(),PP_LanguageIndex)","v":"Name and surname of performer of internal audit 2"},null,null,null,null,"PP_NameAndSurnameOfPerformerOfInternalAudit_2",null,null,null,null,{"$f":"IF(A192=\"\",\"\",\"\"&B192)","v":""},null,null,null,{"$f":"\"\"&INDEX(PP_Locale,ROW(),PP_LanguageIndex)","v":"Name and surname of performer of internal audit 2"},"Name and surname of performer of internal audit 2",null,null,"Intern revision navn 2",null,null,null,null,null,null,null,null,null,null,null,null,null,null,null,null,null,null,null,null,null,null,null,null,null,null,null,null,null,null,null,null,null,null,null,null,null,null,null,null,null,null,null,null,null,null,null,null,null,null,null,null,null,null,null,null,null,null,null,null,null,null,null,null,null,null,null,null,null,null,null,null,null,null,null,null,null,null,"&allowhtml=false&merge=false",{"$f":"\"pp://General Data/\"&INDEX(PP_Locale,ROW(),1)&\"?taxonomy=\"&PP_TaxonomyId&\"&labellanguage=en&period=1\"&IF(PP_Consolidated,\"_Consolidated\",\"\")&CT192","v":"pp://General Data/Name and surname of performer of internal audit 2?taxonomy=DKIFRS&labellanguage=en&period=1_Consolidated&allowhtml=false&merge=false"}]
[{"$f":"\"\"&INDEX(PP_Locale,ROW(),PP_LanguageIndex)","v":"Title of performer of internal audit 2"},null,null,null,null,"PP_TitleOfPerformerOfInternalAudit_2",null,null,null,null,{"$f":"IF(A193=\"\",\"\",\"\"&B193)","v":""},null,null,null,{"$f":"\"\"&INDEX(PP_Locale,ROW(),PP_LanguageIndex)","v":"Title of performer of internal audit 2"},"Title of performer of internal audit 2",null,null,"Intern revision titel 2",null,null,null,null,null,null,null,null,null,null,null,null,null,null,null,null,null,null,null,null,null,null,null,null,null,null,null,null,null,null,null,null,null,null,null,null,null,null,null,null,null,null,null,null,null,null,null,null,null,null,null,null,null,null,null,null,null,null,null,null,null,null,null,null,null,null,null,null,null,null,null,null,null,null,null,null,null,null,"&allowhtml=false&merge=false",{"$f":"\"pp://General Data/\"&INDEX(PP_Locale,ROW(),1)&\"?taxonomy=\"&PP_TaxonomyId&\"&labellanguage=en&period=1\"&IF(PP_Consolidated,\"_Consolidated\",\"\")&CT193","v":"pp://General Data/Title of performer of internal audit 2?taxonomy=DKIFRS&labellanguage=en&period=1_Consolidated&allowhtml=false&merge=false"}]
[null,null,null,null,null,null,null,null,null,null,null,null,null,null,{"$f":"\"\"&INDEX(PP_Locale,ROW(),PP_LanguageIndex)","v":""}]
[{"$f":"\"\"&INDEX(PP_Locale,ROW(),PP_LanguageIndex)","v":"Other statements:"},null,null,null,null,null,null,null,null,null,null,null,null,null,{"$f":"\"\"&INDEX(PP_Locale,ROW(),PP_LanguageIndex)","v":"Other statements:"},"Other statements:",null,null,"Øvrige erklæringer:"]
[{"$f":"\"\"&INDEX(PP_Locale,ROW(),PP_LanguageIndex)","v":"Signature other statement 1, place"},null,null,null,null,"PP_SignatureOtherStatementsPlace_1",null,null,null,null,{"$f":"\"\"&B196","v":""},null,null,null,{"$f":"\"\"&INDEX(PP_Locale,ROW(),PP_LanguageIndex)","v":"Signature other statement 1, place"},"Signature other statement 1, place",null,null,"Øvrig erklæring 1, sted",null,null,null,null,null,null,null,null,null,null,null,null,null,null,null,null,null,null,null,null,null,null,null,null,null,null,null,null,null,null,null,null,null,null,null,null,null,null,null,null,null,null,null,null,null,null,null,null,null,null,null,null,null,null,null,null,null,null,null,null,null,null,null,null,null,null,null,null,null,null,null,null,null,null,null,null,null,null,"&allowhtml=false&merge=false",{"$f":"\"pp://General Data/\"&INDEX(PP_Locale,ROW(),1)&\"?taxonomy=\"&PP_TaxonomyId&\"&labellanguage=en&period=1\"&IF(PP_Consolidated,\"_Consolidated\",\"\")&CT196","v":"pp://General Data/Signature other statement 1, place?taxonomy=DKIFRS&labellanguage=en&period=1_Consolidated&allowhtml=false&merge=false"}]
[{"$f":"\"\"&INDEX(PP_Locale,ROW(),PP_LanguageIndex)","v":"Signature other statement 1, date"},null,null,null,null,"PP_SignatureOtherStatementsDate_1",null,null,null,null,{"$f":"IF(COUNTBLANK(B197),\"\",TEXT(YEAR(B197),\"0000\")&\"-\"&TEXT(MONTH(B197),\"00\")&\"-\"&TEXT(DAY(B197),\"00\"))","v":""},null,null,null,{"$f":"\"\"&INDEX(PP_Locale,ROW(),PP_LanguageIndex)","v":"Signature other statement 1, date"},"Signature other statement 1, date",null,null,"Øvrig erklæring 1, dato",null,null,null,null,null,null,null,null,null,null,null,null,null,null,null,null,null,null,null,null,null,null,null,null,null,null,null,null,null,null,null,null,null,null,null,null,null,null,null,null,null,null,null,null,null,null,null,null,null,null,null,null,null,null,null,null,null,null,null,null,null,null,null,null,null,null,null,null,null,null,null,null,null,null,null,null,null,null,"&allowhtml=false&merge=false",{"$f":"\"pp://General Data/\"&INDEX(PP_Locale,ROW(),1)&\"?taxonomy=\"&PP_TaxonomyId&\"&labellanguage=en&period=1\"&IF(PP_Consolidated,\"_Consolidated\",\"\")&CT197","v":"pp://General Data/Signature other statement 1, date?taxonomy=DKIFRS&labellanguage=en&period=1_Consolidated&allowhtml=false&merge=false"}]
[{"$f":"\"\"&INDEX(PP_Locale,ROW(),PP_LanguageIndex)","v":"Legal Entity Identifier [LEI] of performer of other statement 1"},null,null,null,null,"PP_LegalEntityIdentifierOfPerformerOfOtherStatement_1",null,null,null,null,{"$f":"\"\"&B198","v":""},null,null,null,{"$f":"\"\"&INDEX(PP_Locale,ROW(),PP_LanguageIndex)","v":"Legal Entity Identifier [LEI] of performer of other statement 1"},"Legal Entity Identifier [LEI] of performer of other statement 1",null,null,"Øvrig erklæring 1, LEI-kode",null,null,null,null,null,null,null,null,null,null,null,null,null,null,null,null,null,null,null,null,null,null,null,null,null,null,null,null,null,null,null,null,null,null,null,null,null,null,null,null,null,null,null,null,null,null,null,null,null,null,null,null,null,null,null,null,null,null,null,null,null,null,null,null,null,null,null,null,null,null,null,null,null,null,null,null,null,null,"&allowhtml=false&merge=false",{"$f":"\"pp://General Data/\"&INDEX(PP_Locale,ROW(),1)&\"?taxonomy=\"&PP_TaxonomyId&\"&labellanguage=en&period=1\"&IF(PP_Consolidated,\"_Consolidated\",\"\")&CT198","v":"pp://General Data/Legal Entity Identifier [LEI] of performer of other statement 1?taxonomy=DKIFRS&labellanguage=en&period=1_Consolidated&allowhtml=false&merge=false"}]
[{"$f":"\"\"&INDEX(PP_Locale,ROW(),PP_LanguageIndex)","v":"Identification number [CVR] of performer of other statement 1"},null,null,null,null,"PP_IdentificationNumberCvrOfPerformerOfOtherStatement_1",null,null,null,null,{"$f":"IF(A199=\"\",\"\",\"\"&B199)","v":""},null,null,null,{"$f":"\"\"&INDEX(PP_Locale,ROW(),PP_LanguageIndex)","v":"Identification number [CVR] of performer of other statement 1"},"Identification number [CVR] of performer of other statement 1",null,null,"Øvrig erklæring 1, CVR-nr.",null,null,null,null,null,null,null,null,null,null,null,null,null,null,null,null,null,null,null,null,null,null,null,null,null,null,null,null,null,null,null,null,null,null,null,null,null,null,null,null,null,null,null,null,null,null,null,null,null,null,null,null,null,null,null,null,null,null,null,null,null,null,null,null,null,null,null,null,null,null,null,null,null,null,null,null,null,null,"&allowhtml=false&merge=false&skipspace=true",{"$f":"\"pp://General Data/\"&INDEX(PP_Locale,ROW(),1)&\"?taxonomy=\"&PP_TaxonomyId&\"&labellanguage=en&period=1\"&IF(PP_Consolidated,\"_Consolidated\",\"\")&CT199","v":"pp://General Data/Identification number [CVR] of performer of other statement 1?taxonomy=DKIFRS&labellanguage=en&period=1_Consolidated&allowhtml=false&merge=false&skipspace=true"}]
[{"$f":"\"\"&INDEX(PP_Locale,ROW(),PP_LanguageIndex)","v":"Name of firm performing other statement 1"},null,null,null,null,"PP_NameOfFirmperformingOtherStatement_1",null,null,null,null,{"$f":"IF(A200=\"\",\"\",\"\"&B200)","v":""},null,null,null,{"$f":"\"\"&INDEX(PP_Locale,ROW(),PP_LanguageIndex)","v":"Name of firm performing other statement 1"},"Name of firm performing other statement 1",null,null,"Øvrig erklæring 1, firmanavn",null,null,null,null,null,null,null,null,null,null,null,null,null,null,null,null,null,null,null,null,null,null,null,null,null,null,null,null,null,null,null,null,null,null,null,null,null,null,null,null,null,null,null,null,null,null,null,null,null,null,null,null,null,null,null,null,null,null,null,null,null,null,null,null,null,null,null,null,null,null,null,null,null,null,null,null,null,null,"&allowhtml=false&merge=false",{"$f":"\"pp://General Data/\"&INDEX(PP_Locale,ROW(),1)&\"?taxonomy=\"&PP_TaxonomyId&\"&labellanguage=en&period=1\"&IF(PP_Consolidated,\"_Consolidated\",\"\")&CT200","v":"pp://General Data/Name of firm performing other statement 1?taxonomy=DKIFRS&labellanguage=en&period=1_Consolidated&allowhtml=false&merge=false"}]
[{"$f":"\"\"&INDEX(PP_Locale,ROW(),PP_LanguageIndex)","v":"Name and surname of performer of other statement 1"},null,null,null,null,"PP_NameAndSurnameOfPerformerOfOtherStatement_1",null,null,null,null,{"$f":"IF(A201=\"\",\"\",\"\"&B201)","v":""},null,null,null,{"$f":"\"\"&INDEX(PP_Locale,ROW(),PP_LanguageIndex)","v":"Name and surname of performer of other statement 1"},"Name and surname of performer of other statement 1",null,null,"Øvrig erklæring 1, navn",null,null,null,null,null,null,null,null,null,null,null,null,null,null,null,null,null,null,null,null,null,null,null,null,null,null,null,null,null,null,null,null,null,null,null,null,null,null,null,null,null,null,null,null,null,null,null,null,null,null,null,null,null,null,null,null,null,null,null,null,null,null,null,null,null,null,null,null,null,null,null,null,null,null,null,null,null,null,"&allowhtml=false&merge=false",{"$f":"\"pp://General Data/\"&INDEX(PP_Locale,ROW(),1)&\"?taxonomy=\"&PP_TaxonomyId&\"&labellanguage=en&period=1\"&IF(PP_Consolidated,\"_Consolidated\",\"\")&CT201","v":"pp://General Data/Name and surname of performer of other statement 1?taxonomy=DKIFRS&labellanguage=en&period=1_Consolidated&allowhtml=false&merge=false"}]
[{"$f":"\"\"&INDEX(PP_Locale,ROW(),PP_LanguageIndex)","v":"Title of performer of other statement 1"},null,null,null,null,"PP_TitleOfPerformerOfOtherStatements_1",null,null,null,null,{"$f":"IF(A202=\"\",\"\",\"\"&B202)","v":""},null,null,null,{"$f":"\"\"&INDEX(PP_Locale,ROW(),PP_LanguageIndex)","v":"Title of performer of other statement 1"},"Title of performer of other statement 1",null,null,"Øvrig erklæring 1, titel",null,null,null,null,null,null,null,null,null,null,null,null,null,null,null,null,null,null,null,null,null,null,null,null,null,null,null,null,null,null,null,null,null,null,null,null,null,null,null,null,null,null,null,null,null,null,null,null,null,null,null,null,null,null,null,null,null,null,null,null,null,null,null,null,null,null,null,null,null,null,null,null,null,null,null,null,null,null,"&allowhtml=false&merge=false",{"$f":"\"pp://General Data/\"&INDEX(PP_Locale,ROW(),1)&\"?taxonomy=\"&PP_TaxonomyId&\"&labellanguage=en&period=1\"&IF(PP_Consolidated,\"_Consolidated\",\"\")&CT202","v":"pp://General Data/Title of performer of other statement 1?taxonomy=DKIFRS&labellanguage=en&period=1_Consolidated&allowhtml=false&merge=false"}]
[null,null,null,null,null,null,null,null,null,null,null,null,null,null,{"$f":"\"\"&INDEX(PP_Locale,ROW(),PP_LanguageIndex)","v":""}]
[{"$f":"\"\"&INDEX(PP_Locale,ROW(),PP_LanguageIndex)","v":"Signature other statement 2, place"},null,null,null,null,"PP_SignatureOtherStatementsPlace_2",null,null,null,null,{"$f":"\"\"&B204","v":""},null,null,null,{"$f":"\"\"&INDEX(PP_Locale,ROW(),PP_LanguageIndex)","v":"Signature other statement 2, place"},"Signature other statement 2, place",null,null,"Øvrig erklæring 2, sted",null,null,null,null,null,null,null,null,null,null,null,null,null,null,null,null,null,null,null,null,null,null,null,null,null,null,null,null,null,null,null,null,null,null,null,null,null,null,null,null,null,null,null,null,null,null,null,null,null,null,null,null,null,null,null,null,null,null,null,null,null,null,null,null,null,null,null,null,null,null,null,null,null,null,null,null,null,null,"&allowhtml=false&merge=false",{"$f":"\"pp://General Data/\"&INDEX(PP_Locale,ROW(),1)&\"?taxonomy=\"&PP_TaxonomyId&\"&labellanguage=en&period=1\"&IF(PP_Consolidated,\"_Consolidated\",\"\")&CT204","v":"pp://General Data/Signature other statement 2, place?taxonomy=DKIFRS&labellanguage=en&period=1_Consolidated&allowhtml=false&merge=false"}]
[{"$f":"\"\"&INDEX(PP_Locale,ROW(),PP_LanguageIndex)","v":"Signature other statement 2, date"},null,null,null,null,"PP_SignatureOtherStatementsDate_2",null,null,null,null,{"$f":"IF(COUNTBLANK(B205),\"\",TEXT(YEAR(B205),\"0000\")&\"-\"&TEXT(MONTH(B205),\"00\")&\"-\"&TEXT(DAY(B205),\"00\"))","v":""},null,null,null,{"$f":"\"\"&INDEX(PP_Locale,ROW(),PP_LanguageIndex)","v":"Signature other statement 2, date"},"Signature other statement 2, date",null,null,"Øvrig erklæring 2, dato",null,null,null,null,null,null,null,null,null,null,null,null,null,null,null,null,null,null,null,null,null,null,null,null,null,null,null,null,null,null,null,null,null,null,null,null,null,null,null,null,null,null,null,null,null,null,null,null,null,null,null,null,null,null,null,null,null,null,null,null,null,null,null,null,null,null,null,null,null,null,null,null,null,null,null,null,null,null,"&allowhtml=false&merge=false",{"$f":"\"pp://General Data/\"&INDEX(PP_Locale,ROW(),1)&\"?taxonomy=\"&PP_TaxonomyId&\"&labellanguage=en&period=1\"&IF(PP_Consolidated,\"_Consolidated\",\"\")&CT205","v":"pp://General Data/Signature other statement 2, date?taxonomy=DKIFRS&labellanguage=en&period=1_Consolidated&allowhtml=false&merge=false"}]
[{"$f":"\"\"&INDEX(PP_Locale,ROW(),PP_LanguageIndex)","v":"Legal Entity Identifier [LEI] of performer of other statement 2"},null,null,null,null,"PP_LegalEntityIdentifierOfPerformerOfOtherStatement_2",null,null,null,null,{"$f":"\"\"&B206","v":""},null,null,null,{"$f":"\"\"&INDEX(PP_Locale,ROW(),PP_LanguageIndex)","v":"Legal Entity Identifier [LEI] of performer of other statement 2"},"Legal Entity Identifier [LEI] of performer of other statement 2",null,null,"Øvrig erklæring 2, LEI-kode",null,null,null,null,null,null,null,null,null,null,null,null,null,null,null,null,null,null,null,null,null,null,null,null,null,null,null,null,null,null,null,null,null,null,null,null,null,null,null,null,null,null,null,null,null,null,null,null,null,null,null,null,null,null,null,null,null,null,null,null,null,null,null,null,null,null,null,null,null,null,null,null,null,null,null,null,null,null,"&allowhtml=false&merge=false",{"$f":"\"pp://General Data/\"&INDEX(PP_Locale,ROW(),1)&\"?taxonomy=\"&PP_TaxonomyId&\"&labellanguage=en&period=1\"&IF(PP_Consolidated,\"_Consolidated\",\"\")&CT206","v":"pp://General Data/Legal Entity Identifier [LEI] of performer of other statement 2?taxonomy=DKIFRS&labellanguage=en&period=1_Consolidated&allowhtml=false&merge=false"}]
[{"$f":"\"\"&INDEX(PP_Locale,ROW(),PP_LanguageIndex)","v":"Identification number [CVR] of performer of other statement 2"},null,null,null,null,"PP_IdentificationNumberCvrOfPerformerOfOtherStatement_2",null,null,null,null,{"$f":"IF(A207=\"\",\"\",\"\"&B207)","v":""},null,null,null,{"$f":"\"\"&INDEX(PP_Locale,ROW(),PP_LanguageIndex)","v":"Identification number [CVR] of performer of other statement 2"},"Identification number [CVR] of performer of other statement 2",null,null,"Øvrig erklæring 2, CVR-nr.",null,null,null,null,null,null,null,null,null,null,null,null,null,null,null,null,null,null,null,null,null,null,null,null,null,null,null,null,null,null,null,null,null,null,null,null,null,null,null,null,null,null,null,null,null,null,null,null,null,null,null,null,null,null,null,null,null,null,null,null,null,null,null,null,null,null,null,null,null,null,null,null,null,null,null,null,null,null,"&allowhtml=false&merge=false&skipspace=true",{"$f":"\"pp://General Data/\"&INDEX(PP_Locale,ROW(),1)&\"?taxonomy=\"&PP_TaxonomyId&\"&labellanguage=en&period=1\"&IF(PP_Consolidated,\"_Consolidated\",\"\")&CT207","v":"pp://General Data/Identification number [CVR] of performer of other statement 2?taxonomy=DKIFRS&labellanguage=en&period=1_Consolidated&allowhtml=false&merge=false&skipspace=true"}]
[{"$f":"\"\"&INDEX(PP_Locale,ROW(),PP_LanguageIndex)","v":"Name of firm performing other statement 2"},null,null,null,null,"PP_NameOfFirmperformingOtherStatement_2",null,null,null,null,{"$f":"IF(A208=\"\",\"\",\"\"&B208)","v":""},null,null,null,{"$f":"\"\"&INDEX(PP_Locale,ROW(),PP_LanguageIndex)","v":"Name of firm performing other statement 2"},"Name of firm performing other statement 2",null,null,"Øvrig erklæring 2, firmanavn",null,null,null,null,null,null,null,null,null,null,null,null,null,null,null,null,null,null,null,null,null,null,null,null,null,null,null,null,null,null,null,null,null,null,null,null,null,null,null,null,null,null,null,null,null,null,null,null,null,null,null,null,null,null,null,null,null,null,null,null,null,null,null,null,null,null,null,null,null,null,null,null,null,null,null,null,null,null,"&allowhtml=false&merge=false",{"$f":"\"pp://General Data/\"&INDEX(PP_Locale,ROW(),1)&\"?taxonomy=\"&PP_TaxonomyId&\"&labellanguage=en&period=1\"&IF(PP_Consolidated,\"_Consolidated\",\"\")&CT208","v":"pp://General Data/Name of firm performing other statement 2?taxonomy=DKIFRS&labellanguage=en&period=1_Consolidated&allowhtml=false&merge=false"}]
[{"$f":"\"\"&INDEX(PP_Locale,ROW(),PP_LanguageIndex)","v":"Name and surname of performer of other statement 2"},null,null,null,null,"PP_NameAndSurnameOfPerformerOfOtherStatement_2",null,null,null,null,{"$f":"IF(A209=\"\",\"\",\"\"&B209)","v":""},null,null,null,{"$f":"\"\"&INDEX(PP_Locale,ROW(),PP_LanguageIndex)","v":"Name and surname of performer of other statement 2"},"Name and surname of performer of other statement 2",null,null,"Øvrig erklæring 2, navn",null,null,null,null,null,null,null,null,null,null,null,null,null,null,null,null,null,null,null,null,null,null,null,null,null,null,null,null,null,null,null,null,null,null,null,null,null,null,null,null,null,null,null,null,null,null,null,null,null,null,null,null,null,null,null,null,null,null,null,null,null,null,null,null,null,null,null,null,null,null,null,null,null,null,null,null,null,null,"&allowhtml=false&merge=false",{"$f":"\"pp://General Data/\"&INDEX(PP_Locale,ROW(),1)&\"?taxonomy=\"&PP_TaxonomyId&\"&labellanguage=en&period=1\"&IF(PP_Consolidated,\"_Consolidated\",\"\")&CT209","v":"pp://General Data/Name and surname of performer of other statement 2?taxonomy=DKIFRS&labellanguage=en&period=1_Consolidated&allowhtml=false&merge=false"}]
[{"$f":"\"\"&INDEX(PP_Locale,ROW(),PP_LanguageIndex)","v":"Title of performer of other statement 2"},null,null,null,null,"PP_TitleOfPerformerOfOtherStatements_2",null,null,null,null,{"$f":"IF(A210=\"\",\"\",\"\"&B210)","v":""},null,null,null,{"$f":"\"\"&INDEX(PP_Locale,ROW(),PP_LanguageIndex)","v":"Title of performer of other statement 2"},"Title of performer of other statement 2",null,null,"Øvrig erklæring 2, titel",null,null,null,null,null,null,null,null,null,null,null,null,null,null,null,null,null,null,null,null,null,null,null,null,null,null,null,null,null,null,null,null,null,null,null,null,null,null,null,null,null,null,null,null,null,null,null,null,null,null,null,null,null,null,null,null,null,null,null,null,null,null,null,null,null,null,null,null,null,null,null,null,null,null,null,null,null,null,"&allowhtml=false&merge=false",{"$f":"\"pp://General Data/\"&INDEX(PP_Locale,ROW(),1)&\"?taxonomy=\"&PP_TaxonomyId&\"&labellanguage=en&period=1\"&IF(PP_Consolidated,\"_Consolidated\",\"\")&CT210","v":"pp://General Data/Title of performer of other statement 2?taxonomy=DKIFRS&labellanguage=en&period=1_Consolidated&allowhtml=false&merge=false"}]
[null,null,null,null,null,null,null,null,null,null,null,null,null,null,{"$f":"\"\"&INDEX(PP_Locale,ROW(),PP_LanguageIndex)","v":""}]
[{"$f":"\"\"&INDEX(PP_Locale,ROW(),PP_LanguageIndex)","v":"Liquidator:"},null,null,null,null,null,null,null,null,null,null,null,null,null,{"$f":"\"\"&INDEX(PP_Locale,ROW(),PP_LanguageIndex)","v":"Liquidator:"},"Liquidator:",null,null,"Likvidator:"]
[{"$f":"\"\"&INDEX(PP_Locale,ROW(),PP_LanguageIndex)","v":"Name and surname of liquidator"},null,null,null,null,"PP_NameAndSurnameOfLiquidator",null,null,null,null,{"$f":"\"\"&B213","v":""},null,null,null,{"$f":"\"\"&INDEX(PP_Locale,ROW(),PP_LanguageIndex)","v":"Name and surname of liquidator"},"Name and surname of liquidator",null,null,"Likvidators navn",null,null,null,null,null,null,null,null,null,null,null,null,null,null,null,null,null,null,null,null,null,null,null,null,null,null,null,null,null,null,null,null,null,null,null,null,null,null,null,null,null,null,null,null,null,null,null,null,null,null,null,null,null,null,null,null,null,null,null,null,null,null,null,null,null,null,null,null,null,null,null,null,null,null,null,null,null,null,"&allowhtml=false&merge=false",{"$f":"\"pp://General Data/\"&INDEX(PP_Locale,ROW(),1)&\"?taxonomy=\"&PP_TaxonomyId&\"&labellanguage=en&period=1\"&IF(PP_Consolidated,\"_Consolidated\",\"\")&CT213","v":"pp://General Data/Name and surname of liquidator?taxonomy=DKIFRS&labellanguage=en&period=1_Consolidated&allowhtml=false&merge=false"}]
[{"$f":"\"\"&INDEX(PP_Locale,ROW(),PP_LanguageIndex)","v":"Title of liquidator"},null,null,null,null,"PP_TitleOfLiquidator",null,null,null,null,{"$f":"\"\"&B214","v":""},null,null,null,{"$f":"\"\"&INDEX(PP_Locale,ROW(),PP_LanguageIndex)","v":"Title of liquidator"},"Title of liquidator",null,null,"Likvidators titel",null,null,null,null,null,null,null,null,null,null,null,null,null,null,null,null,null,null,null,null,null,null,null,null,null,null,null,null,null,null,null,null,null,null,null,null,null,null,null,null,null,null,null,null,null,null,null,null,null,null,null,null,null,null,null,null,null,null,null,null,null,null,null,null,null,null,null,null,null,null,null,null,null,null,null,null,null,null,"&allowhtml=false&merge=false",{"$f":"\"pp://General Data/\"&INDEX(PP_Locale,ROW(),1)&\"?taxonomy=\"&PP_TaxonomyId&\"&labellanguage=en&period=1\"&IF(PP_Consolidated,\"_Consolidated\",\"\")&CT214","v":"pp://General Data/Title of liquidator?taxonomy=DKIFRS&labellanguage=en&period=1_Consolidated&allowhtml=false&merge=false"}]
[null,null,null,null,null,null,null,null,null,null,null,null,null,null,{"$f":"\"\"&INDEX(PP_Locale,ROW(),PP_LanguageIndex)","v":""}]
[{"$f":"\"\"&INDEX(PP_Locale,ROW(),PP_LanguageIndex)","v":"Financial institution:"},null,null,null,null,null,null,null,null,null,null,null,null,null,{"$f":"\"\"&INDEX(PP_Locale,ROW(),PP_LanguageIndex)","v":"Financial institution:"},"Financial institution:",null,null,"Primær bankforbindelse:"]
[{"$f":"\"\"&INDEX(PP_Locale,ROW(),PP_LanguageIndex)","v":"Legal Entity Identifier [LEI] of financial institution"},null,null,null,null,"PP_LegalEntityIdentifierOfFinancialInstitution",null,null,null,null,{"$f":"\"\"&B217","v":""},null,null,null,{"$f":"\"\"&INDEX(PP_Locale,ROW(),PP_LanguageIndex)","v":"Legal Entity Identifier [LEI] of financial institution"},"Legal Entity Identifier [LEI] of financial institution",null,null,"Bankens LEI-kode",null,null,null,null,null,null,null,null,null,null,null,null,null,null,null,null,null,null,null,null,null,null,null,null,null,null,null,null,null,null,null,null,null,null,null,null,null,null,null,null,null,null,null,null,null,null,null,null,null,null,null,null,null,null,null,null,null,null,null,null,null,null,null,null,null,null,null,null,null,null,null,null,null,null,null,null,null,null,"&allowhtml=false&merge=false",{"$f":"\"pp://General Data/\"&INDEX(PP_Locale,ROW(),1)&\"?taxonomy=\"&PP_TaxonomyId&\"&labellanguage=en&period=1\"&IF(PP_Consolidated,\"_Consolidated\",\"\")&CT217","v":"pp://General Data/Legal Entity Identifier [LEI] of financial institution?taxonomy=DKIFRS&labellanguage=en&period=1_Consolidated&allowhtml=false&merge=false"}]
[{"$f":"\"\"&INDEX(PP_Locale,ROW(),PP_LanguageIndex)","v":"Identification number [CVR] of financial institution"},null,null,null,null,"PP_IdentificationNumberCvrOfFinancialInstitution",null,null,null,null,{"$f":"\"\"&SUBSTITUTE(B218,\" \",\"\")","v":""},null,null,null,{"$f":"\"\"&INDEX(PP_Locale,ROW(),PP_LanguageIndex)","v":"Identification number [CVR] of financial institution"},"Identification number [CVR] of financial institution",null,null,"Bankens CVR-nr.",null,null,null,null,null,null,null,null,null,null,null,null,null,null,null,null,null,null,null,null,null,null,null,null,null,null,null,null,null,null,null,null,null,null,null,null,null,null,null,null,null,null,null,null,null,null,null,null,null,null,null,null,null,null,null,null,null,null,null,null,null,null,null,null,null,null,null,null,null,null,null,null,null,null,null,null,null,null,"&allowhtml=false&merge=false&skipspace=true",{"$f":"\"pp://General Data/\"&INDEX(PP_Locale,ROW(),1)&\"?taxonomy=\"&PP_TaxonomyId&\"&labellanguage=en&period=1\"&IF(PP_Consolidated,\"_Consolidated\",\"\")&CT218","v":"pp://General Data/Identification number [CVR] of financial institution?taxonomy=DKIFRS&labellanguage=en&period=1_Consolidated&allowhtml=false&merge=false&skipspace=true"}]
[{"$f":"\"\"&INDEX(PP_Locale,ROW(),PP_LanguageIndex)","v":"Name of financial institution"},null,null,null,null,"PP_NameOfFinancialInstitution",null,null,null,null,{"$f":"\"\"&B219","v":""},null,null,null,{"$f":"\"\"&INDEX(PP_Locale,ROW(),PP_LanguageIndex)","v":"Name of financial institution"},"Name of financial institution",null,null,"Bankens navn",null,null,null,null,null,null,null,null,null,null,null,null,null,null,null,null,null,null,null,null,null,null,null,null,null,null,null,null,null,null,null,null,null,null,null,null,null,null,null,null,null,null,null,null,null,null,null,null,null,null,null,null,null,null,null,null,null,null,null,null,null,null,null,null,null,null,null,null,null,null,null,null,null,null,null,null,null,null,"&allowhtml=false&merge=false",{"$f":"\"pp://General Data/\"&INDEX(PP_Locale,ROW(),1)&\"?taxonomy=\"&PP_TaxonomyId&\"&labellanguage=en&period=1\"&IF(PP_Consolidated,\"_Consolidated\",\"\")&CT219","v":"pp://General Data/Name of financial institution?taxonomy=DKIFRS&labellanguage=en&period=1_Consolidated&allowhtml=false&merge=false"}]
[{"$f":"\"\"&INDEX(PP_Locale,ROW(),PP_LanguageIndex)","v":"Address of financial institution, street name"},null,null,null,null,"PP_AddressOfFinancialStreetName",null,null,null,null,"",null,null,null,{"$f":"\"\"&INDEX(PP_Locale,ROW(),PP_LanguageIndex)","v":"Address of financial institution, street name"},"Address of financial institution, street name",null,null,"Bankens adresse, vejnavn",null,null,null,null,null,null,null,null,null,null,null,null,null,null,null,null,null,null,null,null,null,null,null,null,null,null,null,null,null,null,null,null,null,null,null,null,null,null,null,null,null,null,null,null,null,null,null,null,null,null,null,null,null,null,null,null,null,null,null,null,null,null,null,null,null,null,null,null,null,null,null,null,null,null,null,null,null,null,"&allowhtml=false&merge=false",{"$f":"\"pp://General Data/\"&INDEX(PP_Locale,ROW(),1)&\"?taxonomy=\"&PP_TaxonomyId&\"&labellanguage=en&period=1\"&IF(PP_Consolidated,\"_Consolidated\",\"\")&CT220","v":"pp://General Data/Address of financial institution, street name?taxonomy=DKIFRS&labellanguage=en&period=1_Consolidated&allowhtml=false&merge=false"}]
[{"$f":"\"\"&INDEX(PP_Locale,ROW(),PP_LanguageIndex)","v":"Address of financial institution, street building identifier"},null,null,null,null,"PP_AddressOfFinancialStreetBuildingIdentifier",null,null,null,null,"",null,null,null,{"$f":"\"\"&INDEX(PP_Locale,ROW(),PP_LanguageIndex)","v":"Address of financial institution, street building identifier"},"Address of financial institution, street building identifier",null,null,"Bankens adresse, vejnr og etage",null,null,null,null,null,null,null,null,null,null,null,null,null,null,null,null,null,null,null,null,null,null,null,null,null,null,null,null,null,null,null,null,null,null,null,null,null,null,null,null,null,null,null,null,null,null,null,null,null,null,null,null,null,null,null,null,null,null,null,null,null,null,null,null,null,null,null,null,null,null,null,null,null,null,null,null,null,null,"&allowhtml=false&merge=false",{"$f":"\"pp://General Data/\"&INDEX(PP_Locale,ROW(),1)&\"?taxonomy=\"&PP_TaxonomyId&\"&labellanguage=en&period=1\"&IF(PP_Consolidated,\"_Consolidated\",\"\")&CT221","v":"pp://General Data/Address of financial institution, street building identifier?taxonomy=DKIFRS&labellanguage=en&period=1_Consolidated&allowhtml=false&merge=false"}]
[{"$f":"\"\"&INDEX(PP_Locale,ROW(),PP_LanguageIndex)","v":"Address of financial institution, post code identifier"},null,null,null,null,"PP_AddressOfFinancialPostCodeIdentifier",null,null,null,null,"",null,null,null,{"$f":"\"\"&INDEX(PP_Locale,ROW(),PP_LanguageIndex)","v":"Address of financial institution, post code identifier"},"Address of financial institution, post code identifier",null,null,"Bankens adresse, postnummer",null,null,null,null,null,null,null,null,null,null,null,null,null,null,null,null,null,null,null,null,null,null,null,null,null,null,null,null,null,null,null,null,null,null,null,null,null,null,null,null,null,null,null,null,null,null,null,null,null,null,null,null,null,null,null,null,null,null,null,null,null,null,null,null,null,null,null,null,null,null,null,null,null,null,null,null,null,null,"&allowhtml=false&merge=false",{"$f":"\"pp://General Data/\"&INDEX(PP_Locale,ROW(),1)&\"?taxonomy=\"&PP_TaxonomyId&\"&labellanguage=en&period=1\"&IF(PP_Consolidated,\"_Consolidated\",\"\")&CT222","v":"pp://General Data/Address of financial institution, post code identifier?taxonomy=DKIFRS&labellanguage=en&period=1_Consolidated&allowhtml=false&merge=false"}]
[{"$f":"\"\"&INDEX(PP_Locale,ROW(),PP_LanguageIndex)","v":"Address of financial institution, district name"},null,null,null,null,"PP_AddressOfFinancialDistrictName",null,null,null,null,"",null,null,null,{"$f":"\"\"&INDEX(PP_Locale,ROW(),PP_LanguageIndex)","v":"Address of financial institution, district name"},"Address of financial institution, district name",null,null,"Bankens adresse, by",null,null,null,null,null,null,null,null,null,null,null,null,null,null,null,null,null,null,null,null,null,null,null,null,null,null,null,null,null,null,null,null,null,null,null,null,null,null,null,null,null,null,null,null,null,null,null,null,null,null,null,null,null,null,null,null,null,null,null,null,null,null,null,null,null,null,null,null,null,null,null,null,null,null,null,null,null,null,"&allowhtml=false&merge=false",{"$f":"\"pp://General Data/\"&INDEX(PP_Locale,ROW(),1)&\"?taxonomy=\"&PP_TaxonomyId&\"&labellanguage=en&period=1\"&IF(PP_Consolidated,\"_Consolidated\",\"\")&CT223","v":"pp://General Data/Address of financial institution, district name?taxonomy=DKIFRS&labellanguage=en&period=1_Consolidated&allowhtml=false&merge=false"}]
[{"$f":"\"\"&INDEX(PP_Locale,ROW(),PP_LanguageIndex)","v":"Address of financial institution, country"},null,null,null,null,"PP_AddressOfFinancialCountry",null,null,null,null,"",null,null,null,{"$f":"\"\"&INDEX(PP_Locale,ROW(),PP_LanguageIndex)","v":"Address of financial institution, country"},"Address of financial institution, country",null,null,"Bankens adresse, land",null,null,null,null,null,null,null,null,null,null,null,null,null,null,null,null,null,null,null,null,null,null,null,null,null,null,null,null,null,null,null,null,null,null,null,null,null,null,null,null,null,null,null,null,null,null,null,null,null,null,null,null,null,null,null,null,null,null,null,null,null,null,null,null,null,null,null,null,null,null,null,null,null,null,null,null,null,null,"&allowhtml=false&merge=false",{"$f":"\"pp://General Data/\"&INDEX(PP_Locale,ROW(),1)&\"?taxonomy=\"&PP_TaxonomyId&\"&labellanguage=en&period=1\"&IF(PP_Consolidated,\"_Consolidated\",\"\")&CT224","v":"pp://General Data/Address of financial institution, country?taxonomy=DKIFRS&labellanguage=en&period=1_Consolidated&allowhtml=false&merge=false"}]
[{"$f":"\"\"&INDEX(PP_Locale,ROW(),PP_LanguageIndex)","v":"Address of financial institution, country identification code"},null,null,null,null,"PP_AddressOfFinancialCountryIdentificationCode",null,null,null,null,"",null,null,null,{"$f":"\"\"&INDEX(PP_Locale,ROW(),PP_LanguageIndex)","v":"Address of financial institution, country identification code"},"Address of financial institution, country identification code",null,null,"Bankens adresse, landekode",null,null,null,null,null,null,null,null,null,null,null,null,null,null,null,null,null,null,null,null,null,null,null,null,null,null,null,null,null,null,null,null,null,null,null,null,null,null,null,null,null,null,null,null,null,null,null,null,null,null,null,null,null,null,null,null,null,null,null,null,null,null,null,null,null,null,null,null,null,null,null,null,null,null,null,null,null,null,"&allowhtml=false&merge=false",{"$f":"\"pp://General Data/\"&INDEX(PP_Locale,ROW(),1)&\"?taxonomy=\"&PP_TaxonomyId&\"&labellanguage=en&period=1\"&IF(PP_Consolidated,\"_Consolidated\",\"\")&CT225","v":"pp://General Data/Address of financial institution, country identification code?taxonomy=DKIFRS&labellanguage=en&period=1_Consolidated&allowhtml=false&merge=false"}]
[null,null,null,null,null,null,null,null,null,null,null,null,null,null,{"$f":"\"\"&INDEX(PP_Locale,ROW(),PP_LanguageIndex)","v":""}]
[{"$f":"\"\"&INDEX(PP_Locale,ROW(),PP_LanguageIndex)","v":"Law firm:"},null,null,null,null,null,null,null,null,null,null,null,null,null,{"$f":"\"\"&INDEX(PP_Locale,ROW(),PP_LanguageIndex)","v":"Law firm:"},"Law firm:",null,null,"Advokat:"]
[{"$f":"\"\"&INDEX(PP_Locale,ROW(),PP_LanguageIndex)","v":"Legal Entity Identifier [LEI] of law firm"},null,null,null,null,"PP_LegalEntityIdentifierOfLawFirm",null,null,null,null,{"$f":"\"\"&B228","v":""},null,null,null,{"$f":"\"\"&INDEX(PP_Locale,ROW(),PP_LanguageIndex)","v":"Legal Entity Identifier [LEI] of law firm"},"Legal Entity Identifier [LEI] of law firm",null,null,"Advokatens LEI-kode",null,null,null,null,null,null,null,null,null,null,null,null,null,null,null,null,null,null,null,null,null,null,null,null,null,null,null,null,null,null,null,null,null,null,null,null,null,null,null,null,null,null,null,null,null,null,null,null,null,null,null,null,null,null,null,null,null,null,null,null,null,null,null,null,null,null,null,null,null,null,null,null,null,null,null,null,null,null,"&allowhtml=false&merge=false",{"$f":"\"pp://General Data/\"&INDEX(PP_Locale,ROW(),1)&\"?taxonomy=\"&PP_TaxonomyId&\"&labellanguage=en&period=1\"&IF(PP_Consolidated,\"_Consolidated\",\"\")&CT228","v":"pp://General Data/Legal Entity Identifier [LEI] of law firm?taxonomy=DKIFRS&labellanguage=en&period=1_Consolidated&allowhtml=false&merge=false"}]
[{"$f":"\"\"&INDEX(PP_Locale,ROW(),PP_LanguageIndex)","v":"Identification number [CVR] of law firm"},null,null,null,null,"PP_IdentificationNumberCvrOfLawFirm",null,null,null,null,{"$f":"\"\"&SUBSTITUTE(B229,\" \",\"\")","v":""},null,null,null,{"$f":"\"\"&INDEX(PP_Locale,ROW(),PP_LanguageIndex)","v":"Identification number [CVR] of law firm"},"Identification number [CVR] of law firm",null,null,"Advokatens CVR-nr.",null,null,null,null,null,null,null,null,null,null,null,null,null,null,null,null,null,null,null,null,null,null,null,null,null,null,null,null,null,null,null,null,null,null,null,null,null,null,null,null,null,null,null,null,null,null,null,null,null,null,null,null,null,null,null,null,null,null,null,null,null,null,null,null,null,null,null,null,null,null,null,null,null,null,null,null,null,null,"&allowhtml=false&merge=false&skipspace=true",{"$f":"\"pp://General Data/\"&INDEX(PP_Locale,ROW(),1)&\"?taxonomy=\"&PP_TaxonomyId&\"&labellanguage=en&period=1\"&IF(PP_Consolidated,\"_Consolidated\",\"\")&CT229","v":"pp://General Data/Identification number [CVR] of law firm?taxonomy=DKIFRS&labellanguage=en&period=1_Consolidated&allowhtml=false&merge=false&skipspace=true"}]
[{"$f":"\"\"&INDEX(PP_Locale,ROW(),PP_LanguageIndex)","v":"Identification number [PNR] of law firm"},null,null,null,null,"PP_IdentificationNumberPnrOfLawFirm",null,null,null,null,{"$f":"\"\"&SUBSTITUTE(B230,\"-\",\"\")","v":""},null,null,null,{"$f":"\"\"&INDEX(PP_Locale,ROW(),PP_LanguageIndex)","v":"Identification number [PNR] of law firm"},"Identification number [PNR] of law firm",null,null,"Advokatens P-nr.",null,null,null,null,null,null,null,null,null,null,null,null,null,null,null,null,null,null,null,null,null,null,null,null,null,null,null,null,null,null,null,null,null,null,null,null,null,null,null,null,null,null,null,null,null,null,null,null,null,null,null,null,null,null,null,null,null,null,null,null,null,null,null,null,null,null,null,null,null,null,null,null,null,null,null,null,null,null,"&allowhtml=false&merge=false",{"$f":"\"pp://General Data/\"&INDEX(PP_Locale,ROW(),1)&\"?taxonomy=\"&PP_TaxonomyId&\"&labellanguage=en&period=1\"&IF(PP_Consolidated,\"_Consolidated\",\"\")&CT230","v":"pp://General Data/Identification number [PNR] of law firm?taxonomy=DKIFRS&labellanguage=en&period=1_Consolidated&allowhtml=false&merge=false"}]
[{"$f":"\"\"&INDEX(PP_Locale,ROW(),PP_LanguageIndex)","v":"Name of law firm"},null,null,null,null,"PP_NameOfLawFirm",null,null,null,null,{"$f":"\"\"&B231","v":""},null,null,null,{"$f":"\"\"&INDEX(PP_Locale,ROW(),PP_LanguageIndex)","v":"Name of law firm"},"Name of law firm",null,null,"Advokatens navn",null,null,null,null,null,null,null,null,null,null,null,null,null,null,null,null,null,null,null,null,null,null,null,null,null,null,null,null,null,null,null,null,null,null,null,null,null,null,null,null,null,null,null,null,null,null,null,null,null,null,null,null,null,null,null,null,null,null,null,null,null,null,null,null,null,null,null,null,null,null,null,null,null,null,null,null,null,null,"&allowhtml=false&merge=false",{"$f":"\"pp://General Data/\"&INDEX(PP_Locale,ROW(),1)&\"?taxonomy=\"&PP_TaxonomyId&\"&labellanguage=en&period=1\"&IF(PP_Consolidated,\"_Consolidated\",\"\")&CT231","v":"pp://General Data/Name of law firm?taxonomy=DKIFRS&labellanguage=en&period=1_Consolidated&allowhtml=false&merge=false"}]
[{"$f":"\"\"&INDEX(PP_Locale,ROW(),PP_LanguageIndex)","v":"Address of law firm, street name"},null,null,null,null,"PP_AddressOfLawFirmStreetName",null,null,null,null,"",null,null,null,{"$f":"\"\"&INDEX(PP_Locale,ROW(),PP_LanguageIndex)","v":"Address of law firm, street name"},"Address of law firm, street name",null,null,"Advokatens adresse, vejnavn",null,null,null,null,null,null,null,null,null,null,null,null,null,null,null,null,null,null,null,null,null,null,null,null,null,null,null,null,null,null,null,null,null,null,null,null,null,null,null,null,null,null,null,null,null,null,null,null,null,null,null,null,null,null,null,null,null,null,null,null,null,null,null,null,null,null,null,null,null,null,null,null,null,null,null,null,null,null,"&allowhtml=false&merge=false",{"$f":"\"pp://General Data/\"&INDEX(PP_Locale,ROW(),1)&\"?taxonomy=\"&PP_TaxonomyId&\"&labellanguage=en&period=1\"&IF(PP_Consolidated,\"_Consolidated\",\"\")&CT232","v":"pp://General Data/Address of law firm, street name?taxonomy=DKIFRS&labellanguage=en&period=1_Consolidated&allowhtml=false&merge=false"}]
[{"$f":"\"\"&INDEX(PP_Locale,ROW(),PP_LanguageIndex)","v":"Address of law firm, street building identifier"},null,null,null,null,"PP_AddressOfLawFirmStreetBuildingIdentifier",null,null,null,null,"",null,null,null,{"$f":"\"\"&INDEX(PP_Locale,ROW(),PP_LanguageIndex)","v":"Address of law firm, street building identifier"},"Address of law firm, street building identifier",null,null,"Advokatens adresse, vejnr og etage",null,null,null,null,null,null,null,null,null,null,null,null,null,null,null,null,null,null,null,null,null,null,null,null,null,null,null,null,null,null,null,null,null,null,null,null,null,null,null,null,null,null,null,null,null,null,null,null,null,null,null,null,null,null,null,null,null,null,null,null,null,null,null,null,null,null,null,null,null,null,null,null,null,null,null,null,null,null,"&allowhtml=false&merge=false",{"$f":"\"pp://General Data/\"&INDEX(PP_Locale,ROW(),1)&\"?taxonomy=\"&PP_TaxonomyId&\"&labellanguage=en&period=1\"&IF(PP_Consolidated,\"_Consolidated\",\"\")&CT233","v":"pp://General Data/Address of law firm, street building identifier?taxonomy=DKIFRS&labellanguage=en&period=1_Consolidated&allowhtml=false&merge=false"}]
[{"$f":"\"\"&INDEX(PP_Locale,ROW(),PP_LanguageIndex)","v":"Address of law firm, post code identifier"},null,null,null,null,"PP_AddressOfLawFirmPostCodeIdentifier",null,null,null,null,"",null,null,null,{"$f":"\"\"&INDEX(PP_Locale,ROW(),PP_LanguageIndex)","v":"Address of law firm, post code identifier"},"Address of law firm, post code identifier",null,null,"Advokatens adresse, postnummer",null,null,null,null,null,null,null,null,null,null,null,null,null,null,null,null,null,null,null,null,null,null,null,null,null,null,null,null,null,null,null,null,null,null,null,null,null,null,null,null,null,null,null,null,null,null,null,null,null,null,null,null,null,null,null,null,null,null,null,null,null,null,null,null,null,null,null,null,null,null,null,null,null,null,null,null,null,null,"&allowhtml=false&merge=false",{"$f":"\"pp://General Data/\"&INDEX(PP_Locale,ROW(),1)&\"?taxonomy=\"&PP_TaxonomyId&\"&labellanguage=en&period=1\"&IF(PP_Consolidated,\"_Consolidated\",\"\")&CT234","v":"pp://General Data/Address of law firm, post code identifier?taxonomy=DKIFRS&labellanguage=en&period=1_Consolidated&allowhtml=false&merge=false"}]
[{"$f":"\"\"&INDEX(PP_Locale,ROW(),PP_LanguageIndex)","v":"Address of law firm, district name"},null,null,null,null,"PP_AddressOfLawFirmDistrictName",null,null,null,null,"",null,null,null,{"$f":"\"\"&INDEX(PP_Locale,ROW(),PP_LanguageIndex)","v":"Address of law firm, district name"},"Address of law firm, district name",null,null,"Advokatens adresse, by",null,null,null,null,null,null,null,null,null,null,null,null,null,null,null,null,null,null,null,null,null,null,null,null,null,null,null,null,null,null,null,null,null,null,null,null,null,null,null,null,null,null,null,null,null,null,null,null,null,null,null,null,null,null,null,null,null,null,null,null,null,null,null,null,null,null,null,null,null,null,null,null,null,null,null,null,null,null,"&allowhtml=false&merge=false",{"$f":"\"pp://General Data/\"&INDEX(PP_Locale,ROW(),1)&\"?taxonomy=\"&PP_TaxonomyId&\"&labellanguage=en&period=1\"&IF(PP_Consolidated,\"_Consolidated\",\"\")&CT235","v":"pp://General Data/Address of law firm, district name?taxonomy=DKIFRS&labellanguage=en&period=1_Consolidated&allowhtml=false&merge=false"}]
[{"$f":"\"\"&INDEX(PP_Locale,ROW(),PP_LanguageIndex)","v":"Address of law firm, country"},null,null,null,null,"PP_AddressOfLawFirmCountry",null,null,null,null,"",null,null,null,{"$f":"\"\"&INDEX(PP_Locale,ROW(),PP_LanguageIndex)","v":"Address of law firm, country"},"Address of law firm, country",null,null,"Advokatens adresse, land",null,null,null,null,null,null,null,null,null,null,null,null,null,null,null,null,null,null,null,null,null,null,null,null,null,null,null,null,null,null,null,null,null,null,null,null,null,null,null,null,null,null,null,null,null,null,null,null,null,null,null,null,null,null,null,null,null,null,null,null,null,null,null,null,null,null,null,null,null,null,null,null,null,null,null,null,null,null,"&allowhtml=false&merge=false",{"$f":"\"pp://General Data/\"&INDEX(PP_Locale,ROW(),1)&\"?taxonomy=\"&PP_TaxonomyId&\"&labellanguage=en&period=1\"&IF(PP_Consolidated,\"_Consolidated\",\"\")&CT236","v":"pp://General Data/Address of law firm, country?taxonomy=DKIFRS&labellanguage=en&period=1_Consolidated&allowhtml=false&merge=false"}]
[{"$f":"\"\"&INDEX(PP_Locale,ROW(),PP_LanguageIndex)","v":"Address of law firm, country identification code"},null,null,null,null,"PP_AddressOfLawFirmCountryIdentificationCode",null,null,null,null,"",null,null,null,{"$f":"\"\"&INDEX(PP_Locale,ROW(),PP_LanguageIndex)","v":"Address of law firm, country identification code"},"Address of law firm, country identification code",null,null,"Advokatens adresse, landekode",null,null,null,null,null,null,null,null,null,null,null,null,null,null,null,null,null,null,null,null,null,null,null,null,null,null,null,null,null,null,null,null,null,null,null,null,null,null,null,null,null,null,null,null,null,null,null,null,null,null,null,null,null,null,null,null,null,null,null,null,null,null,null,null,null,null,null,null,null,null,null,null,null,null,null,null,null,null,"&allowhtml=false&merge=false",{"$f":"\"pp://General Data/\"&INDEX(PP_Locale,ROW(),1)&\"?taxonomy=\"&PP_TaxonomyId&\"&labellanguage=en&period=1\"&IF(PP_Consolidated,\"_Consolidated\",\"\")&CT237","v":"pp://General Data/Address of law firm, country identification code?taxonomy=DKIFRS&labellanguage=en&period=1_Consolidated&allowhtml=false&merge=false"}]
[null,null,null,null,null,null,null,null,null,null,null,null,null,null,{"$f":"\"\"&INDEX(PP_Locale,ROW(),PP_LanguageIndex)","v":""}]
["Technical information:",null,null,null,null,null,null,null,null,null,null,null,null,null,{"$f":"\"\"&INDEX(PP_Locale,ROW(),PP_LanguageIndex)","v":"Technical information:"},"Technical information:",null,null,"Teknisk information:","Technische Information:",null,"Información técnica:",null,null,"Informations techniques:",null,null,"Informazioni tecniche:",null,null,null,null,null,"Specyfikacja:"]
[{"$f":"\"\"&INDEX(PP_Locale,ROW(),PP_LanguageIndex)","v":"Taxonomy"},"DK IFRS",null,null,null,"PP_Taxonomy","DK IFRS",null,null,null,null,null,null,null,{"$f":"\"\"&INDEX(PP_Locale,ROW(),PP_LanguageIndex)","v":"Taxonomy"},"Taxonomy",null,null,"Taksonomi","Taxonomie",null,"Taxonomía",null,null,"Taxonomie",null,null,"Tassonomia",null,null,null,null,null,"Taksonomia",null,null,null,null,null,null,null,null,null,null,null,null,null,null,null,null,null,null,null,null,null,null,null,null,null,null,null,null,null,null,null,null,null,null,null,null,null,null,null,null,"DK IFRS","DK IFRS 20201220","DK IFRS 20191220","DK IFRS 20171220"]
[{"$f":"\"\"&INDEX(PP_Locale,ROW(),PP_LanguageIndex)","v":"Taxonomy ID"},"DKIFRS",null,null,null,"PP_TaxonomyId","DKIFRS",null,null,null,null,null,null,null,{"$f":"\"\"&INDEX(PP_Locale,ROW(),PP_LanguageIndex)","v":"Taxonomy ID"},"Taxonomy ID",null,null,"Taksonomi ID"]
[{"$f":"\"\"&INDEX(PP_Locale,ROW(),PP_LanguageIndex)","v":"Taxonomy entrypoint"},{"$f":"\"Income statement (\"&IF(OR(IFERROR(COUNTIF(INDIRECT(\"'Income Statement'!A1:Z99\"),\"*by Function(*\"),0),IFERROR(COUNTIF(INDIRECT(\"'Comprehensive Income'!A1:Z99\"),\"*by Function(*\"),0)),\"by function\",\"by nature\")&\"), Financial position (\"&IF(IFERROR(COUNTIF(INDIRECT(\"'Balance sheet'!A1:Z99\"),\"*current assets(*\"),0),\"current/non-current\",\"order of liquidity\")&\"), Comprehensive income (\"&IF(IFERROR(COUNTIF(INDIRECT(\"'Comprehensive income'!A1:Z99\"),\"*net of tax(*\"),0),\"net of tax\",\"before tax\")&\"), Cash flow (\"&IF(IFERROR(COUNTIF(INDIRECT(\"'Cash Flow'!A1:Z99\"),\"*direct(*\"),0),\"direct\",\"indirect\")&\")\"","v":"Income statement (by function), Financial position (current/non-current), Comprehensive income (net of tax), Cash flow (indirect)"},null,null,null,"PP_TaxonomyEntrypoint",{"$f":"\"Income statement (\"&IF(OR(IFERROR(COUNTIF(INDIRECT(\"'Income Statement'!A1:Z99\"),\"*by Function(*\"),0),IFERROR(COUNTIF(INDIRECT(\"'Comprehensive Income'!A1:Z99\"),\"*by Function(*\"),0)),\"by function\",\"by nature\")&\"), Financial position (\"&IF(IFERROR(COUNTIF(INDIRECT(\"'Balance sheet'!A1:Z99\"),\"*current assets(*\"),0),\"current/non-current\",\"order of liquidity\")&\"), Comprehensive income (\"&IF(IFERROR(COUNTIF(INDIRECT(\"'Comprehensive income'!A1:Z99\"),\"*net of tax(*\"),0),\"net of tax\",\"before tax\")&\"), Cash flow (\"&IF(IFERROR(COUNTIF(INDIRECT(\"'Cash Flow'!A1:Z99\"),\"*direct(*\"),0),\"direct\",\"indirect\")&\")\"","v":"Income statement (by function), Financial position (current/non-current), Comprehensive income (net of tax), Cash flow (indirect)"},null,null,null,null,null,null,null,{"$f":"\"\"&INDEX(PP_Locale,ROW(),PP_LanguageIndex)","v":"Taxonomy entrypoint"},"Taxonomy entrypoint",null,null,"Taksonomi entrypoint","Einstiegspunkt",null,"Punto de acceso",null,null,"Point d'accès",null,null,"Punto d'entrata",null,null,null,null,null,"Punkt wejścia",null,null,null,null,null,null,null,null,null,null,null,null,null,null,null,null,null,null,null,null,null,null,null,null,null,null,null,null,null,null,null,null,null,null,null,null,null,null,null,null,{"$f":"IFERROR(VLOOKUP(\"Income statement (by nature), Financial position (current/non-current), Comprehensive income (before tax), Cash flow statement (indirect)\",PP_Locale,PP_LanguageIndex,FALSE),\"Income statement (by nature), Financial position (current/non-current), Comprehensive income (before tax), Cash flow statement (indirect)\")","v":"Income statement (by nature), Financial position (current/non-current), Comprehensive income (before tax), Cash flow statement (indirect)"},{"$f":"IFERROR(VLOOKUP(\"Income statement (by function), Financial position (current/non-current), Comprehensive income (before tax), Cash flow statement (indirect)\",PP_Locale,PP_LanguageIndex,FALSE),\"Income statement (by function), Financial position (current/non-current), Comprehensive income (before tax), Cash flow statement (indirect)\")","v":"Income statement (by function), Financial position (current/non-current), Comprehensive income (before tax), Cash flow statement (indirect)"},{"$f":"IFERROR(VLOOKUP(\"Income statement (by nature), Financial position (current/non-current), Comprehensive income (net of tax), Cash flow statement (indirect)\",PP_Locale,PP_LanguageIndex,FALSE),\"Income statement (by nature), Financial position (current/non-current), Comprehensive income (net of tax), Cash flow statement (indirect)\")","v":"Income statement (by nature), Financial position (current/non-current), Comprehensive income (net of tax), Cash flow statement (indirect)"},{"$f":"IFERROR(VLOOKUP(\"Income statement (by function), Financial position (current/non-current), Comprehensive income (net of tax), Cash flow statement (indirect)\",PP_Locale,PP_LanguageIndex,FALSE),\"Income statement (by function), Financial position (current/non-current), Comprehensive income (net of tax), Cash flow statement (indirect)\")","v":"Income statement (by function), Financial position (current/non-current), Comprehensive income (net of tax), Cash flow statement (indirect)"},{"$f":"IFERROR(VLOOKUP(\"Income statement (by nature), Financial position (order of liquidity), Comprehensive income (before tax), Cash flow statement (indirect)\",PP_Locale,PP_LanguageIndex,FALSE),\"Income statement (by nature), Financial position (order of liquidity), Comprehensive income (before tax), Cash flow statement (indirect)\")","v":"Income statement (by nature), Financial position (order of liquidity), Comprehensive income (before tax), Cash flow statement (indirect)"},{"$f":"IFERROR(VLOOKUP(\"Income statement (by function), Financial position (order of liquidity), Comprehensive income (before tax), Cash flow statement (indirect)\",PP_Locale,PP_LanguageIndex,FALSE),\"Income statement (by function), Financial position (order of liquidity), Comprehensive income (before tax), Cash flow statement (indirect)\")","v":"Income statement (by function), Financial position (order of liquidity), Comprehensive income (before tax), Cash flow statement (indirect)"},{"$f":"IFERROR(VLOOKUP(\"Income statement (by nature), Financial position (order of liquidity), Comprehensive income (net of tax), Cash flow statement (indirect)\",PP_Locale,PP_LanguageIndex,FALSE),\"Income statement (by nature), Financial position (order of liquidity), Comprehensive income (net of tax), Cash flow statement (indirect)\")","v":"Income statement (by nature), Financial position (order of liquidity), Comprehensive income (net of tax), Cash flow statement (indirect)"},{"$f":"IFERROR(VLOOKUP(\"Income statement (by function), Financial position (order of liquidity), Comprehensive income (net of tax), Cash flow statement (indirect)\",PP_Locale,PP_LanguageIndex,FALSE),\"Income statement (by function), Financial position (order of liquidity), Comprehensive income (net of tax), Cash flow statement (indirect)\")","v":"Income statement (by function), Financial position (order of liquidity), Comprehensive income (net of tax), Cash flow statement (indirect)"},{"$f":"IFERROR(VLOOKUP(\"Income statement (by nature), Financial position (current/non-current), Comprehensive income (before tax), Cash flow statement (direct)\",PP_Locale,PP_LanguageIndex,FALSE),\"Income statement (by nature), Financial position (current/non-current), Comprehensive income (before tax), Cash flow statement (direct)\")","v":"Income statement (by nature), Financial position (current/non-current), Comprehensive income (before tax), Cash flow statement (direct)"},{"$f":"IFERROR(VLOOKUP(\"Income statement (by function), Financial position (current/non-current), Comprehensive income (before tax), Cash flow statement (direct)\",PP_Locale,PP_LanguageIndex,FALSE),\"Income statement (by function), Financial position (current/non-current), Comprehensive income (before tax), Cash flow statement (direct)\")","v":"Income statement (by function), Financial position (current/non-current), Comprehensive income (before tax), Cash flow statement (direct)"},{"$f":"IFERROR(VLOOKUP(\"Income statement (by nature), Financial position (current/non-current), Comprehensive income (net of tax), Cash flow statement (direct)\",PP_Locale,PP_LanguageIndex,FALSE),\"Income statement (by nature), Financial position (current/non-current), Comprehensive income (net of tax), Cash flow statement (direct)\")","v":"Income statement (by nature), Financial position (current/non-current), Comprehensive income (net of tax), Cash flow statement (direct)"},{"$f":"IFERROR(VLOOKUP(\"Income statement (by function), Financial position (current/non-current), Comprehensive income (net of tax), Cash flow statement (direct)\",PP_Locale,PP_LanguageIndex,FALSE),\"Income statement (by function), Financial position (current/non-current), Comprehensive income (net of tax), Cash flow statement (direct)\")","v":"Income statement (by function), Financial position (current/non-current), Comprehensive income (net of tax), Cash flow statement (direct)"},{"$f":"IFERROR(VLOOKUP(\"Income statement (by nature), Financial position (order of liquidity), Comprehensive income (before tax), Cash flow statement (direct)\",PP_Locale,PP_LanguageIndex,FALSE),\"Income statement (by nature), Financial position (order of liquidity), Comprehensive income (before tax), Cash flow statement (direct)\")","v":"Income statement (by nature), Financial position (order of liquidity), Comprehensive income (before tax), Cash flow statement (direct)"},{"$f":"IFERROR(VLOOKUP(\"Income statement (by function), Financial position (order of liquidity), Comprehensive income (before tax), Cash flow statement (direct)\",PP_Locale,PP_LanguageIndex,FALSE),\"Income statement (by function), Financial position (order of liquidity), Comprehensive income (before tax), Cash flow statement (direct)\")","v":"Income statement (by function), Financial position (order of liquidity), Comprehensive income (before tax), Cash flow statement (direct)"},{"$f":"IFERROR(VLOOKUP(\"Income statement (by nature), Financial position (order of liquidity), Comprehensive income (net of tax), Cash flow statement (direct)\",PP_Locale,PP_LanguageIndex,FALSE),\"Income statement (by nature), Financial position (order of liquidity), Comprehensive income (net of tax), Cash flow statement (direct)\")","v":"Income statement (by nature), Financial position (order of liquidity), Comprehensive income (net of tax), Cash flow statement (direct)"},{"$f":"IFERROR(VLOOKUP(\"Income statement (by function), Financial position (order of liquidity), Comprehensive income (net of tax), Cash flow statement (direct)\",PP_Locale,PP_LanguageIndex,FALSE),\"Income statement (by function), Financial position (order of liquidity), Comprehensive income (net of tax), Cash flow statement (direct)\")","v":"Income statement (by function), Financial position (order of liquidity), Comprehensive income (net of tax), Cash flow statement (direct)"}]
[{"$f":"\"\"&INDEX(PP_Locale,ROW(),PP_LanguageIndex)","v":"Identifier scheme"},"http://www.dcca.dk/cvr",null,null,null,"PP_IdentifierScheme","http://www.dcca.dk/cvr",null,null,null,{"$f":"\"\"&B243","v":"http://www.dcca.dk/cvr"},null,null,null,{"$f":"\"\"&INDEX(PP_Locale,ROW(),PP_LanguageIndex)","v":"Identifier scheme"},"Identifier scheme",null,null,"Identifier scheme","Identifikationsschema",null,"Esquema de identificación",null,null,"Schéma d'identification",null,null,"Schema identificativo",null,null,null,null,null,"Schemat identyfikacyjny"]
[{"$f":"\"\"&INDEX(PP_Locale,ROW(),PP_LanguageIndex)","v":"Customer domain"},{"$f":"IF(ISBLANK(PP_NameOfReportingEntity),\"REF\",LEFT(SUBSTITUTE(SUBSTITUTE(SUBSTITUTE(SUBSTITUTE(SUBSTITUTE(SUBSTITUTE(SUBSTITUTE(SUBSTITUTE(SUBSTITUTE(SUBSTITUTE(SUBSTITUTE(SUBSTITUTE(SUBSTITUTE(SUBSTITUTE(UPPER(PP_NameOfReportingEntity),\" \",\"\"),\"-\",\"\"),\".\",\"\"),\",\",\"\"),\"'\",\"\"),\"Á\",\"A\"),\"É\",\"E\"),\"Ü\",\"U\"),\"Í\",\"I\"),\"Æ\",\"A\"),\"Ø\",\"O\"),\"Å\",\"A\"),\"&\",\"\"),\"+\",\"\"),4))","v":"TEST"},null,null,null,"PP_CustomerDomain",{"$f":"IF(ISBLANK(PP_NameOfReportingEntity),\"REF\",LEFT(SUBSTITUTE(SUBSTITUTE(SUBSTITUTE(SUBSTITUTE(SUBSTITUTE(SUBSTITUTE(SUBSTITUTE(SUBSTITUTE(SUBSTITUTE(SUBSTITUTE(SUBSTITUTE(SUBSTITUTE(SUBSTITUTE(SUBSTITUTE(UPPER(PP_NameOfReportingEntity),\" \",\"\"),\"-\",\"\"),\".\",\"\"),\",\",\"\"),\"'\",\"\"),\"Á\",\"A\"),\"É\",\"E\"),\"Ü\",\"U\"),\"Í\",\"I\"),\"Æ\",\"A\"),\"Ø\",\"O\"),\"Å\",\"A\"),\"&\",\"\"),\"+\",\"\"),4))","v":"TEST"},null,null,null,null,null,null,null,{"$f":"\"\"&INDEX(PP_Locale,ROW(),PP_LanguageIndex)","v":"Customer domain"},"Customer domain",null,null,"Kunde domæne","Kundendomäne",null,"Dominio del cliente",null,null,"Domaine client",null,null,"Dominio del cliente",null,null,null,null,null,"Domena klienta"]
[{"$f":"\"\"&INDEX(PP_Locale,ROW(),PP_LanguageIndex)","v":"Reference date"},{"$f":"TEXT(YEAR(MAX(PP_Periods)),\"0000\")&TEXT(MONTH(MAX(PP_Periods)),\"00\")&TEXT(DAY(MAX(PP_Periods)),\"00\")","v":"20201231"},null,null,null,"PP_ReferenceDate",{"$f":"TEXT(YEAR(MAX(PP_Periods)),\"0000\")&TEXT(MONTH(MAX(PP_Periods)),\"00\")&TEXT(DAY(MAX(PP_Periods)),\"00\")","v":"20201231"},null,null,null,null,null,null,null,{"$f":"\"\"&INDEX(PP_Locale,ROW(),PP_LanguageIndex)","v":"Reference date"},"Reference date",null,null,"Reference dato","Referenzdatum",null,"Fecha de referencia",null,null,"Date de référence",null,null,"Data di riferimento",null,null,null,null,null,"Data odniesienia"]
[{"$f":"\"\"&INDEX(PP_Locale,ROW(),PP_LanguageIndex)","v":"Customer taxonomy filename"},{"$f":"\"\"&PP_CustomerDomain&\"_\"&PP_ReferenceDate","v":"TEST_20201231"},null,null,null,"PP_CustomTaxonomyFileName",{"$f":"\"\"&PP_CustomerDomain&\"_\"&PP_ReferenceDate","v":"TEST_20201231"},null,null,null,null,null,null,null,{"$f":"\"\"&INDEX(PP_Locale,ROW(),PP_LanguageIndex)","v":"Customer taxonomy filename"},"Customer taxonomy filename",null,null,"Kunde taksonomi filnavn","Dateiname der Kundentaxonomie ",null,"Nombre de archivo de taxonomía del cliente",null,null,"Nom du fichier de taxonomie client ",null,null,"Nome file tassonomia cliente",null,null,null,null,null,"Nazwa pliku taksonomii klienta"]
[{"$f":"\"\"&INDEX(PP_Locale,ROW(),PP_LanguageIndex)","v":"Customer taxonomy report filename"},{"$f":"\"reports\\\"&PP_CustomerDomain&\"-\"&PP_ReferenceDate&\"_\"&LOWER(PP_Language)&\".xhtml\"","v":"reports\\TEST-20201231_en.xhtml"},null,null,null,"PP_CustomTaxonomyReportFileName",{"$f":"\"reports\\\"&PP_CustomerDomain&\"-\"&PP_ReferenceDate&\"_\"&LOWER(PP_Language)&\".xhtml\"","v":"reports\\TEST-20201231_en.xhtml"},null,null,null,null,null,null,null,{"$f":"\"\"&INDEX(PP_Locale,ROW(),PP_LanguageIndex)","v":"Customer taxonomy report filename"},"Customer taxonomy report filename",null,null,"Kunde taksonomi rapport filnavn","Dateiname des Kundentaxonomieberichts",null,"Nombre de archivo del informe de taxonomía del cliente",null,null,"Nom de fichier du rapport de taxonomie client",null,null,"Nome file report tassonomia cliente",null,null,null,null,null,"Nazwa pliku raportu taksonomii klienta"]
[{"$f":"\"\"&INDEX(PP_Locale,ROW(),PP_LanguageIndex)","v":"Customer taxonomy name"},{"$f":"\"archprod.service.eogs.dk\\taxonomy\\extension\\\"&PP_CustomTaxonomyFileName&\"\\\"&PP_CustomerDomain","v":"archprod.service.eogs.dk\\taxonomy\\extension\\TEST_20201231\\TEST"},null,null,null,"PP_CustomTaxonomyName",{"$f":"\"archprod.service.eogs.dk\\taxonomy\\extension\\\"&PP_CustomTaxonomyFileName&\"\\\"&PP_CustomerDomain","v":"archprod.service.eogs.dk\\taxonomy\\extension\\TEST_20201231\\TEST"},null,null,null,null,null,null,null,{"$f":"\"\"&INDEX(PP_Locale,ROW(),PP_LanguageIndex)","v":"Customer taxonomy name"},"Customer taxonomy name",null,null,"Kunde taksonomi navn","Name der Kundentaxonomie",null,"Nombre de taxonomía del cliente",null,null,"Nom de la taxonomie du client",null,null,"Nome tassonomia cliente",null,null,null,null,null,"Nazwa taksonomii klienta"]
[{"$f":"\"\"&INDEX(PP_Locale,ROW(),PP_LanguageIndex)","v":"Customer taxonomy publisher"},{"$f":"\"\"&PP_NameOfReportingEntity","v":"Test customer"},null,null,null,"PP_CustomTaxonomyPublisher",{"$f":"\"\"&PP_NameOfReportingEntity","v":"Test customer"},null,null,null,null,null,null,null,{"$f":"\"\"&IF(ISBLANK(INDEX(PP_Locale,ROW(),PP_LanguageIndex)),INDEX(PP_Locale,ROW(),1),INDEX(PP_Locale,ROW(),PP_LanguageIndex))","v":"Customer taxonomy publisher"},"Customer taxonomy publisher",null,null,"Kunde taksonomi udgiver","Herausgeber der Kundentaxonomie",null,"Editor de taxonomía de clientes",null,null,"Éditeur de taxonomie client",null,null,"Editore della tassonomia del cliente",null,null,null,null,null,"Wydawca taksonomii klienta"]
[{"$f":"\"\"&INDEX(PP_Locale,ROW(),PP_LanguageIndex)","v":"Customer taxonomy publisher website"},{"$f":"\"\"&PP_HomepageOfReportingEntity","v":""},null,null,null,"PP_CustomTaxonomyPublisherWebsite",{"$f":"\"\"&PP_HomepageOfReportingEntity","v":""},null,null,null,null,null,null,null,{"$f":"\"\"&IF(ISBLANK(INDEX(PP_Locale,ROW(),PP_LanguageIndex)),INDEX(PP_Locale,ROW(),1),INDEX(PP_Locale,ROW(),PP_LanguageIndex))","v":"Customer taxonomy publisher website"},"Customer taxonomy publisher website",null,null,"Kunde taksonomi website","Publisher-Website für Kundentaxonomie",null,"Sitio web del editor de taxonomía de clientes",null,null,"Site Web de l'éditeur de taxonomie client",null,null,"Sito web dell'editore della tassonomia del cliente",null,null,null,null,null,"Witryna wydawcy taksonomii klientów"]
[{"$f":"\"\"&INDEX(PP_Locale,ROW(),PP_LanguageIndex)","v":"Customer taxonomy publisher country"},{"$f":"PP_CountryCode","v":"DK"},null,null,null,"PP_CustomTaxonomyPublisherCountry",{"$f":"PP_CountryCode","v":"DK"},null,null,null,null,null,null,null,{"$f":"\"\"&IF(ISBLANK(INDEX(PP_Locale,ROW(),PP_LanguageIndex)),INDEX(PP_Locale,ROW(),1),INDEX(PP_Locale,ROW(),PP_LanguageIndex))","v":"Customer taxonomy publisher country"},"Customer taxonomy publisher country",null,null,"Kunde taksonomi land","Verlagsland der Kundentaxonomie",null,"País editor de taxonomía del cliente",null,null,"Pays de l'éditeur de la taxonomie client",null,null,"Paese editore della tassonomia del cliente",null,null,null,null,null,"Kraj wydawcy taksonomii klienta"]
[{"$f":"\"\"&INDEX(PP_Locale,ROW(),PP_LanguageIndex)","v":"Customer taxonomy abbreviation"},{"$f":"IF(ISBLANK(PP_NameOfReportingEntity),\"REF\",LEFT(SUBSTITUTE(SUBSTITUTE(SUBSTITUTE(SUBSTITUTE(SUBSTITUTE(SUBSTITUTE(SUBSTITUTE(SUBSTITUTE(SUBSTITUTE(SUBSTITUTE(SUBSTITUTE(SUBSTITUTE(SUBSTITUTE(SUBSTITUTE(UPPER(PP_NameOfReportingEntity),\" \",\"\"),\"-\",\"\"),\".\",\"\"),\",\",\"\"),\"'\",\"\"),\"Á\",\"A\"),\"É\",\"E\"),\"Ü\",\"U\"),\"Í\",\"I\"),\"Æ\",\"A\"),\"Ø\",\"O\"),\"Å\",\"A\"),\"&\",\"\"),\"+\",\"\"),3))","v":"TES"},null,null,null,"PP_CustomTaxonomyAbbreviation",{"$f":"IF(ISBLANK(PP_NameOfReportingEntity),\"REF\",LEFT(SUBSTITUTE(SUBSTITUTE(SUBSTITUTE(SUBSTITUTE(SUBSTITUTE(SUBSTITUTE(SUBSTITUTE(SUBSTITUTE(SUBSTITUTE(SUBSTITUTE(SUBSTITUTE(SUBSTITUTE(SUBSTITUTE(SUBSTITUTE(UPPER(PP_NameOfReportingEntity),\" \",\"\"),\"-\",\"\"),\".\",\"\"),\",\",\"\"),\"'\",\"\"),\"Á\",\"A\"),\"É\",\"E\"),\"Ü\",\"U\"),\"Í\",\"I\"),\"Æ\",\"A\"),\"Ø\",\"O\"),\"Å\",\"A\"),\"&\",\"\"),\"+\",\"\"),3))","v":"TES"},null,null,null,null,null,null,null,{"$f":"\"\"&INDEX(PP_Locale,ROW(),PP_LanguageIndex)","v":"Customer taxonomy abbreviation"},"Customer taxonomy abbreviation",null,null,"Kunde taksonomi forkortelse","Abkürzung für Kundentaxonomie",null,"Abreviatura de taxonomía del cliente",null,null,"Abréviation de la taxonomie client",null,null,"Abbreviazione della tassonomia del cliente",null,null,null,null,null,"Skrót taksonomii klienta"]
[{"$f":"\"\"&INDEX(PP_Locale,ROW(),PP_LanguageIndex)","v":"Customer taxonomy date"},{"$f":"TEXT(YEAR(TODAY()),\"0000\")&\"-\"&TEXT(MONTH(TODAY()),\"00\")&\"-\"&TEXT(DAY(TODAY()),\"00\")","v":"2021-11-09"},null,null,null,"PP_CustomTaxonomyDate",{"$f":"TEXT(YEAR(TODAY()),\"0000\")&\"-\"&TEXT(MONTH(TODAY()),\"00\")&\"-\"&TEXT(DAY(TODAY()),\"00\")","v":"2021-11-09"},null,null,null,null,null,null,null,{"$f":"\"\"&INDEX(PP_Locale,ROW(),PP_LanguageIndex)","v":"Customer taxonomy date"},"Customer taxonomy date",null,null,"Kunde taksonomi dato","Datum der Kundentaxonomie",null,"Fecha de taxonomía del cliente",null,null,"Date de taxonomie du client",null,null,"Data tassonomia cliente",null,null,null,null,null,"Data taksonomii klienta"]
[{"$f":"\"\"&INDEX(PP_Locale,ROW(),PP_LanguageIndex)","v":"Customer taxonomy description"},"Taxonomy extension",null,null,null,"PP_CustomTaxonomyDescription","Taxonomy extension",null,null,null,null,null,null,null,{"$f":"\"\"&IF(ISBLANK(INDEX(PP_Locale,ROW(),PP_LanguageIndex)),INDEX(PP_Locale,ROW(),1),INDEX(PP_Locale,ROW(),PP_LanguageIndex))","v":"Customer taxonomy description"},"Customer taxonomy description",null,null,"Kunde taksonomi beskrivelse","Beschreibung der Kundentaxonomie",null,"Descripción de la taxonomía del cliente",null,null,"Description de la taxonomie du client",null,null,"Descrizione della tassonomia del cliente",null,null,null,null,null,"Opis taksonomii klienta"]
[{"$f":"\"\"&INDEX(PP_Locale,ROW(),PP_LanguageIndex)","v":"Customer taxonomy label languages"},{"$f":"LOWER(PP_Language)","v":"en"},null,null,null,"PP_CustomTaxonomyLabelLanguages",{"$f":"LOWER(PP_Language)","v":"en"},null,null,null,null,null,null,null,{"$f":"\"\"&INDEX(PP_Locale,ROW(),PP_LanguageIndex)","v":"Customer taxonomy label languages"},"Customer taxonomy label languages",null,null,"Kunde taksonomi sprog","Kennzeichnungssprachen für Kundentaxonomie",null,"Idiomas de las etiquetas de taxonomía del cliente",null,null,"Langues de label de taxonomie client",null,null,"Lingue delle etichette della tassonomia del cliente",null,null,null,null,null,"Języki etykiet taksonomii klienta"]
[{"$f":"\"\"&INDEX(PP_Locale,ROW(),PP_LanguageIndex)","v":"Customer ID"},null,null,null,null,"PP_RunAs",null,null,null,null,null,null,null,null,{"$f":"\"\"&INDEX(PP_Locale,ROW(),PP_LanguageIndex)","v":"Customer ID"},"Customer ID",null,null,"Kunde ID","Kundennummer",null,"Identificación del cliente",null,null,"Identifiant du client",null,null,"Identificativo del cliente",null,null,null,null,null,"Identyfikator klienta"]
[{"$f":"\"\"&INDEX(PP_Locale,ROW(),PP_LanguageIndex)","v":"Skip validation"},null,null,null,null,"PP_SkipValidation",null,null,null,null,null,null,null,null,{"$f":"\"\"&INDEX(PP_Locale,ROW(),PP_LanguageIndex)","v":"Skip validation"},"Skip validation",null,null,"Skip validering","Validierung überspringen",null,"Omitir validación",null,null,"Ignorez la validation",null,null,"Salta la convalida",null,null,null,null,null,"Pomiń weryfikację"]
[{"$f":"\"\"&INDEX(PP_Locale,ROW(),PP_LanguageIndex)","v":"Parameters"},null,null,null,null,"PP_Parameters",null,null,null,null,null,null,null,null,{"$f":"\"\"&INDEX(PP_Locale,ROW(),PP_LanguageIndex)","v":"Parameters"},"Parameters",null,null,"Parametre","Parameter",null,"Parámetros",null,null,"Paramètres",null,null,"Parametri",null,null,null,null,null,"Parametry"]
[null,null,null,null,null,null,null,null,null,null,null,null,null,null,{"$f":"\"\"&INDEX(PP_Locale,ROW(),PP_LanguageIndex)","v":""}]
[null,null,null,null,null,null,null,null,null,null,null,null,null,null,{"$f":"\"\"&INDEX(PP_Locale,ROW(),PP_LanguageIndex)","v":"Annual report"},"Annual report",null,null,"Årsrapport"]
[null,null,null,null,null,null,null,null,null,null,null,null,null,null,{"$f":"\"\"&INDEX(PP_Locale,ROW(),PP_LanguageIndex)","v":"Liquidation accounts"},"Liquidation accounts",null,null,"Likvidationsregnskab"]
[null,null,null,null,null,null,null,null,null,null,null,null,null,null,{"$f":"\"\"&INDEX(PP_Locale,ROW(),PP_LanguageIndex)","v":"Interim report (6 months)"},"Interim report (6 months)",null,null,"Halvårsrapport"]
[null,null,null,null,null,null,null,null,null,null,null,null,null,null,{"$f":"\"\"&INDEX(PP_Locale,ROW(),PP_LanguageIndex)","v":"Interim report (other than 6 months)"},"Interim report (other than 6 months)",null,null,"Delårsrapport"]
[null,null,null,null,null,null,null,null,null,null,null,null,null,null,{"$f":"\"\"&INDEX(PP_Locale,ROW(),PP_LanguageIndex)","v":"Auditor's report on audited financial statements"},"Auditor's report on audited financial statements",null,null,"Revisionspåtegning"]
[null,null,null,null,null,null,null,null,null,null,null,null,null,null,{"$f":"\"\"&INDEX(PP_Locale,ROW(),PP_LanguageIndex)","v":"Auditor's report on extended review"},"Auditor's report on extended review",null,null,"Erklæring om udvidet gennemgang"]
[null,null,null,null,null,null,null,null,null,null,null,null,null,null,{"$f":"\"\"&INDEX(PP_Locale,ROW(),PP_LanguageIndex)","v":"The independent auditor's reports (Review)"},"The independent auditor's reports (Review)",null,null,"Den uafhængige revisors erklæringer (review)"]
[null,null,null,null,null,null,null,null,null,null,null,null,null,null,{"$f":"\"\"&INDEX(PP_Locale,ROW(),PP_LanguageIndex)","v":"The independent auditor's reports (Other assurance Reports)"},"The independent auditor's reports (Other assurance Reports)",null,null,"Andre erklæringer med sikkerhed"]
[null,null,null,null,null,null,null,null,null,null,null,null,null,null,{"$f":"\"\"&INDEX(PP_Locale,ROW(),PP_LanguageIndex)","v":"Auditor's reports (Other non-assurance reports)"},"Auditor's reports (Other non-assurance reports)",null,null,"Andre erklæringer uden sikkerhed"]
[null,null,null,null,null,null,null,null,null,null,null,null,null,null,{"$f":"\"\"&INDEX(PP_Locale,ROW(),PP_LanguageIndex)","v":"No audit assistance"},"No audit assistance",null,null,"Ingen bistand"]
[null,null,null,null,null,null,null,null,null,null,null,null,null,null,{"$f":"\"\"&INDEX(PP_Locale,ROW(),PP_LanguageIndex)","v":"Yes"},"Yes",null,null,"Ja"]
[null,null,null,null,null,null,null,null,null,null,null,null,null,null,{"$f":"\"\"&INDEX(PP_Locale,ROW(),PP_LanguageIndex)","v":"No"},"No",null,null,"Nej"]
[null,null,null,null,null,null,null,null,null,null,null,null,null,null,{"$f":"\"\"&INDEX(PP_Locale,ROW(),PP_LanguageIndex)","v":"Basis for Opinion"},"Basis for Opinion",null,null,"Grundlag for konklusion"]
[null,null,null,null,null,null,null,null,null,null,null,null,null,null,{"$f":"\"\"&INDEX(PP_Locale,ROW(),PP_LanguageIndex)","v":"Basis for Qualified Opinion"},"Basis for Qualified Opinion",null,null,"Grundlag for konklusion med forbehold"]
[null,null,null,null,null,null,null,null,null,null,null,null,null,null,{"$f":"\"\"&INDEX(PP_Locale,ROW(),PP_LanguageIndex)","v":"Basis for Adverse Opinion"},"Basis for Adverse Opinion",null,null,"Grundlag for afkræftende konklusion"]
[null,null,null,null,null,null,null,null,null,null,null,null,null,null,{"$f":"\"\"&INDEX(PP_Locale,ROW(),PP_LanguageIndex)","v":"Basis for Disclaimer of Opinion"},"Basis for Disclaimer of Opinion",null,null,"Grundlag for manglende konklusion"]
[null,null,null,null,null,null,null,null,null,null,null,null,null,null,{"$f":"\"\"&INDEX(PP_Locale,ROW(),PP_LanguageIndex)","v":"Opinion"},"Opinion",null,null,"Konklusion"]
[null,null,null,null,null,null,null,null,null,null,null,null,null,null,{"$f":"\"\"&INDEX(PP_Locale,ROW(),PP_LanguageIndex)","v":"Qualified Opinion"},"Qualified Opinion",null,null,"Konklusion med forbehold"]
[null,null,null,null,null,null,null,null,null,null,null,null,null,null,{"$f":"\"\"&INDEX(PP_Locale,ROW(),PP_LanguageIndex)","v":"Adverse Opinion"},"Adverse Opinion",null,null,"Afkræftende konklusion"]
[null,null,null,null,null,null,null,null,null,null,null,null,null,null,{"$f":"\"\"&INDEX(PP_Locale,ROW(),PP_LanguageIndex)","v":"Disclaimer of Opinion"},"Disclaimer of Opinion",null,null,"Manglende konklusion"]
[null,null,null,null,null,null,null,null,null,null,null,null,null,null,{"$f":"\"\"&INDEX(PP_Locale,ROW(),PP_LanguageIndex)","v":"Reporting class A"},"Reporting class A",null,null,"Regnskabsklasse A"]
[null,null,null,null,null,null,null,null,null,null,null,null,null,null,{"$f":"\"\"&INDEX(PP_Locale,ROW(),PP_LanguageIndex)","v":"Reporting class B"},"Reporting class B",null,null,"Regnskabsklasse B"]
[null,null,null,null,null,null,null,null,null,null,null,null,null,null,{"$f":"\"\"&INDEX(PP_Locale,ROW(),PP_LanguageIndex)","v":"Reporting class B / micro-undertaking"},"Reporting class B / micro-undertaking",null,null,"Regnskabsklasse B / mikrovirksomhed"]
[null,null,null,null,null,null,null,null,null,null,null,null,null,null,{"$f":"\"\"&INDEX(PP_Locale,ROW(),PP_LanguageIndex)","v":"Reporting class C / medium-size enterprise"},"Reporting class C / medium-size enterprise",null,null,"Regnskabsklasse C / mellemstor virksomhed"]
[null,null,null,null,null,null,null,null,null,null,null,null,null,null,{"$f":"\"\"&INDEX(PP_Locale,ROW(),PP_LanguageIndex)","v":"Reporting class C / large enterprise"},"Reporting class C / large enterprise",null,null,"Regnskabsklasse C / stor virksomhed"]
[null,null,null,null,null,null,null,null,null,null,null,null,null,null,{"$f":"\"\"&INDEX(PP_Locale,ROW(),PP_LanguageIndex)","v":"Reporting class D"},"Reporting class D",null,null,"Regnskabsklasse D"]
[null,null,null,null,null,null,null,null,null,null,null,null,null,null,{"$f":"\"\"&INDEX(PP_Locale,ROW(),PP_LanguageIndex)","v":"UNKNOWN"},"UNKNOWN",null,null,"UKENDT"]
[null,null,null,null,null,null,null,null,null,null,null,null,null,null,{"$f":"\"\"&INDEX(PP_Locale,ROW(),PP_LanguageIndex)","v":"Type of basis for opinion on audited financial statements (audit)"},"Type of basis for opinion on audited financial statements (audit)",null,null,"Type af grundlag for konklusion (revision)"]
[null,null,null,null,null,null,null,null,null,null,null,null,null,null,{"$f":"\"\"&INDEX(PP_Locale,ROW(),PP_LanguageIndex)","v":"Type of basis for opinion on financial statements (Extended review)"},"Type of basis for opinion on financial statements (Extended review)",null,null,"Type af grundlag for konklusion (udvidet gennemgang)"]
[null,null,null,null,null,null,null,null,null,null,null,null,null,null,{"$f":"\"\"&INDEX(PP_Locale,ROW(),PP_LanguageIndex)","v":"Type of basis for conclusion on financial statements (review)"},"Type of basis for conclusion on financial statements (review)",null,null,"Type af grundlag for konklusion (review)"]
[null,null,null,null,null,null,null,null,null,null,null,null,null,null,{"$f":"\"\"&INDEX(PP_Locale,ROW(),PP_LanguageIndex)","v":"Type of opinion on audited financial statements (Audit)"},"Type of opinion on audited financial statements (Audit)",null,null,"Type af konklusion (revision)"]
[null,null,null,null,null,null,null,null,null,null,null,null,null,null,{"$f":"\"\"&INDEX(PP_Locale,ROW(),PP_LanguageIndex)","v":"Type of opinion on financial statements (Extended Review)"},"Type of opinion on financial statements (Extended Review)",null,null,"Type af konklusion (udvidet gennemgang)"]
[null,null,null,null,null,null,null,null,null,null,null,null,null,null,{"$f":"\"\"&INDEX(PP_Locale,ROW(),PP_LanguageIndex)","v":"Type of conclusion on financial statements (review)"},"Type of conclusion on financial statements (review)",null,null,"Type af konklusion (review)"]
[null,null,null,null,null,null,null,null,null,null,null,null,null,null,{"$f":"\"\"&INDEX(PP_Locale,ROW(),PP_LanguageIndex)","v":"Reporting responsibilities according to the Danish executive order on approved auditors' reports especially the criminal code and Fiscal-, tax- and subsidy legislation (Audit)"},"Reporting responsibilities according to the Danish executive order on approved auditors' reports especially the criminal code and Fiscal-, tax- and subsidy legislation (Audit)",null,null,"Erklæringsforpligtelser i henhold til erklæringsbekendtgørelsen, herunder særligt straffeloven samt skatte-, afgifts- og tilskudslovgivningen (revision)"]
[null,null,null,null,null,null,null,null,null,null,null,null,null,null,{"$f":"\"\"&INDEX(PP_Locale,ROW(),PP_LanguageIndex)","v":"Reporting responsibilities according to the Danish executive order on approved auditors' reports especially the criminal code and Fiscal-, tax- and subsidy legislation (Extended review)"},"Reporting responsibilities according to the Danish executive order on approved auditors' reports especially the criminal code and Fiscal-, tax- and subsidy legislation (Extended review)",null,null,"Erklæringsforpligtelser i henhold til erklæringsbekendtgørelsen, herunder særligt straffeloven samt skatte-, afgifts- og tilskudslovgivningen (udvidet gennemgang)"]
[null,null,null,null,null,null,null,null,null,null,null,null,null,null,{"$f":"\"\"&INDEX(PP_Locale,ROW(),PP_LanguageIndex)","v":"Reporting responsibilities according to the Danish executive order on approved auditors' reports especially the companies act or equivalent legislation, that the company is subject to (Audit)"},"Reporting responsibilities according to the Danish executive order on approved auditors' reports especially the companies act or equivalent legislation, that the company is subject to (Audit)",null,null,"Erklæringsforpligtelser i henhold til erklæringsbekendtgørelsen, herunder særligt den for virksomheden fastsatte selskabsretlige eller tilsvarende lovgivning (revision)"]
[null,null,null,null,null,null,null,null,null,null,null,null,null,null,{"$f":"\"\"&INDEX(PP_Locale,ROW(),PP_LanguageIndex)","v":"Reporting responsibilities according to the Danish executive order on approved auditors' reports especially the companies act or equivalent legislation, that the company is subject to (Extended review)"},"Reporting responsibilities according to the Danish executive order on approved auditors' reports especially the companies act or equivalent legislation, that the company is subject to (Extended review)",null,null,"Erklæringsforpligtelser i henhold til erklæringsbekendtgørelsen, herunder særligt den for virksomheden fastsatte selskabsretlige eller tilsvarende lovgivning (udvidet gennemgang)"]
[null,null,null,null,null,null,null,null,null,null,null,null,null,null,{"$f":"\"\"&INDEX(PP_Locale,ROW(),PP_LanguageIndex)","v":"Reporting responsibilities according to the Danish executive order on approved auditors' reports especially legislation on financial reporting, including accounting and storage of accounting records (Audit)"},"Reporting responsibilities according to the Danish executive order on approved auditors' reports especially legislation on financial reporting, including accounting and storage of accounting records (Audit)",null,null,"Erklæringsforpligtelser i henhold til erklæringsbekendtgørelsen, herunder særligt lovgivningen om regnskabsaflæggelse, herunder om bogføring og bevaring af regnskabsmateriale (revision)"]
[null,null,null,null,null,null,null,null,null,null,null,null,null,null,{"$f":"\"\"&INDEX(PP_Locale,ROW(),PP_LanguageIndex)","v":"Reporting responsibilities according to the Danish executive order on approved auditors' reports especially legislation on financial reporting, including accounting and storage of accounting records (Extended review)"},"Reporting responsibilities according to the Danish executive order on approved auditors' reports especially legislation on financial reporting, including accounting and storage of accounting records (Extended review)",null,null,"Erklæringsforpligtelser i henhold til erklæringsbekendtgørelsen, herunder særligt lovgivningen om regnskabsaflæggelse, herunder om bogføring og bevaring af regnskabsmateriale (udvidet gennemgang)"]
[null,null,null,null,null,null,null,null,null,null,null,null,null,null,{"$f":"\"\"&INDEX(PP_Locale,ROW(),PP_LanguageIndex)","v":"Reporting responsibilities according to the Danish executive order on approved auditors' reports especially other matters (Audit)"},"Reporting responsibilities according to the Danish executive order on approved auditors' reports especially other matters (Audit)",null,null,"Erklæringsforpligtelser i henhold til erklæringsbekendtgørelsen, herunder særligt andre forhold (revision)"]
[null,null,null,null,null,null,null,null,null,null,null,null,null,null,{"$f":"\"\"&INDEX(PP_Locale,ROW(),PP_LanguageIndex)","v":"Reporting responsibilities according to the Danish executive order on approved auditors' reports especially other matters (Extended review)"},"Reporting responsibilities according to the Danish executive order on approved auditors' reports especially other matters (Extended review)",null,null,"Erklæringsforpligtelser i henhold til erklæringsbekendtgørelsen, herunder særligt andre forhold (udvidet gennemgang)"]
[null,null,null,null,null,null,null,null,null,null,null,null,null,null,{"$f":"\"\"&INDEX(PP_Locale,ROW(),PP_LanguageIndex)","v":"Income statement (by nature), Financial position (current/non-current), Comprehensive income (before tax), Cash flow statement (indirect)"},"Income statement (by nature), Financial position (current/non-current), Comprehensive income (before tax), Cash flow statement (indirect)",null,null,"Resultatopgørelse (artsopdelt), Balance (kort/langfristet), Totalindkomstopgørelse (før skat), Pengestrømsopgørelse (indirekte)"]
[null,null,null,null,null,null,null,null,null,null,null,null,null,null,{"$f":"\"\"&INDEX(PP_Locale,ROW(),PP_LanguageIndex)","v":"Income statement (by function), Financial position (current/non-current), Comprehensive income (before tax), Cash flow statement (indirect)"},"Income statement (by function), Financial position (current/non-current), Comprehensive income (before tax), Cash flow statement (indirect)",null,null,"Resultatopgørelse (funktionsopdelt), Balance (kort/langfristet), Totalindkomstopgørelse (før skat), Pengestrømsopgørelse (indirekte)"]
[null,null,null,null,null,null,null,null,null,null,null,null,null,null,{"$f":"\"\"&INDEX(PP_Locale,ROW(),PP_LanguageIndex)","v":"Income statement (by nature), Financial position (current/non-current), Comprehensive income (net of tax), Cash flow statement (indirect)"},"Income statement (by nature), Financial position (current/non-current), Comprehensive income (net of tax), Cash flow statement (indirect)",null,null,"Resultatopgørelse (artsopdelt), Balance (kort/langfristet), Totalindkomstopgørelse (efter skat), Pengestrømsopgørelse (indirekte)"]
[null,null,null,null,null,null,null,null,null,null,null,null,null,null,{"$f":"\"\"&INDEX(PP_Locale,ROW(),PP_LanguageIndex)","v":"Income statement (by function), Financial position (current/non-current), Comprehensive income (net of tax), Cash flow statement (indirect)"},"Income statement (by function), Financial position (current/non-current), Comprehensive income (net of tax), Cash flow statement (indirect)",null,null,"Resultatopgørelse (funktionsopdelt), Balance (kort/langfristet), Totalindkomstopgørelse (efter skat), Pengestrømsopgørelse (indirekte)"]
[null,null,null,null,null,null,null,null,null,null,null,null,null,null,{"$f":"\"\"&INDEX(PP_Locale,ROW(),PP_LanguageIndex)","v":"Income statement (by nature), Financial position (order of liquidity), Comprehensive income (before tax), Cash flow statement (indirect)"},"Income statement (by nature), Financial position (order of liquidity), Comprehensive income (before tax), Cash flow statement (indirect)",null,null,"Resultatopgørelse (artsopdelt), Balance (beretningsform), Totalindkomstopgørelse (før skat), Pengestrømsopgørelse (indirekte)"]
[null,null,null,null,null,null,null,null,null,null,null,null,null,null,{"$f":"\"\"&INDEX(PP_Locale,ROW(),PP_LanguageIndex)","v":"Income statement (by function), Financial position (order of liquidity), Comprehensive income (before tax), Cash flow statement (indirect)"},"Income statement (by function), Financial position (order of liquidity), Comprehensive income (before tax), Cash flow statement (indirect)",null,null,"Resultatopgørelse (funktionsopdelt), Balance (beretningsform), Totalindkomstopgørelse (før skat), Pengestrømsopgørelse (indirekte)"]
[null,null,null,null,null,null,null,null,null,null,null,null,null,null,{"$f":"\"\"&INDEX(PP_Locale,ROW(),PP_LanguageIndex)","v":"Income statement (by nature), Financial position (order of liquidity), Comprehensive income (net of tax), Cash flow statement (indirect)"},"Income statement (by nature), Financial position (order of liquidity), Comprehensive income (net of tax), Cash flow statement (indirect)",null,null,"Resultatopgørelse (artsopdelt), Balance (beretningsform), Totalindkomstopgørelse (efter skat), Pengestrømsopgørelse (indirekte)"]
[null,null,null,null,null,null,null,null,null,null,null,null,null,null,{"$f":"\"\"&INDEX(PP_Locale,ROW(),PP_LanguageIndex)","v":"Income statement (by function), Financial position (order of liquidity), Comprehensive income (net of tax), Cash flow statement (indirect)"},"Income statement (by function), Financial position (order of liquidity), Comprehensive income (net of tax), Cash flow statement (indirect)",null,null,"Resultatopgørelse (funktionsopdelt), Balance (beretningsform), Totalindkomstopgørelse (efter skat), Pengestrømsopgørelse (indirekte)"]
[null,null,null,null,null,null,null,null,null,null,null,null,null,null,{"$f":"\"\"&INDEX(PP_Locale,ROW(),PP_LanguageIndex)","v":"Income statement (by nature), Financial position (current/non-current), Comprehensive income (before tax), Cash flow statement (direct)"},"Income statement (by nature), Financial position (current/non-current), Comprehensive income (before tax), Cash flow statement (direct)",null,null,"Resultatopgørelse (artsopdelt), Balance (kort/langfristet), Totalindkomstopgørelse (før skat), Pengestrømsopgørelse (direkte)"]
[null,null,null,null,null,null,null,null,null,null,null,null,null,null,{"$f":"\"\"&INDEX(PP_Locale,ROW(),PP_LanguageIndex)","v":"Income statement (by function), Financial position (current/non-current), Comprehensive income (before tax), Cash flow statement (direct)"},"Income statement (by function), Financial position (current/non-current), Comprehensive income (before tax), Cash flow statement (direct)",null,null,"Resultatopgørelse (funktionsopdelt), Balance (kort/langfristet), Totalindkomstopgørelse (før skat), Pengestrømsopgørelse (direkte)"]
[null,null,null,null,null,null,null,null,null,null,null,null,null,null,{"$f":"\"\"&INDEX(PP_Locale,ROW(),PP_LanguageIndex)","v":"Income statement (by nature), Financial position (current/non-current), Comprehensive income (net of tax), Cash flow statement (direct)"},"Income statement (by nature), Financial position (current/non-current), Comprehensive income (net of tax), Cash flow statement (direct)",null,null,"Resultatopgørelse (artsopdelt), Balance (kort/langfristet), Totalindkomstopgørelse (efter skat), Pengestrømsopgørelse (direkte)"]
[null,null,null,null,null,null,null,null,null,null,null,null,null,null,{"$f":"\"\"&INDEX(PP_Locale,ROW(),PP_LanguageIndex)","v":"Income statement (by function), Financial position (current/non-current), Comprehensive income (net of tax), Cash flow statement (direct)"},"Income statement (by function), Financial position (current/non-current), Comprehensive income (net of tax), Cash flow statement (direct)",null,null,"Resultatopgørelse (funktionsopdelt), Balance (kort/langfristet), Totalindkomstopgørelse (efter skat), Pengestrømsopgørelse (direkte)"]
[null,null,null,null,null,null,null,null,null,null,null,null,null,null,{"$f":"\"\"&INDEX(PP_Locale,ROW(),PP_LanguageIndex)","v":"Income statement (by nature), Financial position (order of liquidity), Comprehensive income (before tax), Cash flow statement (direct)"},"Income statement (by nature), Financial position (order of liquidity), Comprehensive income (before tax), Cash flow statement (direct)",null,null,"Resultatopgørelse (artsopdelt), Balance (beretningsform), Totalindkomstopgørelse (før skat), Pengestrømsopgørelse (direkte)"]
[null,null,null,null,null,null,null,null,null,null,null,null,null,null,{"$f":"\"\"&INDEX(PP_Locale,ROW(),PP_LanguageIndex)","v":"Income statement (by function), Financial position (order of liquidity), Comprehensive income (before tax), Cash flow statement (direct)"},"Income statement (by function), Financial position (order of liquidity), Comprehensive income (before tax), Cash flow statement (direct)",null,null,"Resultatopgørelse (funktionsopdelt), Balance (beretningsform), Totalindkomstopgørelse (før skat), Pengestrømsopgørelse (direkte)"]
[null,null,null,null,null,null,null,null,null,null,null,null,null,null,{"$f":"\"\"&INDEX(PP_Locale,ROW(),PP_LanguageIndex)","v":"Income statement (by nature), Financial position (order of liquidity), Comprehensive income (net of tax), Cash flow statement (direct)"},"Income statement (by nature), Financial position (order of liquidity), Comprehensive income (net of tax), Cash flow statement (direct)",null,null,"Resultatopgørelse (artsopdelt), Balance (beretningsform), Totalindkomstopgørelse (efter skat), Pengestrømsopgørelse (direkte)"]
[null,null,null,null,null,null,null,null,null,null,null,null,null,null,{"$f":"\"\"&INDEX(PP_Locale,ROW(),PP_LanguageIndex)","v":"Income statement (by function), Financial position (order of liquidity), Comprehensive income (net of tax), Cash flow statement (direct)"},"Income statement (by function), Financial position (order of liquidity), Comprehensive income (net of tax), Cash flow statement (direct)",null,null,"Resultatopgørelse (funktionsopdelt), Balance (beretningsform), Totalindkomstopgørelse (efter skat), Pengestrømsopgørelse (direkte)"]
[null,null,null,null,null,null,null,null,null,null,null,null,null,null,{"$f":"\"\"&INDEX(PP_Locale,ROW(),PP_LanguageIndex)","v":"Current period"},"Current period",null,null,"Aktuel periode"]
[null,null,null,null,null,null,null,null,null,null,null,null,null,null,{"$f":"\"\"&INDEX(PP_Locale,ROW(),PP_LanguageIndex)","v":"Previous period"},"Previous period",null,null,"Foregående periode"]
[null,null,null,null,null,null,null,null,null,null,null,null,null,null,{"$f":"\"\"&INDEX(PP_Locale,ROW(),PP_LanguageIndex)","v":"Group"},"Group",null,null,"Koncern"]
[null,null,null,null,null,null,null,null,null,null,null,null,null,null,{"$f":"\"\"&INDEX(PP_Locale,ROW(),PP_LanguageIndex)","v":"Parent"},"Parent",null,null,"Moder"]
[null,null,null,null,null,null,null,null,null,null,null,null,null,null,{"$f":"\"\"&INDEX(PP_Locale,ROW(),PP_LanguageIndex)","v":"Test customer"},"Test customer",null,null,"Test kunde","Kunden testen",null,"Cliente de prueba",null,null,"Test client",null,null,"Cliente di prova",null,null,null,null,null,"Klient testowy"]
[null,null,null,null,null,null,null,null,null,null,null,null,null,null,"Periode","Period",null,null,"Periode","Zeitraum",null,"Periodo",null,null,"Période",null,null,"Periodo",null,null,null,null,null,"Okres"]

{"sheet":"DKIFRS hypertags","index":5,"n_rows":31,"n_cols":5,"rows_kept":31,"cut":false,"hidden":false,"merged":[]}
["Comment","Applies to","Label","Hypertag properties","Hypertag"]
[]
[null,"Managements review - ONLY APPLICABLE FOR HYPERTAGGING IF NO LINK TO FULL REPORT IS SUPPLIED IN GENERAL DATA \"Link to...\" FIELDS"]
["(Årsregnskabsloven paragraph 107b)","Corporate Governance","Other statements/Corporate governance report","&allowhtml=true&merge=true",{"$f":"\"pp://\"&C4&\"?taxonomy=\"&IFERROR(INDIRECT(\"'General data DKIFRS'!PP_TaxonomyId\"),\"DKIFRS\")&\"&labellanguage=en&period=1\"&D4","v":"pp://Other statements/Corporate governance report?taxonomy=DKIFRS&labellanguage=en&period=1&allowhtml=true&merge=true"}]
["(Årsregnskabsloven paragraph 99a)","Corporate Social Responsibility","Other statements/Statement of corporate social responsibility","&allowhtml=true&merge=true",{"$f":"\"pp://\"&C5&\"?taxonomy=\"&IFERROR(INDIRECT(\"'General data DKIFRS'!PP_TaxonomyId\"),\"DKIFRS\")&\"&labellanguage=en&period=1\"&D5","v":"pp://Other statements/Statement of corporate social responsibility?taxonomy=DKIFRS&labellanguage=en&period=1&allowhtml=true&merge=true"}]
["(Årsregnskabsloven paragraph 99b)","Target figures and policies for the underrepresented gender","Other statements/Statement of target figures and policies for the underrepresented gender","&allowhtml=true&merge=true",{"$f":"\"pp://\"&C6&\"?taxonomy=\"&IFERROR(INDIRECT(\"'General data DKIFRS'!PP_TaxonomyId\"),\"DKIFRS\")&\"&labellanguage=en&period=1\"&D6","v":"pp://Other statements/Statement of target figures and policies for the underrepresented gender?taxonomy=DKIFRS&labellanguage=en&period=1&allowhtml=true&merge=true"}]
["(Årsregnskabsloven paragraph 99c)","Payments to authorities","Other statements/Report on payments to authorities","&allowhtml=true&merge=true",{"$f":"\"pp://\"&C7&\"?taxonomy=\"&IFERROR(INDIRECT(\"'General data DKIFRS'!PP_TaxonomyId\"),\"DKIFRS\")&\"&labellanguage=en&period=1\"&D7","v":"pp://Other statements/Report on payments to authorities?taxonomy=DKIFRS&labellanguage=en&period=1&allowhtml=true&merge=true"}]
["(Årsregnskabsloven paragraph 107d)","Diversity policies","Other statements/Statement of the diversity policies","&allowhtml=true&merge=true",{"$f":"\"pp://\"&C8&\"?taxonomy=\"&IFERROR(INDIRECT(\"'General data DKIFRS'!PP_TaxonomyId\"),\"DKIFRS\")&\"&labellanguage=en&period=1\"&D8","v":"pp://Other statements/Statement of the diversity policies?taxonomy=DKIFRS&labellanguage=en&period=1&allowhtml=true&merge=true"}]
[null,"Data ethics","Other statements/Statement of policy for data ethics","&allowhtml=true&merge=true",{"$f":"\"pp://\"&C9&\"?taxonomy=\"&IFERROR(INDIRECT(\"'General data DKIFRS'!PP_TaxonomyId\"),\"DKIFRS\")&\"&labellanguage=en&period=1\"&D9","v":"pp://Other statements/Statement of policy for data ethics?taxonomy=DKIFRS&labellanguage=en&period=1&allowhtml=true&merge=true"}]
[]
[null,"Statement by executive and supervisory boards"]
["(optional - but required by PwC Denmark)","Management statement","Other statements/Statement by executive and supervisory boards","&allowhtml=true&merge=true",{"$f":"\"pp://\"&C12&\"?taxonomy=\"&IFERROR(INDIRECT(\"'General data DKIFRS'!PP_TaxonomyId\"),\"DKIFRS\")&\"&labellanguage=en&period=1\"&D12","v":"pp://Other statements/Statement by executive and supervisory boards?taxonomy=DKIFRS&labellanguage=en&period=1&allowhtml=true&merge=true"}]
[]
[null,"Auditors report"]
[null,"Auditors report - \"To the shareholders of…\"","Auditors report/Addressee","&allowhtml=true&merge=true",{"$f":"\"pp://\"&C15&\"?taxonomy=\"&IFERROR(INDIRECT(\"'General data DKIFRS'!PP_TaxonomyId\"),\"DKIFRS\")&\"&labellanguage=en&period=1\"&D15","v":"pp://Auditors report/Addressee?taxonomy=DKIFRS&labellanguage=en&period=1&allowhtml=true&merge=true"}]
[null,"Auditors report - Opinion","Auditors report/Opinion","&allowhtml=true&merge=true",{"$f":"\"pp://\"&C16&\"?taxonomy=\"&IFERROR(INDIRECT(\"'General data DKIFRS'!PP_TaxonomyId\"),\"DKIFRS\")&\"&labellanguage=en&period=1\"&D16","v":"pp://Auditors report/Opinion?taxonomy=DKIFRS&labellanguage=en&period=1&allowhtml=true&merge=true"}]
["(rarely used)","Auditors report - Statement whether qualifications of audited financial statements are of such decisive importance that annual general meeting should not approve financial statements","Auditors report/Statement whether qualifications of audited financial statements are of such decisive importance that annual general meeting should not approve financial statements","&allowhtml=true&merge=true",{"$f":"\"pp://\"&C17&\"?taxonomy=\"&IFERROR(INDIRECT(\"'General data DKIFRS'!PP_TaxonomyId\"),\"DKIFRS\")&\"&labellanguage=en&period=1\"&D17","v":"pp://Auditors report/Statement whether qualifications of audited financial statements are of such decisive importance that annual general meeting should not approve financial statements?taxonomy=DKIFRS&labellanguage=en&period=1&allowhtml=true&merge=true"}]
[null,"Auditors report - Basis for opinion","Auditors report/Basis for opinion","&allowhtml=true&merge=true",{"$f":"\"pp://\"&C18&\"?taxonomy=\"&IFERROR(INDIRECT(\"'General data DKIFRS'!PP_TaxonomyId\"),\"DKIFRS\")&\"&labellanguage=en&period=1\"&D18","v":"pp://Auditors report/Basis for opinion?taxonomy=DKIFRS&labellanguage=en&period=1&allowhtml=true&merge=true"}]
["(rarely used)","Auditors report - Material uncertainty concerning going concern","Auditors report/Material uncertainty concerning going concern","&allowhtml=true&merge=true",{"$f":"\"pp://\"&C19&\"?taxonomy=\"&IFERROR(INDIRECT(\"'General data DKIFRS'!PP_TaxonomyId\"),\"DKIFRS\")&\"&labellanguage=en&period=1\"&D19","v":"pp://Auditors report/Material uncertainty concerning going concern?taxonomy=DKIFRS&labellanguage=en&period=1&allowhtml=true&merge=true"}]
["(rarely used)","Auditors report - Emphasis of matter","Auditors report/Emphasis of matter","&allowhtml=true&merge=true",{"$f":"\"pp://\"&C20&\"?taxonomy=\"&IFERROR(INDIRECT(\"'General data DKIFRS'!PP_TaxonomyId\"),\"DKIFRS\")&\"&labellanguage=en&period=1\"&D20","v":"pp://Auditors report/Emphasis of matter?taxonomy=DKIFRS&labellanguage=en&period=1&allowhtml=true&merge=true"}]
[null,"Auditors report - Key audit matters","Auditors report/Key audit matters","&allowhtml=true&merge=true",{"$f":"\"pp://\"&C21&\"?taxonomy=\"&IFERROR(INDIRECT(\"'General data DKIFRS'!PP_TaxonomyId\"),\"DKIFRS\")&\"&labellanguage=en&period=1\"&D21","v":"pp://Auditors report/Key audit matters?taxonomy=DKIFRS&labellanguage=en&period=1&allowhtml=true&merge=true"}]
["(rarely used)","Auditors report - Other matter","Auditors report/Other matter","&allowhtml=true&merge=true",{"$f":"\"pp://\"&C22&\"?taxonomy=\"&IFERROR(INDIRECT(\"'General data DKIFRS'!PP_TaxonomyId\"),\"DKIFRS\")&\"&labellanguage=en&period=1\"&D22","v":"pp://Auditors report/Other matter?taxonomy=DKIFRS&labellanguage=en&period=1&allowhtml=true&merge=true"}]
[null,"Auditors report - Statement on management's review","Auditors report/Statement on management's review","&allowhtml=true&merge=true",{"$f":"\"pp://\"&C23&\"?taxonomy=\"&IFERROR(INDIRECT(\"'General data DKIFRS'!PP_TaxonomyId\"),\"DKIFRS\")&\"&labellanguage=en&period=1\"&D23","v":"pp://Auditors report/Statement on management's review?taxonomy=DKIFRS&labellanguage=en&period=1&allowhtml=true&merge=true"}]
["(rarely used)","Auditors report - Statement on other information","Auditors report/Statement on other information","&allowhtml=true&merge=true",{"$f":"\"pp://\"&C24&\"?taxonomy=\"&IFERROR(INDIRECT(\"'General data DKIFRS'!PP_TaxonomyId\"),\"DKIFRS\")&\"&labellanguage=en&period=1\"&D24","v":"pp://Auditors report/Statement on other information?taxonomy=DKIFRS&labellanguage=en&period=1&allowhtml=true&merge=true"}]
[null,"Auditors report - Statement on management's responsibility","Auditors report/Statement of executive and supervisory board's responsibility","&allowhtml=true&merge=true",{"$f":"\"pp://\"&C25&\"?taxonomy=\"&IFERROR(INDIRECT(\"'General data DKIFRS'!PP_TaxonomyId\"),\"DKIFRS\")&\"&labellanguage=en&period=1\"&D25","v":"pp://Auditors report/Statement of executive and supervisory board's responsibility?taxonomy=DKIFRS&labellanguage=en&period=1&allowhtml=true&merge=true"}]
[null,"Auditors report - Statement on auditor's responsibility","Auditors report/Statement of auditor's responsibility","&allowhtml=true&merge=true",{"$f":"\"pp://\"&C26&\"?taxonomy=\"&IFERROR(INDIRECT(\"'General data DKIFRS'!PP_TaxonomyId\"),\"DKIFRS\")&\"&labellanguage=en&period=1\"&D26","v":"pp://Auditors report/Statement of auditor's responsibility?taxonomy=DKIFRS&labellanguage=en&period=1&allowhtml=true&merge=true"}]
[null,"Auditors report - Report on compliance with the ESEF regulation","Auditors report/Auditors report on XBRL-tagging","&allowhtml=true&merge=true",{"$f":"\"pp://\"&C27&\"?taxonomy=\"&IFERROR(INDIRECT(\"'General data DKIFRS'!PP_TaxonomyId\"),\"DKIFRS\")&\"&labellanguage=en&period=1\"&D27","v":"pp://Auditors report/Auditors report on XBRL-tagging?taxonomy=DKIFRS&labellanguage=en&period=1&allowhtml=true&merge=true"}]
[]
[null,"ONLY FOR FOUNDATIONS - ONLY APPLICABLE FOR HYPERTAGGING IF NO LINK TO FULL REPORT IS SUPPLIED IN GENERAL DATA \"Link to...\" FIELDS"]
["(Årsregnskabsloven paragraph 77a)","Good management for foundations","Other statements/Statement of good management concerning foundation","&allowhtml=true&merge=true",{"$f":"\"pp://\"&C30&\"?taxonomy=\"&IFERROR(INDIRECT(\"'General data DKIFRS'!PP_TaxonomyId\"),\"DKIFRS\")&\"&labellanguage=en&period=1\"&D30","v":"pp://Other statements/Statement of good management concerning foundation?taxonomy=DKIFRS&labellanguage=en&period=1&allowhtml=true&merge=true"}]
["(Årsregnskabsloven paragraph 77b)","Distribution policies for foundations","Other statements/Statement of the foundation's distribution policy","&allowhtml=true&merge=true",{"$f":"\"pp://\"&C31&\"?taxonomy=\"&IFERROR(INDIRECT(\"'General data DKIFRS'!PP_TaxonomyId\"),\"DKIFRS\")&\"&labellanguage=en&period=1\"&D31","v":"pp://Other statements/Statement of the foundation's distribution policy?taxonomy=DKIFRS&labellanguage=en&period=1&allowhtml=true&merge=true"}]

{"sheet":"Income Statement","index":6,"n_rows":9,"n_cols":4,"rows_kept":9,"cut":false,"hidden":false,"merged":[]}
[null,{"$f":"IFERROR(VLOOKUP(\"Period\",INDIRECT(\"'General Data ESEF'!PP_Locale\"),INDIRECT(\"'General Data ESEF'!PP_LabelLanguageIndex\"),FALSE),\"Period\")&\" \"&COUNTIF(OFFSET(B1,0,-1,1,-COLUMN()+1),IFERROR(VLOOKUP(\"Period\",INDIRECT(\"'General Data ESEF'!PP_Locale\"),INDIRECT(\"'General Data ESEF'!PP_LabelLanguageIndex\"),FALSE),\"Period\")&\"*\")+1","v":"Period 1"},{"$f":"IFERROR(VLOOKUP(\"Period\",INDIRECT(\"'General Data ESEF'!PP_Locale\"),INDIRECT(\"'General Data ESEF'!PP_LabelLanguageIndex\"),FALSE),\"Period\")&\" \"&COUNTIF(OFFSET(C1,0,-1,1,-COLUMN()+1),IFERROR(VLOOKUP(\"Period\",INDIRECT(\"'General Data ESEF'!PP_Locale\"),INDIRECT(\"'General Data ESEF'!PP_LabelLanguageIndex\"),FALSE),\"Period\")&\"*\")+1","v":"Period 2"}]
[null,null,null,{"$f":"SUBSTITUTE(\"/\"&IFERROR(INDIRECT(\"'General Data ESEF'!IncomeStatementByNature\"),\"Income Statement By Nature\")&\"(headers=\"&CELL(\"address\",$B$1)&\":\"&CELL(\"address\",$C$1)&\",labels=\"&CELL(\"address\",A2)&\":\"&CELL(\"address\",A4)&\",values=\"&CELL(\"address\",B2)&\":\"&CELL(\"address\",C4)&\")\",\"$\",\"\")","v":"/Income Statement By Nature(headers=B1:C1,labels=A2:A4,values=B2:C4)"}]
[{"$f":"IFERROR(VLOOKUP(\"Profit for the period\",INDIRECT(\"'General Data ESEF'!PP_Locale\"),INDIRECT(\"'General Data ESEF'!PP_LabelLanguageIndex\"),FALSE),\"Profit for the period\")&\" \"&COUNTIF(OFFSET(A3,-1,0,-ROW()+1,1),IFERROR(VLOOKUP(\"Profit for the period\",INDIRECT(\"'General Data ESEF'!PP_Locale\"),INDIRECT(\"'General Data ESEF'!PP_LabelLanguageIndex\"),FALSE),\"Profit for the period\")&\"*\")+1","v":"Profit for the period 1"}]
[]
[null,null,null,{"$f":"SUBSTITUTE(\"/\"&IFERROR(INDIRECT(\"'General Data ESEF'!IncomeStatementByFunction\"),\"Income Statement By Function\")&\"(headers=\"&CELL(\"address\",$B$1)&\":\"&CELL(\"address\",$C$1)&\",labels=\"&CELL(\"address\",A5)&\":\"&CELL(\"address\",A7)&\",values=\"&CELL(\"address\",B5)&\":\"&CELL(\"address\",C7)&\")\",\"$\",\"\")","v":"/Income Statement By Function(headers=B1:C1,labels=A5:A7,values=B5:C7)"}]
[{"$f":"IFERROR(VLOOKUP(\"Profit for the period\",INDIRECT(\"'General Data ESEF'!PP_Locale\"),INDIRECT(\"'General Data ESEF'!PP_LabelLanguageIndex\"),FALSE),\"Profit for the period\")&\" \"&COUNTIF(OFFSET(A6,-1,0,-ROW()+1,1),IFERROR(VLOOKUP(\"Profit for the period\",INDIRECT(\"'General Data ESEF'!PP_Locale\"),INDIRECT(\"'General Data ESEF'!PP_LabelLanguageIndex\"),FALSE),\"Profit for the period\")&\"*\")+1","v":"Profit for the period 2"}]
[]
[null,null,null,{"$f":"SUBSTITUTE(\"/\"&IFERROR(INDIRECT(\"'General Data ESEF'!ProposedDistributionOfResults\"),\"Proposed Distribution Of Results\")&\"(headers=\"&CELL(\"address\",$B$1)&\":\"&CELL(\"address\",$C$1)&\",labels=\"&CELL(\"address\",A8)&\":\"&CELL(\"address\",A10)&\",values=\"&CELL(\"address\",B8)&\":\"&CELL(\"address\",C10)&\")\",\"$\",\"\")","v":"/Proposed Distribution Of Results(headers=B1:C1,labels=A8:A10,values=B8:C10)"}]
[{"$f":"IFERROR(VLOOKUP(\"Profit for the period\",INDIRECT(\"'General Data ESEF'!PP_Locale\"),INDIRECT(\"'General Data ESEF'!PP_LabelLanguageIndex\"),FALSE),\"Profit for the period\")&\" \"&COUNTIF(OFFSET(A9,-1,0,-ROW()+1,1),IFERROR(VLOOKUP(\"Profit for the period\",INDIRECT(\"'General Data ESEF'!PP_Locale\"),INDIRECT(\"'General Data ESEF'!PP_LabelLanguageIndex\"),FALSE),\"Profit for the period\")&\"*\")+1","v":"Profit for the period 3"}]

{"sheet":"Comprehensive income","index":7,"n_rows":12,"n_cols":4,"rows_kept":12,"cut":false,"hidden":false,"merged":[]}
[null,{"$f":"IFERROR(VLOOKUP(\"Period\",INDIRECT(\"'General Data ESEF'!PP_Locale\"),INDIRECT(\"'General Data ESEF'!PP_LabelLanguageIndex\"),FALSE),\"Period\")&\" \"&COUNTIF(OFFSET(B1,0,-1,1,-COLUMN()+1),IFERROR(VLOOKUP(\"Period\",INDIRECT(\"'General Data ESEF'!PP_Locale\"),INDIRECT(\"'General Data ESEF'!PP_LabelLanguageIndex\"),FALSE),\"Period\")&\"*\")+1","v":"Period 1"},{"$f":"IFERROR(VLOOKUP(\"Period\",INDIRECT(\"'General Data ESEF'!PP_Locale\"),INDIRECT(\"'General Data ESEF'!PP_LabelLanguageIndex\"),FALSE),\"Period\")&\" \"&COUNTIF(OFFSET(C1,0,-1,1,-COLUMN()+1),IFERROR(VLOOKUP(\"Period\",INDIRECT(\"'General Data ESEF'!PP_Locale\"),INDIRECT(\"'General Data ESEF'!PP_LabelLanguageIndex\"),FALSE),\"Period\")&\"*\")+1","v":"Period 2"}]
[null,null,null,{"$f":"SUBSTITUTE(\"/\"&IFERROR(INDIRECT(\"'General Data ESEF'!ComprehensiveIncomeByNature\"),\"Comprehensive Income By Nature\")&\"(headers=\"&CELL(\"address\",$B$1)&\":\"&CELL(\"address\",$C$1)&\",labels=\"&CELL(\"address\",A2)&\":\"&CELL(\"address\",A4)&\",values=\"&CELL(\"address\",B2)&\":\"&CELL(\"address\",C4)&\")\",\"$\",\"\")","v":"/Comprehensive Income By Nature(headers=B1:C1,labels=A2:A4,values=B2:C4)"}]
[{"$f":"IFERROR(VLOOKUP(\"Profit for the period\",INDIRECT(\"'General Data ESEF'!PP_Locale\"),INDIRECT(\"'General Data ESEF'!PP_LabelLanguageIndex\"),FALSE),\"Profit for the period\")&\" \"&COUNTIF(OFFSET(A3,-1,0,-ROW()+1,1),IFERROR(VLOOKUP(\"Profit for the period\",INDIRECT(\"'General Data ESEF'!PP_Locale\"),INDIRECT(\"'General Data ESEF'!PP_LabelLanguageIndex\"),FALSE),\"Profit for the period\")&\"*\")+1","v":"Profit for the period 1"}]
[]
[null,null,null,{"$f":"SUBSTITUTE(\"/\"&IFERROR(INDIRECT(\"'General Data ESEF'!ComprehensiveIncomeByFunction\"),\"Comprehensive Income By Function\")&\"(headers=\"&CELL(\"address\",$B$1)&\":\"&CELL(\"address\",$C$1)&\",labels=\"&CELL(\"address\",A5)&\":\"&CELL(\"address\",A7)&\",values=\"&CELL(\"address\",B5)&\":\"&CELL(\"address\",C7)&\")\",\"$\",\"\")","v":"/Comprehensive Income By Function(headers=B1:C1,labels=A5:A7,values=B5:C7)"}]
[{"$f":"IFERROR(VLOOKUP(\"Profit for the period\",INDIRECT(\"'General Data ESEF'!PP_Locale\"),INDIRECT(\"'General Data ESEF'!PP_LabelLanguageIndex\"),FALSE),\"Profit for the period\")&\" \"&COUNTIF(OFFSET(A6,-1,0,-ROW()+1,1),IFERROR(VLOOKUP(\"Profit for the period\",INDIRECT(\"'General Data ESEF'!PP_Locale\"),INDIRECT(\"'General Data ESEF'!PP_LabelLanguageIndex\"),FALSE),\"Profit for the period\")&\"*\")+1","v":"Profit for the period 2"}]
[]
[null,null,null,{"$f":"SUBSTITUTE(\"/\"&IFERROR(INDIRECT(\"'General Data ESEF'!ComprehensiveIncomeBeforeTax\"),\"Comprehensive Income Before Tax\")&\"(headers=\"&CELL(\"address\",$B$1)&\":\"&CELL(\"address\",$C$1)&\",labels=\"&CELL(\"address\",A8)&\":\"&CELL(\"address\",A10)&\",values=\"&CELL(\"address\",B8)&\":\"&CELL(\"address\",C10)&\")\",\"$\",\"\")","v":"/Comprehensive Income Before Tax(headers=B1:C1,labels=A8:A10,values=B8:C10)"}]
[{"$f":"IFERROR(VLOOKUP(\"Comprehensive income\",INDIRECT(\"'General Data ESEF'!PP_Locale\"),INDIRECT(\"'General Data ESEF'!PP_LabelLanguageIndex\"),FALSE),\"Comprehensive income\")&\" \"&COUNTIF(OFFSET(A9,-1,0,-ROW()+1,1),IFERROR(VLOOKUP(\"Comprehensive income\",INDIRECT(\"'General Data ESEF'!PP_Locale\"),INDIRECT(\"'General Data ESEF'!PP_LabelLanguageIndex\"),FALSE),\"Comprehensive income\")&\"*\")+1","v":"Comprehensive income 1"}]
[]
[null,null,null,{"$f":"SUBSTITUTE(\"/\"&IFERROR(INDIRECT(\"'General Data ESEF'!ComprehensiveIncomeNetOfTax\"),\"Comprehensive Income Net Of Tax\")&\"(headers=\"&CELL(\"address\",$B$1)&\":\"&CELL(\"address\",$C$1)&\",labels=\"&CELL(\"address\",A11)&\":\"&CELL(\"address\",A13)&\",values=\"&CELL(\"address\",B11)&\":\"&CELL(\"address\",C13)&\")\",\"$\",\"\")","v":"/Comprehensive Income Net Of Tax(headers=B1:C1,labels=A11:A13,values=B11:C13)"}]
[{"$f":"IFERROR(VLOOKUP(\"Comprehensive income\",INDIRECT(\"'General Data ESEF'!PP_Locale\"),INDIRECT(\"'General Data ESEF'!PP_LabelLanguageIndex\"),FALSE),\"Comprehensive income\")&\" \"&COUNTIF(OFFSET(A12,-1,0,-ROW()+1,1),IFERROR(VLOOKUP(\"Comprehensive income\",INDIRECT(\"'General Data ESEF'!PP_Locale\"),INDIRECT(\"'General Data ESEF'!PP_LabelLanguageIndex\"),FALSE),\"Comprehensive income\")&\"*\")+1","v":"Comprehensive income 2"}]

{"sheet":"Balance Sheet","index":8,"n_rows":27,"n_cols":4,"rows_kept":27,"cut":false,"hidden":false,"merged":[]}
[null,{"$f":"IFERROR(VLOOKUP(\"Period\",INDIRECT(\"'General Data ESEF'!PP_Locale\"),INDIRECT(\"'General Data ESEF'!PP_LabelLanguageIndex\"),FALSE),\"Period\")&\" \"&COUNTIF(OFFSET(B1,0,-1,1,-COLUMN()+1),IFERROR(VLOOKUP(\"Period\",INDIRECT(\"'General Data ESEF'!PP_Locale\"),INDIRECT(\"'General Data ESEF'!PP_LabelLanguageIndex\"),FALSE),\"Period\")&\"*\")+1","v":"Period 1"},{"$f":"IFERROR(VLOOKUP(\"Period\",INDIRECT(\"'General Data ESEF'!PP_Locale\"),INDIRECT(\"'General Data ESEF'!PP_LabelLanguageIndex\"),FALSE),\"Period\")&\" \"&COUNTIF(OFFSET(C1,0,-1,1,-COLUMN()+1),IFERROR(VLOOKUP(\"Period\",INDIRECT(\"'General Data ESEF'!PP_Locale\"),INDIRECT(\"'General Data ESEF'!PP_LabelLanguageIndex\"),FALSE),\"Period\")&\"*\")+1","v":"Period 2"}]
[null,null,null,{"$f":"SUBSTITUTE(\"/\"&IFERROR(INDIRECT(\"'General Data ESEF'!NonCurrentAssets\"),\"Non-Current Assets\")&\"(headers=\"&CELL(\"address\",$B$1)&\":\"&CELL(\"address\",$C$1)&\",labels=\"&CELL(\"address\",A2)&\":\"&CELL(\"address\",A4)&\",values=\"&CELL(\"address\",B2)&\":\"&CELL(\"address\",C4)&\")\",\"$\",\"\")","v":"/Non-Current Assets(headers=B1:C1,labels=A2:A4,values=B2:C4)"}]
[{"$f":"IFERROR(VLOOKUP(\"Non-current assets\",INDIRECT(\"'General Data ESEF'!PP_Locale\"),INDIRECT(\"'General Data ESEF'!PP_LabelLanguageIndex\"),FALSE),\"Non-current assets\")&\" \"&COUNTIF(OFFSET(A3,-1,0,-ROW()+1,1),IFERROR(VLOOKUP(\"Non-current assets\",INDIRECT(\"'General Data ESEF'!PP_Locale\"),INDIRECT(\"'General Data ESEF'!PP_LabelLanguageIndex\"),FALSE),\"Non-current assets\")&\"*\")+1","v":"Non-Current Assets 1"}]
[]
[null,null,null,{"$f":"SUBSTITUTE(\"/\"&IFERROR(INDIRECT(\"'General Data ESEF'!CurrentAssets\"),\"Current Assets\")&\"(headers=\"&CELL(\"address\",$B$1)&\":\"&CELL(\"address\",$C$1)&\",labels=\"&CELL(\"address\",A5)&\":\"&CELL(\"address\",A7)&\",values=\"&CELL(\"address\",B5)&\":\"&CELL(\"address\",C7)&\")\",\"$\",\"\")","v":"/Current Assets(headers=B1:C1,labels=A5:A7,values=B5:C7)"}]
[{"$f":"IFERROR(VLOOKUP(\"Current assets\",INDIRECT(\"'General Data ESEF'!PP_Locale\"),INDIRECT(\"'General Data ESEF'!PP_LabelLanguageIndex\"),FALSE),\"Current assets\")&\" \"&COUNTIF(OFFSET(A6,-1,0,-ROW()+1,1),IFERROR(VLOOKUP(\"Current assets\",INDIRECT(\"'General Data ESEF'!PP_Locale\"),INDIRECT(\"'General Data ESEF'!PP_LabelLanguageIndex\"),FALSE),\"Current assets\")&\"*\")+1","v":"Current Assets 1"}]
[]
[null,null,null,{"$f":"SUBSTITUTE(\"/\"&IFERROR(INDIRECT(\"'General Data ESEF'!Assets\"),\"Assets\")&\"(headers=\"&CELL(\"address\",$B$1)&\":\"&CELL(\"address\",$C$1)&\",labels=\"&CELL(\"address\",A8)&\":\"&CELL(\"address\",A10)&\",values=\"&CELL(\"address\",B8)&\":\"&CELL(\"address\",C10)&\")\",\"$\",\"\")","v":"/Assets(headers=B1:C1,labels=A8:A10,values=B8:C10)"}]
[{"$f":"IFERROR(VLOOKUP(\"Assets\",INDIRECT(\"'General Data ESEF'!PP_Locale\"),INDIRECT(\"'General Data ESEF'!PP_LabelLanguageIndex\"),FALSE),\"Assets\")&\" \"&COUNTIF(OFFSET(A9,-1,0,-ROW()+1,1),IFERROR(VLOOKUP(\"Assets\",INDIRECT(\"'General Data ESEF'!PP_Locale\"),INDIRECT(\"'General Data ESEF'!PP_LabelLanguageIndex\"),FALSE),\"Assets\")&\"*\")+1","v":"Assets 1"}]
[]
[null,null,null,{"$f":"SUBSTITUTE(\"/\"&IFERROR(INDIRECT(\"'General Data ESEF'!Equity\"),\"Equity\")&\"(headers=\"&CELL(\"address\",$B$1)&\":\"&CELL(\"address\",$C$1)&\",labels=\"&CELL(\"address\",A11)&\":\"&CELL(\"address\",A13)&\",values=\"&CELL(\"address\",B11)&\":\"&CELL(\"address\",C13)&\")\",\"$\",\"\")","v":"/Equity(headers=B1:C1,labels=A11:A13,values=B11:C13)"}]
[{"$f":"IFERROR(VLOOKUP(\"Equity\",INDIRECT(\"'General Data ESEF'!PP_Locale\"),INDIRECT(\"'General Data ESEF'!PP_LabelLanguageIndex\"),FALSE),\"Equity\")&\" \"&COUNTIF(OFFSET(A12,-1,0,-ROW()+1,1),IFERROR(VLOOKUP(\"Equity\",INDIRECT(\"'General Data ESEF'!PP_Locale\"),INDIRECT(\"'General Data ESEF'!PP_LabelLanguageIndex\"),FALSE),\"Equity\")&\"*\")+1","v":"Equity 1"}]
[]
[null,null,null,{"$f":"SUBSTITUTE(\"/\"&IFERROR(INDIRECT(\"'General Data ESEF'!Provisions\"),\"Provisions\")&\"(headers=\"&CELL(\"address\",$B$1)&\":\"&CELL(\"address\",$C$1)&\",labels=\"&CELL(\"address\",A14)&\":\"&CELL(\"address\",A16)&\",values=\"&CELL(\"address\",B14)&\":\"&CELL(\"address\",C16)&\")\",\"$\",\"\")","v":"/Provisions(headers=B1:C1,labels=A14:A16,values=B14:C16)"}]
[{"$f":"IFERROR(VLOOKUP(\"Provisions\",INDIRECT(\"'General Data ESEF'!PP_Locale\"),INDIRECT(\"'General Data ESEF'!PP_LabelLanguageIndex\"),FALSE),\"Provisions\")&\" \"&COUNTIF(OFFSET(A15,-1,0,-ROW()+1,1),IFERROR(VLOOKUP(\"Provisions\",INDIRECT(\"'General Data ESEF'!PP_Locale\"),INDIRECT(\"'General Data ESEF'!PP_LabelLanguageIndex\"),FALSE),\"Provisions\")&\"*\")+1","v":"Provisions 1"}]
[]
[null,null,null,{"$f":"SUBSTITUTE(\"/\"&IFERROR(INDIRECT(\"'General Data ESEF'!NonCurrentLiabilities\"),\"Non-Current Liabilities\")&\"(headers=\"&CELL(\"address\",$B$1)&\":\"&CELL(\"address\",$C$1)&\",labels=\"&CELL(\"address\",A17)&\":\"&CELL(\"address\",A19)&\",values=\"&CELL(\"address\",B17)&\":\"&CELL(\"address\",C19)&\")\",\"$\",\"\")","v":"/Non-Current Liabilities(headers=B1:C1,labels=A17:A19,values=B17:C19)"}]
[{"$f":"IFERROR(VLOOKUP(\"Non-current liabilities\",INDIRECT(\"'General Data ESEF'!PP_Locale\"),INDIRECT(\"'General Data ESEF'!PP_LabelLanguageIndex\"),FALSE),\"Non-current liabilities\")&\" \"&COUNTIF(OFFSET(A18,-1,0,-ROW()+1,1),IFERROR(VLOOKUP(\"Non-current liabilities\",INDIRECT(\"'General Data ESEF'!PP_Locale\"),INDIRECT(\"'General Data ESEF'!PP_LabelLanguageIndex\"),FALSE),\"Non-current liabilities\")&\"*\")+1","v":"Non-Current Liabilities 1"}]
[]
[null,null,null,{"$f":"SUBSTITUTE(\"/\"&IFERROR(INDIRECT(\"'General Data ESEF'!CurrentLiabilities\"),\"Current Liabilities\")&\"(headers=\"&CELL(\"address\",$B$1)&\":\"&CELL(\"address\",$C$1)&\",labels=\"&CELL(\"address\",A20)&\":\"&CELL(\"address\",A22)&\",values=\"&CELL(\"address\",B20)&\":\"&CELL(\"address\",C22)&\")\",\"$\",\"\")","v":"/Current Liabilities(headers=B1:C1,labels=A20:A22,values=B20:C22)"}]
[{"$f":"IFERROR(VLOOKUP(\"Current liabilities\",INDIRECT(\"'General Data ESEF'!PP_Locale\"),INDIRECT(\"'General Data ESEF'!PP_LabelLanguageIndex\"),FALSE),\"Current liabilities\")&\" \"&COUNTIF(OFFSET(A21,-1,0,-ROW()+1,1),IFERROR(VLOOKUP(\"Current liabilities\",INDIRECT(\"'General Data ESEF'!PP_Locale\"),INDIRECT(\"'General Data ESEF'!PP_LabelLanguageIndex\"),FALSE),\"Current liabilities\")&\"*\")+1","v":"Current Liabilities 1"}]
[]
[null,null,null,{"$f":"SUBSTITUTE(\"/\"&IFERROR(INDIRECT(\"'General Data ESEF'!Liabilities\"),\"Liabilities\")&\"(headers=\"&CELL(\"address\",$B$1)&\":\"&CELL(\"address\",$C$1)&\",labels=\"&CELL(\"address\",A23)&\":\"&CELL(\"address\",A25)&\",values=\"&CELL(\"address\",B23)&\":\"&CELL(\"address\",C25)&\")\",\"$\",\"\")","v":"/Liabilities(headers=B1:C1,labels=A23:A25,values=B23:C25)"}]
[{"$f":"IFERROR(VLOOKUP(\"Liabilities\",INDIRECT(\"'General Data ESEF'!PP_Locale\"),INDIRECT(\"'General Data ESEF'!PP_LabelLanguageIndex\"),FALSE),\"Liabilities\")&\" \"&COUNTIF(OFFSET(A24,-1,0,-ROW()+1,1),IFERROR(VLOOKUP(\"Liabilities\",INDIRECT(\"'General Data ESEF'!PP_Locale\"),INDIRECT(\"'General Data ESEF'!PP_LabelLanguageIndex\"),FALSE),\"Liabilities\")&\"*\")+1","v":"Liabilities 1"}]
[]
[null,null,null,{"$f":"SUBSTITUTE(\"/\"&IFERROR(INDIRECT(\"'General Data ESEF'!EquityAndLiabilities\"),\"Equity And Liabilities\")&\"(headers=\"&CELL(\"address\",$B$1)&\":\"&CELL(\"address\",$C$1)&\",labels=\"&CELL(\"address\",A26)&\":\"&CELL(\"address\",A28)&\",values=\"&CELL(\"address\",B26)&\":\"&CELL(\"address\",C28)&\")\",\"$\",\"\")","v":"/Equity And Liabilities(headers=B1:C1,labels=A26:A28,values=B26:C28)"}]
[{"$f":"IFERROR(VLOOKUP(\"Equity and liabilities\",INDIRECT(\"'General Data ESEF'!PP_Locale\"),INDIRECT(\"'General Data ESEF'!PP_LabelLanguageIndex\"),FALSE),\"Equity and liabilities\")&\" \"&COUNTIF(OFFSET(A27,-1,0,-ROW()+1,1),IFERROR(VLOOKUP(\"Equity and liabilities\",INDIRECT(\"'General Data ESEF'!PP_Locale\"),INDIRECT(\"'General Data ESEF'!PP_LabelLanguageIndex\"),FALSE),\"Equity and liabilities\")&\"*\")+1","v":"Equity And Liabilities 1"}]

{"sheet":"Changes In Equity","index":9,"n_rows":16,"n_cols":8,"rows_kept":16,"cut":false,"hidden":false,"merged":[[8,1,8,3],[8,4,8,6],[13,3,13,4],[13,5,13,6],[13,1,13,2]]}
[null,{"$f":"IFERROR(VLOOKUP(\"Equity\",INDIRECT(\"'General Data ESEF'!PP_Locale\"),INDIRECT(\"'General Data ESEF'!PP_LabelLanguageIndex\"),FALSE),\"Equity\")&\" \"&COUNTIF(OFFSET(B1,0,-1,,-COLUMN()+1),IFERROR(VLOOKUP(\"Equity\",INDIRECT(\"'General Data ESEF'!PP_Locale\"),INDIRECT(\"'General Data ESEF'!PP_LabelLanguageIndex\"),FALSE),\"Equity\")&\"*\")+1","v":"Equity 1"},{"$f":"IFERROR(VLOOKUP(\"Equity\",INDIRECT(\"'General Data ESEF'!PP_Locale\"),INDIRECT(\"'General Data ESEF'!PP_LabelLanguageIndex\"),FALSE),\"Equity\")&\" \"&COUNTIF(OFFSET(C1,0,-1,,-COLUMN()+1),IFERROR(VLOOKUP(\"Equity\",INDIRECT(\"'General Data ESEF'!PP_Locale\"),INDIRECT(\"'General Data ESEF'!PP_LabelLanguageIndex\"),FALSE),\"Equity\")&\"*\")+1","v":"Equity 2"},{"$f":"IFERROR(VLOOKUP(\"Equity\",INDIRECT(\"'General Data ESEF'!PP_Locale\"),INDIRECT(\"'General Data ESEF'!PP_LabelLanguageIndex\"),FALSE),\"Equity\")&\" \"&COUNTIF(OFFSET(D1,0,-1,,-COLUMN()+1),IFERROR(VLOOKUP(\"Equity\",INDIRECT(\"'General Data ESEF'!PP_Locale\"),INDIRECT(\"'General Data ESEF'!PP_LabelLanguageIndex\"),FALSE),\"Equity\")&\"*\")+1","v":"Equity 3"},{"$f":"IFERROR(VLOOKUP(\"Equity\",INDIRECT(\"'General Data ESEF'!PP_Locale\"),INDIRECT(\"'General Data ESEF'!PP_LabelLanguageIndex\"),FALSE),\"Equity\")&\" \"&COUNTIF(OFFSET(E1,0,-1,,-COLUMN()+1),IFERROR(VLOOKUP(\"Equity\",INDIRECT(\"'General Data ESEF'!PP_Locale\"),INDIRECT(\"'General Data ESEF'!PP_LabelLanguageIndex\"),FALSE),\"Equity\")&\"*\")+1","v":"Equity 4"},{"$f":"IFERROR(VLOOKUP(\"Equity\",INDIRECT(\"'General Data ESEF'!PP_Locale\"),INDIRECT(\"'General Data ESEF'!PP_LabelLanguageIndex\"),FALSE),\"Equity\")&\" \"&COUNTIF(OFFSET(F1,0,-1,,-COLUMN()+1),IFERROR(VLOOKUP(\"Equity\",INDIRECT(\"'General Data ESEF'!PP_Locale\"),INDIRECT(\"'General Data ESEF'!PP_LabelLanguageIndex\"),FALSE),\"Equity\")&\"*\")+1","v":"Equity 5"},{"$f":"IFERROR(VLOOKUP(\"Equity\",INDIRECT(\"'General Data ESEF'!PP_Locale\"),INDIRECT(\"'General Data ESEF'!PP_LabelLanguageIndex\"),FALSE),\"Equity\")&\" \"&COUNTIF(OFFSET(G1,0,-1,,-COLUMN()+1),IFERROR(VLOOKUP(\"Equity\",INDIRECT(\"'General Data ESEF'!PP_Locale\"),INDIRECT(\"'General Data ESEF'!PP_LabelLanguageIndex\"),FALSE),\"Equity\")&\"*\")+1","v":"Equity 6"}]
[null,null,null,null,null,null,null,{"$f":"SUBSTITUTE(\"/\"&IFERROR(INDIRECT(\"'General Data ESEF'!StatementOfChangesInEquity\"),\"Statement Of Changes In Equity\")&\"(headers=\"&CELL(\"address\",$B$1)&\":\"&CELL(\"address\",$G$1)&\",labels=\"&CELL(\"address\",A2)&\":\"&CELL(\"address\",A4)&\",values=\"&CELL(\"address\",B2)&\":\"&CELL(\"address\",G4)&\"[period=1])\",\"$\",\"\")","v":"/Statement Of Changes In Equity(headers=B1:G1,labels=A2:A4,values=B2:G4[period=1])"}]
[{"$f":"IFERROR(VLOOKUP(\"Changes in equity\",INDIRECT(\"'General Data ESEF'!PP_Locale\"),INDIRECT(\"'General Data ESEF'!PP_LabelLanguageIndex\"),FALSE),\"Changes in equity\")&\" \"&COUNTIF(OFFSET(A3,-1,0,-ROW()+1,1),IFERROR(VLOOKUP(\"Changes in equity\",INDIRECT(\"'General Data ESEF'!PP_Locale\"),INDIRECT(\"'General Data ESEF'!PP_LabelLanguageIndex\"),FALSE),\"Changes in equity\")&\"*\")+1","v":"Changes In Equity 1"}]
[]
[null,null,null,null,null,null,null,{"$f":"SUBSTITUTE(\"/\"&IFERROR(INDIRECT(\"'General Data ESEF'!StatementOfChangesInEquity\"),\"Statement Of Changes In Equity\")&\"(headers=\"&CELL(\"address\",$B$1)&\":\"&CELL(\"address\",$G$1)&\",labels=\"&CELL(\"address\",A5)&\":\"&CELL(\"address\",A7)&\",values=\"&CELL(\"address\",B5)&\":\"&CELL(\"address\",G7)&\"[period=2])\",\"$\",\"\")","v":"/Statement Of Changes In Equity(headers=B1:G1,labels=A5:A7,values=B5:G7[period=2])"}]
[{"$f":"IFERROR(VLOOKUP(\"Changes in equity\",INDIRECT(\"'General Data ESEF'!PP_Locale\"),INDIRECT(\"'General Data ESEF'!PP_LabelLanguageIndex\"),FALSE),\"Changes in equity\")&\" \"&COUNTIF(OFFSET(A6,-1,0,-ROW()+1,1),IFERROR(VLOOKUP(\"Changes in equity\",INDIRECT(\"'General Data ESEF'!PP_Locale\"),INDIRECT(\"'General Data ESEF'!PP_LabelLanguageIndex\"),FALSE),\"Changes in equity\")&\"*\")+1","v":"Changes In Equity 2"}]
[]
[null,{"$f":"IFERROR(VLOOKUP(\"Equity\",INDIRECT(\"'General Data ESEF'!PP_Locale\"),INDIRECT(\"'General Data ESEF'!PP_LabelLanguageIndex\"),FALSE),\"Equity\")&\" \"&COUNTIF(OFFSET(B8,0,-1,,-COLUMN()+1),IFERROR(VLOOKUP(\"Equity\",INDIRECT(\"'General Data ESEF'!PP_Locale\"),INDIRECT(\"'General Data ESEF'!PP_LabelLanguageIndex\"),FALSE),\"Equity\")&\"*\")+1","v":"Equity 1"},{"$f":"IFERROR(VLOOKUP(\"Equity\",INDIRECT(\"'General Data ESEF'!PP_Locale\"),INDIRECT(\"'General Data ESEF'!PP_LabelLanguageIndex\"),FALSE),\"Equity\")&\" \"&COUNTIF(OFFSET(C8,0,-1,,-COLUMN()+1),IFERROR(VLOOKUP(\"Equity\",INDIRECT(\"'General Data ESEF'!PP_Locale\"),INDIRECT(\"'General Data ESEF'!PP_LabelLanguageIndex\"),FALSE),\"Equity\")&\"*\")+1","v":"Equity 2"},{"$f":"IFERROR(VLOOKUP(\"Equity\",INDIRECT(\"'General Data ESEF'!PP_Locale\"),INDIRECT(\"'General Data ESEF'!PP_LabelLanguageIndex\"),FALSE),\"Equity\")&\" \"&COUNTIF(OFFSET(D8,0,-1,,-COLUMN()+1),IFERROR(VLOOKUP(\"Equity\",INDIRECT(\"'General Data ESEF'!PP_Locale\"),INDIRECT(\"'General Data ESEF'!PP_LabelLanguageIndex\"),FALSE),\"Equity\")&\"*\")+1","v":"Equity 3"},{"$f":"B8","v":"Equity 1"},{"$f":"C8","v":"Equity 2"},{"$f":"D8","v":"Equity 3"}]
[null,{"$f":"IFERROR(VLOOKUP(\"Period\",INDIRECT(\"'General Data ESEF'!PP_Locale\"),INDIRECT(\"'General Data ESEF'!PP_LabelLanguageIndex\"),FALSE),\"Period\")&\" \"&COUNTIF(OFFSET(B9,0,-1,1,-COLUMN()+1),IFERROR(VLOOKUP(\"Period\",INDIRECT(\"'General Data ESEF'!PP_Locale\"),INDIRECT(\"'General Data ESEF'!PP_LabelLanguageIndex\"),FALSE),\"Period\")&\"*\")+1","v":"Period 1"},null,null,{"$f":"IFERROR(VLOOKUP(\"Period\",INDIRECT(\"'General Data ESEF'!PP_Locale\"),INDIRECT(\"'General Data ESEF'!PP_LabelLanguageIndex\"),FALSE),\"Period\")&\" \"&COUNTIF(OFFSET(E9,0,-1,1,-COLUMN()+1),IFERROR(VLOOKUP(\"Period\",INDIRECT(\"'General Data ESEF'!PP_Locale\"),INDIRECT(\"'General Data ESEF'!PP_LabelLanguageIndex\"),FALSE),\"Period\")&\"*\")+1","v":"Period 2"}]
[null,null,null,null,null,null,null,{"$f":"SUBSTITUTE(\"/\"&IFERROR(INDIRECT(\"'General Data ESEF'!StatementOfChangesInEquity\"),\"Statement Of Changes In Equity\")&\"(headers=\"&CELL(\"address\",$B$8)&\":\"&CELL(\"address\",$D$8)&\";\"&CELL(\"address\",$E$8)&\":\"&CELL(\"address\",$G$8)&\",labels=\"&CELL(\"address\",A10)&\":\"&CELL(\"address\",A12)&\",values=\"&CELL(\"address\",B10)&\":\"&CELL(\"address\",D12)&\"[period=1];\"&CELL(\"address\",E10)&\":\"&CELL(\"address\",G12)&\"[period=2])\",\"$\",\"\")","v":"/Statement Of Changes In Equity(headers=B8:D8;E8:G8,labels=A10:A12,values=B10:D12[period=1];E10:G12[period=2])"}]
[{"$f":"IFERROR(VLOOKUP(\"Changes in equity\",INDIRECT(\"'General Data ESEF'!PP_Locale\"),INDIRECT(\"'General Data ESEF'!PP_LabelLanguageIndex\"),FALSE),\"Changes in equity\")&\" \"&COUNTIF(OFFSET(A11,-1,0,-ROW()+1,1),IFERROR(VLOOKUP(\"Changes in equity\",INDIRECT(\"'General Data ESEF'!PP_Locale\"),INDIRECT(\"'General Data ESEF'!PP_LabelLanguageIndex\"),FALSE),\"Changes in equity\")&\"*\")+1","v":"Changes In Equity 3"}]
[]
[null,{"$f":"IFERROR(VLOOKUP(\"Equity\",INDIRECT(\"'General Data ESEF'!PP_Locale\"),INDIRECT(\"'General Data ESEF'!PP_LabelLanguageIndex\"),FALSE),\"Equity\")&\" \"&COUNTIF(OFFSET(B13,0,-1,,-COLUMN()+1),IFERROR(VLOOKUP(\"Equity\",INDIRECT(\"'General Data ESEF'!PP_Locale\"),INDIRECT(\"'General Data ESEF'!PP_LabelLanguageIndex\"),FALSE),\"Equity\")&\"*\")+1","v":"Equity 1"},{"$f":"IFERROR(VLOOKUP(\"Equity\",INDIRECT(\"'General Data ESEF'!PP_Locale\"),INDIRECT(\"'General Data ESEF'!PP_LabelLanguageIndex\"),FALSE),\"Equity\")&\" \"&COUNTIF(OFFSET(C13,0,-1,,-COLUMN()+1),IFERROR(VLOOKUP(\"Equity\",INDIRECT(\"'General Data ESEF'!PP_Locale\"),INDIRECT(\"'General Data ESEF'!PP_LabelLanguageIndex\"),FALSE),\"Equity\")&\"*\")+1","v":"Equity 2"},{"$f":"B13","v":"Equity 1"},{"$f":"C13","v":"Equity 2"},{"$f":"B13","v":"Equity 1"},{"$f":"C13","v":"Equity 2"}]
[null,{"$f":"IFERROR(VLOOKUP(\"Period\",INDIRECT(\"'General Data ESEF'!PP_Locale\"),INDIRECT(\"'General Data ESEF'!PP_LabelLanguageIndex\"),FALSE),\"Period\")&\" \"&COUNTIF(OFFSET(B14,0,-1,1,-COLUMN()+1),IFERROR(VLOOKUP(\"Period\",INDIRECT(\"'General Data ESEF'!PP_Locale\"),INDIRECT(\"'General Data ESEF'!PP_LabelLanguageIndex\"),FALSE),\"Period\")&\"*\")+1","v":"Period 1"},null,{"$f":"IFERROR(VLOOKUP(\"Period\",INDIRECT(\"'General Data ESEF'!PP_Locale\"),INDIRECT(\"'General Data ESEF'!PP_LabelLanguageIndex\"),FALSE),\"Period\")&\" \"&COUNTIF(OFFSET(D14,0,-1,1,-COLUMN()+1),IFERROR(VLOOKUP(\"Period\",INDIRECT(\"'General Data ESEF'!PP_Locale\"),INDIRECT(\"'General Data ESEF'!PP_LabelLanguageIndex\"),FALSE),\"Period\")&\"*\")+1","v":"Period 2"},null,{"$f":"IFERROR(VLOOKUP(\"Period\",INDIRECT(\"'General Data ESEF'!PP_Locale\"),INDIRECT(\"'General Data ESEF'!PP_LabelLanguageIndex\"),FALSE),\"Period\")&\" \"&COUNTIF(OFFSET(F14,0,-1,1,-COLUMN()+1),IFERROR(VLOOKUP(\"Period\",INDIRECT(\"'General Data ESEF'!PP_Locale\"),INDIRECT(\"'General Data ESEF'!PP_LabelLanguageIndex\"),FALSE),\"Period\")&\"*\")+1","v":"Period 3"}]
[null,null,null,null,null,null,null,{"$f":"SUBSTITUTE(\"/\"&IFERROR(INDIRECT(\"'General Data ESEF'!StatementOfChangesInEquity\"),\"Statement Of Changes In Equity\")&\"(headers=\"&CELL(\"address\",$B$13)&\":\"&CELL(\"address\",$C$13)&\";\"&CELL(\"address\",$D$13)&\":\"&CELL(\"address\",$E$13)&\";\"&CELL(\"address\",$F$13)&\":\"&CELL(\"address\",$G$13)&\",labels=\"&CELL(\"address\",A15)&\":\"&CELL(\"address\",A17)&\",values=\"&CELL(\"address\",B15)&\":\"&CELL(\"address\",C17)&\"[period=1];\"&CELL(\"address\",D15)&\":\"&CELL(\"address\",E17)&\"[period=2];\"&CELL(\"address\",F15)&\":\"&CELL(\"address\",G17)&\"[period=3])\",\"$\",\"\")","v":"/Statement Of Changes In Equity(headers=B13:C13;D13:E13;F13:G13,labels=A15:A17,values=B15:C17[period=1];D15:E17[period=2];F15:G17[period=3])"}]
[{"$f":"IFERROR(VLOOKUP(\"Changes in equity\",INDIRECT(\"'General Data ESEF'!PP_Locale\"),INDIRECT(\"'General Data ESEF'!PP_LabelLanguageIndex\"),FALSE),\"Changes in equity\")&\" \"&COUNTIF(OFFSET(A16,-1,0,-ROW()+1,1),IFERROR(VLOOKUP(\"Changes in equity\",INDIRECT(\"'General Data ESEF'!PP_Locale\"),INDIRECT(\"'General Data ESEF'!PP_LabelLanguageIndex\"),FALSE),\"Changes in equity\")&\"*\")+1","v":"Changes In Equity 4"}]

{"sheet":"Cash Flow","index":10,"n_rows":12,"n_cols":4,"rows_kept":12,"cut":false,"hidden":false,"merged":[]}
[null,{"$f":"IFERROR(VLOOKUP(\"Period\",INDIRECT(\"'General Data ESEF'!PP_Locale\"),INDIRECT(\"'General Data ESEF'!PP_LabelLanguageIndex\"),FALSE),\"Period\")&\" \"&COUNTIF(OFFSET(B1,0,-1,1,-COLUMN()+1),IFERROR(VLOOKUP(\"Period\",INDIRECT(\"'General Data ESEF'!PP_Locale\"),INDIRECT(\"'General Data ESEF'!PP_LabelLanguageIndex\"),FALSE),\"Period\")&\"*\")+1","v":"Period 1"},{"$f":"IFERROR(VLOOKUP(\"Period\",INDIRECT(\"'General Data ESEF'!PP_Locale\"),INDIRECT(\"'General Data ESEF'!PP_LabelLanguageIndex\"),FALSE),\"Period\")&\" \"&COUNTIF(OFFSET(C1,0,-1,1,-COLUMN()+1),IFERROR(VLOOKUP(\"Period\",INDIRECT(\"'General Data ESEF'!PP_Locale\"),INDIRECT(\"'General Data ESEF'!PP_LabelLanguageIndex\"),FALSE),\"Period\")&\"*\")+1","v":"Period 2"}]
[null,null,null,{"$f":"SUBSTITUTE(\"/\"&IFERROR(INDIRECT(\"'General Data ESEF'!OperatingActivities\"),\"Operating Activities\")&\"(headers=\"&CELL(\"address\",$B$1)&\":\"&CELL(\"address\",$C$1)&\",labels=\"&CELL(\"address\",A2)&\":\"&CELL(\"address\",A4)&\",values=\"&CELL(\"address\",B2)&\":\"&CELL(\"address\",C4)&\")\",\"$\",\"\")","v":"/Operating Activities(headers=B1:C1,labels=A2:A4,values=B2:C4)"}]
[{"$f":"IFERROR(VLOOKUP(\"Cash flow from operating activities\",INDIRECT(\"'General Data ESEF'!PP_Locale\"),INDIRECT(\"'General Data ESEF'!PP_LabelLanguageIndex\"),FALSE),\"Cash flow from operating activities\")&\" \"&COUNTIF(OFFSET(A3,-1,0,-ROW()+1,1),IFERROR(VLOOKUP(\"Cash flow from operating activities\",INDIRECT(\"'General Data ESEF'!PP_Locale\"),INDIRECT(\"'General Data ESEF'!PP_LabelLanguageIndex\"),FALSE),\"Cash flow from operating activities\")&\"*\")+1","v":"Cash flow from operating activities 1"}]
[]
[null,null,null,{"$f":"SUBSTITUTE(\"/\"&IFERROR(INDIRECT(\"'General Data ESEF'!InvestingActivities\"),\"Investing Activities\")&\"(headers=\"&CELL(\"address\",$B$1)&\":\"&CELL(\"address\",$C$1)&\",labels=\"&CELL(\"address\",A5)&\":\"&CELL(\"address\",A7)&\",values=\"&CELL(\"address\",B5)&\":\"&CELL(\"address\",C7)&\")\",\"$\",\"\")","v":"/Investing Activities(headers=B1:C1,labels=A5:A7,values=B5:C7)"}]
[{"$f":"IFERROR(VLOOKUP(\"Cash flow from investing activities\",INDIRECT(\"'General Data ESEF'!PP_Locale\"),INDIRECT(\"'General Data ESEF'!PP_LabelLanguageIndex\"),FALSE),\"Cash flow from investing activities\")&\" \"&COUNTIF(OFFSET(A6,-1,0,-ROW()+1,1),IFERROR(VLOOKUP(\"Cash flow from investing activities\",INDIRECT(\"'General Data ESEF'!PP_Locale\"),INDIRECT(\"'General Data ESEF'!PP_LabelLanguageIndex\"),FALSE),\"Cash flow from investing activities\")&\"*\")+1","v":"Cash flow from investing activities 1"}]
[]
[null,null,null,{"$f":"SUBSTITUTE(\"/\"&IFERROR(INDIRECT(\"'General Data ESEF'!FinancingActivities\"),\"Financing Activities\")&\"(headers=\"&CELL(\"address\",$B$1)&\":\"&CELL(\"address\",$C$1)&\",labels=\"&CELL(\"address\",A8)&\":\"&CELL(\"address\",A10)&\",values=\"&CELL(\"address\",B8)&\":\"&CELL(\"address\",C10)&\")\",\"$\",\"\")","v":"/Financing Activities(headers=B1:C1,labels=A8:A10,values=B8:C10)"}]
[{"$f":"IFERROR(VLOOKUP(\"Cash flow from financing activities\",INDIRECT(\"'General Data ESEF'!PP_Locale\"),INDIRECT(\"'General Data ESEF'!PP_LabelLanguageIndex\"),FALSE),\"Cash flow from financing activities\")&\" \"&COUNTIF(OFFSET(A9,-1,0,-ROW()+1,1),IFERROR(VLOOKUP(\"Cash flow from financing activities\",INDIRECT(\"'General Data ESEF'!PP_Locale\"),INDIRECT(\"'General Data ESEF'!PP_LabelLanguageIndex\"),FALSE),\"Cash flow from financing activities\")&\"*\")+1","v":"Cash flow from financing activities 1"}]
[]
[null,null,null,{"$f":"SUBSTITUTE(\"/\"&IFERROR(INDIRECT(\"'General Data ESEF'!CashFlowStatement\"),\"Cash Flow Statement\")&\"(headers=\"&CELL(\"address\",$B$1)&\":\"&CELL(\"address\",$C$1)&\",labels=\"&CELL(\"address\",A11)&\":\"&CELL(\"address\",A13)&\",values=\"&CELL(\"address\",B11)&\":\"&CELL(\"address\",C13)&\")\",\"$\",\"\")","v":"/Cash Flow Statement(headers=B1:C1,labels=A11:A13,values=B11:C13)"}]
[{"$f":"IFERROR(VLOOKUP(\"Change in cash and cash equivalents\",INDIRECT(\"'General Data ESEF'!PP_Locale\"),INDIRECT(\"'General Data ESEF'!PP_LabelLanguageIndex\"),FALSE),\"Change in cash and cash equivalents\")&\" \"&COUNTIF(OFFSET(A12,-1,0,-ROW()+1,1),IFERROR(VLOOKUP(\"Change in cash and cash equivalents\",INDIRECT(\"'General Data ESEF'!PP_Locale\"),INDIRECT(\"'General Data ESEF'!PP_LabelLanguageIndex\"),FALSE),\"Change in cash and cash equivalents\")&\"*\")+1","v":"Change in cash and cash equivalents 1"}]

{"sheet":"Notes DKGAAP","index":11,"n_rows":3,"n_cols":4,"rows_kept":3,"cut":false,"hidden":false,"merged":[]}
[null,{"$f":"IFERROR(VLOOKUP(\"Period\",INDIRECT(\"'General Data ESEF'!PP_Locale\"),INDIRECT(\"'General Data ESEF'!PP_LabelLanguageIndex\"),FALSE),\"Period\")&\" \"&COUNTIF(OFFSET(B1,0,-1,1,-COLUMN()+1),IFERROR(VLOOKUP(\"Period\",INDIRECT(\"'General Data ESEF'!PP_Locale\"),INDIRECT(\"'General Data ESEF'!PP_LabelLanguageIndex\"),FALSE),\"Period\")&\"*\")+1","v":"Period 1"},{"$f":"IFERROR(VLOOKUP(\"Period\",INDIRECT(\"'General Data ESEF'!PP_Locale\"),INDIRECT(\"'General Data ESEF'!PP_LabelLanguageIndex\"),FALSE),\"Period\")&\" \"&COUNTIF(OFFSET(C1,0,-1,1,-COLUMN()+1),IFERROR(VLOOKUP(\"Period\",INDIRECT(\"'General Data ESEF'!PP_Locale\"),INDIRECT(\"'General Data ESEF'!PP_LabelLanguageIndex\"),FALSE),\"Period\")&\"*\")+1","v":"Period 2"}]
[null,null,null,{"$f":"SUBSTITUTE(\"/\"&IFERROR(INDIRECT(\"'General Data DKGAAP'!NotesDKGAAP\"),\"Notes DKGAAP\")&\"(headers=\"&CELL(\"address\",$B$1)&\":\"&CELL(\"address\",$C$1)&\",labels=\"&CELL(\"address\",A2)&\":\"&CELL(\"address\",A4)&\",values=\"&CELL(\"address\",B2)&\":\"&CELL(\"address\",C4)&\")\",\"$\",\"\")","v":"/Notes DKGAAP(headers=B1:C1,labels=A2:A4,values=B2:C4)"}]
[{"$f":"IFERROR(VLOOKUP(\"Note\",INDIRECT(\"'General Data DKGAAP'!PP_Locale\"),INDIRECT(\"'General Data DKGAAP'!PP_LabelLanguageIndex\"),FALSE),\"Note\")&\" \"&COUNTIF(OFFSET(A3,-1,0,-ROW()+1,1),IFERROR(VLOOKUP(\"Note\",INDIRECT(\"'General Data DKGAAP'!PP_Locale\"),INDIRECT(\"'General Data DKGAAP'!PP_LabelLanguageIndex\"),FALSE),\"Note\")&\"*\")+1","v":"Note 1"}]

{"sheet":"General Data_REPORT","index":12,"n_rows":8,"n_cols":2,"rows_kept":8,"cut":false,"hidden":true,"merged":[[6,0,6,1],[0,0,0,1],[1,0,1,1],[2,0,2,1],[3,0,3,1],[4,0,4,1],[5,0,5,1]]}
["If the reference in \"Cell\" starts with \"PP_\", it is because of a field in the old General Data sheet that has not been transferred to the new. Following errors can occur:"]
["1) The field is not available anymore or has been renamed"]
["2) The field is available, but the value under \"Formula\" is no longer accepted"]
["3) Feltet findes men der findes allerede en formel i feltet som er anderledes end nedenfor. Der ændres nu og da på disse formler, så hvis en eller flere henvisninger til \"PP_xxx\" indgår i formlen, har det sandsynligvis ingen betydning."]
[]
["If the reference in \"Cell\" is an ordinary cell reference (e.g. \"FrontPage!$A$1\"), it means that this cell still references the old General Data sheet and should be updated manually to reference the new. If the value in \"Formula\" refers to a \"PP_xxx\"-field, this field is either not available anymore or has been renamed."]
[]
["Cell","Formula"]